{
	"info": {
		"_postman_id": "f1fd87d5-972f-4f5e-8f10-241b2359286f",
		"name": "s32 Activity",
		"schema": "https://schema.getpostman.com/json/collection/v2.1.0/collection.json"
	},
	"item": [
		{
			"name": "home",
			"protocolProfileBehavior": {
				"disableBodyPruning": true
			},
			"request": {
				"method": "GET",
				"header": [],
				"body": {
					"mode": "raw",
					"raw": "",
					"options": {
						"raw": {
							"language": "json"
						}
					}
				},
				"url": {
					"raw": "localhost:400/",
					"host": [
						"localhost"
					],
					"port": "400",
					"path": [
						""
					]
				}
			},
			"response": []
		},
		{
			"name": "POST",
			"request": {
				"method": "GET",
				"header": []
			},
			"response": []
		},
		{
			"name": "addCourse POST",
			"request": {
				"method": "POST",
				"header": [],
				"url": {
					"raw": "localhost:4000/addcourse",
					"host": [
						"localhost"
					],
					"port": "4000",
					"path": [
						"addcourse"
					]
				}
			},
			"response": []
		},
		{
			"name": "Updated Course patch",
			"request": {
				"method": "PUT",
				"header": [],
				"url": {
					"raw": "localhost:4000/updatecourse",
					"host": [
						"localhost"
					],
					"port": "4000",
					"path": [
						"updatecourse"
					]
				}
			},
			"response": []
		},
		{
			"name": "ArchiveCourse",
			"request": {
				"method": "DELETE",
				"header": [],
				"url": {
					"raw": "localhost:4000/archiveCourses",
					"host": [
						"localhost"
					],
					"port": "4000",
					"path": [
						"archiveCourses"
					]
				}
			},
			"response": []
		}
	]
}