%YAML 1.1
%TAG !u! tag:unity3d.com,2011:
--- !u!114 &11400000
MonoBehaviour:
  m_ObjectHideFlags: 0
  m_CorrespondingSourceObject: {fileID: 0}
  m_PrefabInstance: {fileID: 0}
  m_PrefabAsset: {fileID: 0}
  m_GameObject: {fileID: 0}
  m_Enabled: 1
  m_EditorHideFlags: 0
  m_Script: {fileID: 11500000, guid: b9708d0e329dc1a45aaa3806a06ae407, type: 3}
  m_Name: 1_Longsword
  m_EditorClassIdentifier: 
  swordName: Longsword
  icon: {fileID: 21300000, guid: 6f69a15f2a04d4f4d9785ab7e50778a6, type: 3}
  goldCost: 100
  description: Longsword
  attackDamage: 1
