%YAML 1.1
%TAG !u! tag:unity3d.com,2011:
--- !u!114 &11400000
MonoBehaviour:
  m_ObjectHideFlags: 0
  m_CorrespondingSourceObject: {fileID: 0}
  m_PrefabInstance: {fileID: 0}
  m_PrefabAsset: {fileID: 0}
  m_GameObject: {fileID: 0}
  m_Enabled: 1
  m_EditorHideFlags: 0
  m_Script: {fileID: 11500000, guid: b9708d0e329dc1a45aaa3806a06ae407, type: 3}
  m_Name: 6_Broadsword
  m_EditorClassIdentifier: 
  swordName: Broadsword
  icon: {fileID: 21300000, guid: 4975e12abe4187a46924c269a3a788f1, type: 3}
  goldCost: 600
  description: Broadsword
  attackDamage: 6
