%YAML 1.1
%TAG !u! tag:unity3d.com,2011:
--- !u!29 &1
OcclusionCullingSettings:
  m_ObjectHideFlags: 0
  serializedVersion: 2
  m_OcclusionBakeSettings:
    smallestOccluder: 5
    smallestHole: 0.25
    backfaceThreshold: 100
  m_SceneGUID: 00000000000000000000000000000000
  m_OcclusionCullingData: {fileID: 0}
--- !u!104 &2
RenderSettings:
  m_ObjectHideFlags: 0
  serializedVersion: 9
  m_Fog: 0
  m_FogColor: {r: 0.5, g: 0.5, b: 0.5, a: 1}
  m_FogMode: 3
  m_FogDensity: 0.01
  m_LinearFogStart: 0
  m_LinearFogEnd: 300
  m_AmbientSkyColor: {r: 0.212, g: 0.227, b: 0.259, a: 1}
  m_AmbientEquatorColor: {r: 0.114, g: 0.125, b: 0.133, a: 1}
  m_AmbientGroundColor: {r: 0.047, g: 0.043, b: 0.035, a: 1}
  m_AmbientIntensity: 1
  m_AmbientMode: 0
  m_SubtractiveShadowColor: {r: 0.42, g: 0.478, b: 0.627, a: 1}
  m_SkyboxMaterial: {fileID: 10304, guid: 0000000000000000f000000000000000, type: 0}
  m_HaloStrength: 0.5
  m_FlareStrength: 1
  m_FlareFadeSpeed: 3
  m_HaloTexture: {fileID: 0}
  m_SpotCookie: {fileID: 10001, guid: 0000000000000000e000000000000000, type: 0}
  m_DefaultReflectionMode: 0
  m_DefaultReflectionResolution: 128
  m_ReflectionBounces: 1
  m_ReflectionIntensity: 1
  m_CustomReflection: {fileID: 0}
  m_Sun: {fileID: 0}
  m_IndirectSpecularColor: {r: 0.44785452, g: 0.49784666, b: 0.5754529, a: 1}
  m_UseRadianceAmbientProbe: 0
--- !u!157 &3
LightmapSettings:
  m_ObjectHideFlags: 0
  serializedVersion: 12
  m_GIWorkflowMode: 1
  m_GISettings:
    serializedVersion: 2
    m_BounceScale: 1
    m_IndirectOutputScale: 1
    m_AlbedoBoost: 1
    m_EnvironmentLightingMode: 0
    m_EnableBakedLightmaps: 1
    m_EnableRealtimeLightmaps: 1
  m_LightmapEditorSettings:
    serializedVersion: 12
    m_Resolution: 2
    m_BakeResolution: 40
    m_AtlasSize: 1024
    m_AO: 0
    m_AOMaxDistance: 1
    m_CompAOExponent: 1
    m_CompAOExponentDirect: 0
    m_ExtractAmbientOcclusion: 0
    m_Padding: 2
    m_LightmapParameters: {fileID: 0}
    m_LightmapsBakeMode: 1
    m_TextureCompression: 1
    m_FinalGather: 0
    m_FinalGatherFiltering: 1
    m_FinalGatherRayCount: 256
    m_ReflectionCompression: 2
    m_MixedBakeMode: 2
    m_BakeBackend: 0
    m_PVRSampling: 1
    m_PVRDirectSampleCount: 32
    m_PVRSampleCount: 500
    m_PVRBounces: 2
    m_PVREnvironmentSampleCount: 500
    m_PVREnvironmentReferencePointCount: 2048
    m_PVRFilteringMode: 2
    m_PVRDenoiserTypeDirect: 0
    m_PVRDenoiserTypeIndirect: 0
    m_PVRDenoiserTypeAO: 0
    m_PVRFilterTypeDirect: 0
    m_PVRFilterTypeIndirect: 0
    m_PVRFilterTypeAO: 0
    m_PVREnvironmentMIS: 0
    m_PVRCulling: 1
    m_PVRFilteringGaussRadiusDirect: 1
    m_PVRFilteringGaussRadiusIndirect: 5
    m_PVRFilteringGaussRadiusAO: 2
    m_PVRFilteringAtrousPositionSigmaDirect: 0.5
    m_PVRFilteringAtrousPositionSigmaIndirect: 2
    m_PVRFilteringAtrousPositionSigmaAO: 1
    m_ExportTrainingData: 0
    m_TrainingDataDestination: TrainingData
    m_LightProbeSampleCountMultiplier: 4
  m_LightingDataAsset: {fileID: 112000000, guid: 941f008f7cebffd428238b8fbb9f2f60,
    type: 2}
  m_LightingSettings: {fileID: 1821784543}
--- !u!196 &4
NavMeshSettings:
  serializedVersion: 2
  m_ObjectHideFlags: 0
  m_BuildSettings:
    serializedVersion: 2
    agentTypeID: 0
    agentRadius: 0.5
    agentHeight: 2
    agentSlope: 45
    agentClimb: 0.4
    ledgeDropHeight: 0
    maxJumpAcrossDistance: 0
    minRegionArea: 2
    manualCellSize: 0
    cellSize: 0.16666667
    manualTileSize: 0
    tileSize: 256
    accuratePlacement: 0
    maxJobWorkers: 0
    preserveTilesOutsideBounds: 0
    debug:
      m_Flags: 0
  m_NavMeshData: {fileID: 0}
--- !u!4 &47073600 stripped
Transform:
  m_CorrespondingSourceObject: {fileID: 4568489727032634, guid: 52231d642efb9b54ea6b8739d77908c5,
    type: 3}
  m_PrefabInstance: {fileID: 1745653464}
  m_PrefabAsset: {fileID: 0}
--- !u!1001 &112259264
PrefabInstance:
  m_ObjectHideFlags: 0
  serializedVersion: 2
  m_Modification:
    m_TransformParent: {fileID: 1893504798}
    m_Modifications:
    - target: {fileID: 4564655625279526, guid: 0b8ca2f9914b7f746b3ea1444786a63e, type: 3}
      propertyPath: m_RootOrder
      value: 4
      objectReference: {fileID: 0}
    - target: {fileID: 4564655625279526, guid: 0b8ca2f9914b7f746b3ea1444786a63e, type: 3}
      propertyPath: m_LocalPosition.x
      value: -2.5
      objectReference: {fileID: 0}
    - target: {fileID: 4564655625279526, guid: 0b8ca2f9914b7f746b3ea1444786a63e, type: 3}
      propertyPath: m_LocalPosition.y
      value: 0
      objectReference: {fileID: 0}
    - target: {fileID: 4564655625279526, guid: 0b8ca2f9914b7f746b3ea1444786a63e, type: 3}
      propertyPath: m_LocalPosition.z
      value: 0
      objectReference: {fileID: 0}
    - target: {fileID: 4564655625279526, guid: 0b8ca2f9914b7f746b3ea1444786a63e, type: 3}
      propertyPath: m_LocalRotation.w
      value: 0.7071067
      objectReference: {fileID: 0}
    - target: {fileID: 4564655625279526, guid: 0b8ca2f9914b7f746b3ea1444786a63e, type: 3}
      propertyPath: m_LocalRotation.x
      value: -0.7071068
      objectReference: {fileID: 0}
    - target: {fileID: 4564655625279526, guid: 0b8ca2f9914b7f746b3ea1444786a63e, type: 3}
      propertyPath: m_LocalRotation.y
      value: -0
      objectReference: {fileID: 0}
    - target: {fileID: 4564655625279526, guid: 0b8ca2f9914b7f746b3ea1444786a63e, type: 3}
      propertyPath: m_LocalRotation.z
      value: -0
      objectReference: {fileID: 0}
    - target: {fileID: 114854772269584276, guid: 0b8ca2f9914b7f746b3ea1444786a63e,
        type: 3}
      propertyPath: swordData
      value: 
      objectReference: {fileID: 11400000, guid: b96c1598353f3014e9dc473453f80192,
        type: 2}
    - target: {fileID: 114854772269584276, guid: 0b8ca2f9914b7f746b3ea1444786a63e,
        type: 3}
      propertyPath: onSwordSelect
      value: 
      objectReference: {fileID: 11400000, guid: ea9e7354f36190e4e91047fd84c3db5a,
        type: 2}
    m_RemovedComponents: []
  m_SourcePrefab: {fileID: 100100000, guid: 0b8ca2f9914b7f746b3ea1444786a63e, type: 3}
--- !u!4 &354912689 stripped
Transform:
  m_CorrespondingSourceObject: {fileID: 4564655625279526, guid: 0b8ca2f9914b7f746b3ea1444786a63e,
    type: 3}
  m_PrefabInstance: {fileID: 112259264}
  m_PrefabAsset: {fileID: 0}
--- !u!4 &730712620 stripped
Transform:
  m_CorrespondingSourceObject: {fileID: 4253070978743176, guid: 39069f295ce0e20479c06ddb8196bb35,
    type: 3}
  m_PrefabInstance: {fileID: 1773880809}
  m_PrefabAsset: {fileID: 0}
--- !u!114 &811757004 stripped
MonoBehaviour:
  m_CorrespondingSourceObject: {fileID: 114395076152756604, guid: 149c551c1f78ff844892ddc7b4591a81,
    type: 3}
  m_PrefabInstance: {fileID: 947174232}
  m_PrefabAsset: {fileID: 0}
  m_GameObject: {fileID: 0}
  m_Enabled: 1
  m_EditorHideFlags: 0
  m_Script: {fileID: 11500000, guid: 5f7201a12d95ffc409449d95f23cf332, type: 3}
  m_Name: 
  m_EditorClassIdentifier: 
--- !u!1001 &947174232
PrefabInstance:
  m_ObjectHideFlags: 0
  serializedVersion: 2
  m_Modification:
    m_TransformParent: {fileID: 0}
    m_Modifications:
    - target: {fileID: 114099244540979298, guid: 149c551c1f78ff844892ddc7b4591a81,
        type: 3}
      propertyPath: m_Sprite
      value: 
      objectReference: {fileID: 0}
    - target: {fileID: 224637272983491572, guid: 149c551c1f78ff844892ddc7b4591a81,
        type: 3}
      propertyPath: m_Pivot.x
      value: 0
      objectReference: {fileID: 0}
    - target: {fileID: 224637272983491572, guid: 149c551c1f78ff844892ddc7b4591a81,
        type: 3}
      propertyPath: m_Pivot.y
      value: 0
      objectReference: {fileID: 0}
    - target: {fileID: 224637272983491572, guid: 149c551c1f78ff844892ddc7b4591a81,
        type: 3}
      propertyPath: m_RootOrder
      value: 2
      objectReference: {fileID: 0}
    - target: {fileID: 224637272983491572, guid: 149c551c1f78ff844892ddc7b4591a81,
        type: 3}
      propertyPath: m_AnchorMax.x
      value: 0
      objectReference: {fileID: 0}
    - target: {fileID: 224637272983491572, guid: 149c551c1f78ff844892ddc7b4591a81,
        type: 3}
      propertyPath: m_AnchorMax.y
      value: 0
      objectReference: {fileID: 0}
    - target: {fileID: 224637272983491572, guid: 149c551c1f78ff844892ddc7b4591a81,
        type: 3}
      propertyPath: m_AnchorMin.x
      value: 0
      objectReference: {fileID: 0}
    - target: {fileID: 224637272983491572, guid: 149c551c1f78ff844892ddc7b4591a81,
        type: 3}
      propertyPath: m_AnchorMin.y
      value: 0
      objectReference: {fileID: 0}
    - target: {fileID: 224637272983491572, guid: 149c551c1f78ff844892ddc7b4591a81,
        type: 3}
      propertyPath: m_SizeDelta.x
      value: 0
      objectReference: {fileID: 0}
    - target: {fileID: 224637272983491572, guid: 149c551c1f78ff844892ddc7b4591a81,
        type: 3}
      propertyPath: m_SizeDelta.y
      value: 0
      objectReference: {fileID: 0}
    - target: {fileID: 224637272983491572, guid: 149c551c1f78ff844892ddc7b4591a81,
        type: 3}
      propertyPath: m_LocalPosition.x
      value: 0
      objectReference: {fileID: 0}
    - target: {fileID: 224637272983491572, guid: 149c551c1f78ff844892ddc7b4591a81,
        type: 3}
      propertyPath: m_LocalPosition.y
      value: 0
      objectReference: {fileID: 0}
    - target: {fileID: 224637272983491572, guid: 149c551c1f78ff844892ddc7b4591a81,
        type: 3}
      propertyPath: m_LocalPosition.z
      value: 0
      objectReference: {fileID: 0}
    - target: {fileID: 224637272983491572, guid: 149c551c1f78ff844892ddc7b4591a81,
        type: 3}
      propertyPath: m_LocalRotation.w
      value: 1
      objectReference: {fileID: 0}
    - target: {fileID: 224637272983491572, guid: 149c551c1f78ff844892ddc7b4591a81,
        type: 3}
      propertyPath: m_LocalRotation.x
      value: 0
      objectReference: {fileID: 0}
    - target: {fileID: 224637272983491572, guid: 149c551c1f78ff844892ddc7b4591a81,
        type: 3}
      propertyPath: m_LocalRotation.y
      value: 0
      objectReference: {fileID: 0}
    - target: {fileID: 224637272983491572, guid: 149c551c1f78ff844892ddc7b4591a81,
        type: 3}
      propertyPath: m_LocalRotation.z
      value: 0
      objectReference: {fileID: 0}
    - target: {fileID: 224637272983491572, guid: 149c551c1f78ff844892ddc7b4591a81,
        type: 3}
      propertyPath: m_AnchoredPosition.x
      value: 0
      objectReference: {fileID: 0}
    - target: {fileID: 224637272983491572, guid: 149c551c1f78ff844892ddc7b4591a81,
        type: 3}
      propertyPath: m_AnchoredPosition.y
      value: 0
      objectReference: {fileID: 0}
    m_RemovedComponents: []
  m_SourcePrefab: {fileID: 100100000, guid: 149c551c1f78ff844892ddc7b4591a81, type: 3}
--- !u!4 &948752558 stripped
Transform:
  m_CorrespondingSourceObject: {fileID: 4360823754290682, guid: dca4a46237666594aae4c02dc49e9ed3,
    type: 3}
  m_PrefabInstance: {fileID: 1506613288}
  m_PrefabAsset: {fileID: 0}
--- !u!114 &956008995 stripped
MonoBehaviour:
  m_CorrespondingSourceObject: {fileID: 114099244540979298, guid: 149c551c1f78ff844892ddc7b4591a81,
    type: 3}
  m_PrefabInstance: {fileID: 947174232}
  m_PrefabAsset: {fileID: 0}
  m_GameObject: {fileID: 0}
  m_Enabled: 1
  m_EditorHideFlags: 0
  m_Script: {fileID: 11500000, guid: fe87c0e1cc204ed48ad3b37840f39efc, type: 3}
  m_Name: 
  m_EditorClassIdentifier: 
--- !u!1001 &985363700
PrefabInstance:
  m_ObjectHideFlags: 0
  serializedVersion: 2
  m_Modification:
    m_TransformParent: {fileID: 1893504798}
    m_Modifications:
    - target: {fileID: 4933422604388220, guid: c1005caa6941a45418635cdf0f1139ea, type: 3}
      propertyPath: m_RootOrder
      value: 3
      objectReference: {fileID: 0}
    - target: {fileID: 4933422604388220, guid: c1005caa6941a45418635cdf0f1139ea, type: 3}
      propertyPath: m_LocalPosition.x
      value: 0
      objectReference: {fileID: 0}
    - target: {fileID: 4933422604388220, guid: c1005caa6941a45418635cdf0f1139ea, type: 3}
      propertyPath: m_LocalPosition.y
      value: 0
      objectReference: {fileID: 0}
    - target: {fileID: 4933422604388220, guid: c1005caa6941a45418635cdf0f1139ea, type: 3}
      propertyPath: m_LocalPosition.z
      value: 0
      objectReference: {fileID: 0}
    - target: {fileID: 4933422604388220, guid: c1005caa6941a45418635cdf0f1139ea, type: 3}
      propertyPath: m_LocalRotation.w
      value: 0.7071067
      objectReference: {fileID: 0}
    - target: {fileID: 4933422604388220, guid: c1005caa6941a45418635cdf0f1139ea, type: 3}
      propertyPath: m_LocalRotation.x
      value: -0.7071068
      objectReference: {fileID: 0}
    - target: {fileID: 4933422604388220, guid: c1005caa6941a45418635cdf0f1139ea, type: 3}
      propertyPath: m_LocalRotation.y
      value: -0
      objectReference: {fileID: 0}
    - target: {fileID: 4933422604388220, guid: c1005caa6941a45418635cdf0f1139ea, type: 3}
      propertyPath: m_LocalRotation.z
      value: -0
      objectReference: {fileID: 0}
    - target: {fileID: 114329817378986084, guid: c1005caa6941a45418635cdf0f1139ea,
        type: 3}
      propertyPath: swordData
      value: 
      objectReference: {fileID: 11400000, guid: 56b014183da506943a6627c0501131a5,
        type: 2}
    - target: {fileID: 114329817378986084, guid: c1005caa6941a45418635cdf0f1139ea,
        type: 3}
      propertyPath: onSwordSelect
      value: 
      objectReference: {fileID: 11400000, guid: 57e44667d23e0614daa50c2d02cbadd0,
        type: 2}
    m_RemovedComponents: []
  m_SourcePrefab: {fileID: 100100000, guid: c1005caa6941a45418635cdf0f1139ea, type: 3}
--- !u!114 &1006315505 stripped
MonoBehaviour:
  m_CorrespondingSourceObject: {fileID: 114181759690190502, guid: 149c551c1f78ff844892ddc7b4591a81,
    type: 3}
  m_PrefabInstance: {fileID: 947174232}
  m_PrefabAsset: {fileID: 0}
  m_GameObject: {fileID: 0}
  m_Enabled: 1
  m_EditorHideFlags: 0
  m_Script: {fileID: 11500000, guid: 5f7201a12d95ffc409449d95f23cf332, type: 3}
  m_Name: 
  m_EditorClassIdentifier: 
--- !u!1 &1038314029 stripped
GameObject:
  m_CorrespondingSourceObject: {fileID: 1560570793081158, guid: 149c551c1f78ff844892ddc7b4591a81,
    type: 3}
  m_PrefabInstance: {fileID: 947174232}
  m_PrefabAsset: {fileID: 0}
--- !u!114 &1038314034
MonoBehaviour:
  m_ObjectHideFlags: 0
  m_CorrespondingSourceObject: {fileID: 0}
  m_PrefabInstance: {fileID: 0}
  m_PrefabAsset: {fileID: 0}
  m_GameObject: {fileID: 1038314029}
  m_Enabled: 1
  m_EditorHideFlags: 0
  m_Script: {fileID: 11500000, guid: fc84c8f025cf30546ac3d994c8d77571, type: 3}
  m_Name: 
  m_EditorClassIdentifier: 
  gameEvent: {fileID: 11400000, guid: c7e6bf7eafdeb324db759baf7a41f8c2, type: 2}
  response:
    m_PersistentCalls:
      m_Calls:
      - m_Target: {fileID: 1038314041}
        m_TargetAssemblyTypeName: SwordMerchant, Assembly-CSharp
        m_MethodName: UpdateDisplayUI
        m_Mode: 2
        m_Arguments:
          m_ObjectArgument: {fileID: 11400000, guid: 149b4d42ad6a14e418ceef14e22e56b7,
            type: 2}
          m_ObjectArgumentAssemblyTypeName: SwordData, Assembly-CSharp
          m_IntArgument: 0
          m_FloatArgument: 0
          m_StringArgument: 
          m_BoolArgument: 0
        m_CallState: 2
--- !u!114 &1038314035
MonoBehaviour:
  m_ObjectHideFlags: 0
  m_CorrespondingSourceObject: {fileID: 0}
  m_PrefabInstance: {fileID: 0}
  m_PrefabAsset: {fileID: 0}
  m_GameObject: {fileID: 1038314029}
  m_Enabled: 1
  m_EditorHideFlags: 0
  m_Script: {fileID: 11500000, guid: fc84c8f025cf30546ac3d994c8d77571, type: 3}
  m_Name: 
  m_EditorClassIdentifier: 
  gameEvent: {fileID: 11400000, guid: 726abc388be0e5c4d9b9aa9e75f059b3, type: 2}
  response:
    m_PersistentCalls:
      m_Calls:
      - m_Target: {fileID: 1038314041}
        m_TargetAssemblyTypeName: SwordMerchant, Assembly-CSharp
        m_MethodName: UpdateDisplayUI
        m_Mode: 2
        m_Arguments:
          m_ObjectArgument: {fileID: 11400000, guid: 19cc0ffc6a0077c4ca37fe5951df8a06,
            type: 2}
          m_ObjectArgumentAssemblyTypeName: SwordData, Assembly-CSharp
          m_IntArgument: 0
          m_FloatArgument: 0
          m_StringArgument: 
          m_BoolArgument: 0
        m_CallState: 2
--- !u!114 &1038314036
MonoBehaviour:
  m_ObjectHideFlags: 0
  m_CorrespondingSourceObject: {fileID: 0}
  m_PrefabInstance: {fileID: 0}
  m_PrefabAsset: {fileID: 0}
  m_GameObject: {fileID: 1038314029}
  m_Enabled: 1
  m_EditorHideFlags: 0
  m_Script: {fileID: 11500000, guid: fc84c8f025cf30546ac3d994c8d77571, type: 3}
  m_Name: 
  m_EditorClassIdentifier: 
  gameEvent: {fileID: 11400000, guid: ea9e7354f36190e4e91047fd84c3db5a, type: 2}
  response:
    m_PersistentCalls:
      m_Calls:
      - m_Target: {fileID: 1038314041}
        m_TargetAssemblyTypeName: SwordMerchant, Assembly-CSharp
        m_MethodName: UpdateDisplayUI
        m_Mode: 2
        m_Arguments:
          m_ObjectArgument: {fileID: 11400000, guid: b96c1598353f3014e9dc473453f80192,
            type: 2}
          m_ObjectArgumentAssemblyTypeName: SwordData, Assembly-CSharp
          m_IntArgument: 0
          m_FloatArgument: 0
          m_StringArgument: 
          m_BoolArgument: 0
        m_CallState: 2
--- !u!114 &1038314037
MonoBehaviour:
  m_ObjectHideFlags: 0
  m_CorrespondingSourceObject: {fileID: 0}
  m_PrefabInstance: {fileID: 0}
  m_PrefabAsset: {fileID: 0}
  m_GameObject: {fileID: 1038314029}
  m_Enabled: 1
  m_EditorHideFlags: 0
  m_Script: {fileID: 11500000, guid: fc84c8f025cf30546ac3d994c8d77571, type: 3}
  m_Name: 
  m_EditorClassIdentifier: 
  gameEvent: {fileID: 11400000, guid: 57e44667d23e0614daa50c2d02cbadd0, type: 2}
  response:
    m_PersistentCalls:
      m_Calls:
      - m_Target: {fileID: 1038314041}
        m_TargetAssemblyTypeName: SwordMerchant, Assembly-CSharp
        m_MethodName: UpdateDisplayUI
        m_Mode: 2
        m_Arguments:
          m_ObjectArgument: {fileID: 11400000, guid: 56b014183da506943a6627c0501131a5,
            type: 2}
          m_ObjectArgumentAssemblyTypeName: SwordData, Assembly-CSharp
          m_IntArgument: 0
          m_FloatArgument: 0
          m_StringArgument: 
          m_BoolArgument: 0
        m_CallState: 2
--- !u!114 &1038314038
MonoBehaviour:
  m_ObjectHideFlags: 0
  m_CorrespondingSourceObject: {fileID: 0}
  m_PrefabInstance: {fileID: 0}
  m_PrefabAsset: {fileID: 0}
  m_GameObject: {fileID: 1038314029}
  m_Enabled: 1
  m_EditorHideFlags: 0
  m_Script: {fileID: 11500000, guid: fc84c8f025cf30546ac3d994c8d77571, type: 3}
  m_Name: 
  m_EditorClassIdentifier: 
  gameEvent: {fileID: 11400000, guid: 0c289bb4f482899439be628809a36a19, type: 2}
  response:
    m_PersistentCalls:
      m_Calls:
      - m_Target: {fileID: 1038314041}
        m_TargetAssemblyTypeName: SwordMerchant, Assembly-CSharp
        m_MethodName: UpdateDisplayUI
        m_Mode: 2
        m_Arguments:
          m_ObjectArgument: {fileID: 11400000, guid: d1125e1f4ca296e47a3ed758a85b9187,
            type: 2}
          m_ObjectArgumentAssemblyTypeName: SwordData, Assembly-CSharp
          m_IntArgument: 0
          m_FloatArgument: 0
          m_StringArgument: 
          m_BoolArgument: 0
        m_CallState: 2
--- !u!114 &1038314039
MonoBehaviour:
  m_ObjectHideFlags: 0
  m_CorrespondingSourceObject: {fileID: 0}
  m_PrefabInstance: {fileID: 0}
  m_PrefabAsset: {fileID: 0}
  m_GameObject: {fileID: 1038314029}
  m_Enabled: 1
  m_EditorHideFlags: 0
  m_Script: {fileID: 11500000, guid: fc84c8f025cf30546ac3d994c8d77571, type: 3}
  m_Name: 
  m_EditorClassIdentifier: 
  gameEvent: {fileID: 11400000, guid: 141ae7c8712f27243ba26a37fd94dd80, type: 2}
  response:
    m_PersistentCalls:
      m_Calls:
      - m_Target: {fileID: 1038314041}
        m_TargetAssemblyTypeName: SwordMerchant, Assembly-CSharp
        m_MethodName: UpdateDisplayUI
        m_Mode: 2
        m_Arguments:
          m_ObjectArgument: {fileID: 11400000, guid: c5b814d1a919ba8479742d1ef2531bf6,
            type: 2}
          m_ObjectArgumentAssemblyTypeName: SwordData, Assembly-CSharp
          m_IntArgument: 0
          m_FloatArgument: 0
          m_StringArgument: 
          m_BoolArgument: 0
        m_CallState: 2
--- !u!114 &1038314040
MonoBehaviour:
  m_ObjectHideFlags: 0
  m_CorrespondingSourceObject: {fileID: 0}
  m_PrefabInstance: {fileID: 0}
  m_PrefabAsset: {fileID: 0}
  m_GameObject: {fileID: 1038314029}
  m_Enabled: 1
  m_EditorHideFlags: 0
  m_Script: {fileID: 11500000, guid: fc84c8f025cf30546ac3d994c8d77571, type: 3}
  m_Name: 
  m_EditorClassIdentifier: 
  gameEvent: {fileID: 11400000, guid: 2c4b53cfece838f49892abaa67166460, type: 2}
  response:
    m_PersistentCalls:
      m_Calls:
      - m_Target: {fileID: 1038314041}
        m_TargetAssemblyTypeName: SwordMerchant, Assembly-CSharp
        m_MethodName: UpdateDisplayUI
        m_Mode: 2
        m_Arguments:
          m_ObjectArgument: {fileID: 11400000, guid: 6e8a05b02b05f2e468f2ab9e91adba06,
            type: 2}
          m_ObjectArgumentAssemblyTypeName: SwordData, Assembly-CSharp
          m_IntArgument: 0
          m_FloatArgument: 0
          m_StringArgument: 
          m_BoolArgument: 0
        m_CallState: 2
--- !u!114 &1038314041
MonoBehaviour:
  m_ObjectHideFlags: 0
  m_CorrespondingSourceObject: {fileID: 0}
  m_PrefabInstance: {fileID: 0}
  m_PrefabAsset: {fileID: 0}
  m_GameObject: {fileID: 1038314029}
  m_Enabled: 1
  m_EditorHideFlags: 0
  m_Script: {fileID: 11500000, guid: ffc9d01d62ccee44cafe61883adb835f, type: 3}
  m_Name: 
  m_EditorClassIdentifier: 
  swordName: {fileID: 1006315505}
  description: {fileID: 811757004}
  icon: {fileID: 956008995}
  goldCost: {fileID: 1771661582}
  attackDamage: {fileID: 1699880008}
--- !u!4 &1314794256 stripped
Transform:
  m_CorrespondingSourceObject: {fileID: 4452291970521904, guid: b8bc53f0eae47e34db6ca6fe84e1055c,
    type: 3}
  m_PrefabInstance: {fileID: 1882356582}
  m_PrefabAsset: {fileID: 0}
--- !u!1001 &1419112242
PrefabInstance:
  m_ObjectHideFlags: 0
  serializedVersion: 2
  m_Modification:
    m_TransformParent: {fileID: 0}
    m_Modifications:
    - target: {fileID: 4548444839775354, guid: 1750ffb28480f0e40b65d0500e675771, type: 3}
      propertyPath: m_RootOrder
      value: 0
      objectReference: {fileID: 0}
    - target: {fileID: 4548444839775354, guid: 1750ffb28480f0e40b65d0500e675771, type: 3}
      propertyPath: m_LocalPosition.x
      value: 0
      objectReference: {fileID: 0}
    - target: {fileID: 4548444839775354, guid: 1750ffb28480f0e40b65d0500e675771, type: 3}
      propertyPath: m_LocalPosition.y
      value: 1
      objectReference: {fileID: 0}
    - target: {fileID: 4548444839775354, guid: 1750ffb28480f0e40b65d0500e675771, type: 3}
      propertyPath: m_LocalPosition.z
      value: 15
      objectReference: {fileID: 0}
    - target: {fileID: 4548444839775354, guid: 1750ffb28480f0e40b65d0500e675771, type: 3}
      propertyPath: m_LocalRotation.w
      value: 0
      objectReference: {fileID: 0}
    - target: {fileID: 4548444839775354, guid: 1750ffb28480f0e40b65d0500e675771, type: 3}
      propertyPath: m_LocalRotation.x
      value: 0
      objectReference: {fileID: 0}
    - target: {fileID: 4548444839775354, guid: 1750ffb28480f0e40b65d0500e675771, type: 3}
      propertyPath: m_LocalRotation.y
      value: 1
      objectReference: {fileID: 0}
    - target: {fileID: 4548444839775354, guid: 1750ffb28480f0e40b65d0500e675771, type: 3}
      propertyPath: m_LocalRotation.z
      value: 0
      objectReference: {fileID: 0}
    m_RemovedComponents: []
  m_SourcePrefab: {fileID: 100100000, guid: 1750ffb28480f0e40b65d0500e675771, type: 3}
--- !u!1001 &1496437134
PrefabInstance:
  m_ObjectHideFlags: 0
  serializedVersion: 2
  m_Modification:
    m_TransformParent: {fileID: 1893504798}
    m_Modifications:
    - target: {fileID: 4196808307524600, guid: 5702e839c26040d42b40429b7dbb89cc, type: 3}
      propertyPath: m_RootOrder
      value: 2
      objectReference: {fileID: 0}
    - target: {fileID: 4196808307524600, guid: 5702e839c26040d42b40429b7dbb89cc, type: 3}
      propertyPath: m_LocalPosition.x
      value: 2.5
      objectReference: {fileID: 0}
    - target: {fileID: 4196808307524600, guid: 5702e839c26040d42b40429b7dbb89cc, type: 3}
      propertyPath: m_LocalPosition.y
      value: 0
      objectReference: {fileID: 0}
    - target: {fileID: 4196808307524600, guid: 5702e839c26040d42b40429b7dbb89cc, type: 3}
      propertyPath: m_LocalPosition.z
      value: 0
      objectReference: {fileID: 0}
    - target: {fileID: 4196808307524600, guid: 5702e839c26040d42b40429b7dbb89cc, type: 3}
      propertyPath: m_LocalRotation.w
      value: 0.7071067
      objectReference: {fileID: 0}
    - target: {fileID: 4196808307524600, guid: 5702e839c26040d42b40429b7dbb89cc, type: 3}
      propertyPath: m_LocalRotation.x
      value: -0.7071068
      objectReference: {fileID: 0}
    - target: {fileID: 4196808307524600, guid: 5702e839c26040d42b40429b7dbb89cc, type: 3}
      propertyPath: m_LocalRotation.y
      value: -0
      objectReference: {fileID: 0}
    - target: {fileID: 4196808307524600, guid: 5702e839c26040d42b40429b7dbb89cc, type: 3}
      propertyPath: m_LocalRotation.z
      value: -0
      objectReference: {fileID: 0}
    - target: {fileID: 114919863713329672, guid: 5702e839c26040d42b40429b7dbb89cc,
        type: 3}
      propertyPath: swordData
      value: 
      objectReference: {fileID: 11400000, guid: d1125e1f4ca296e47a3ed758a85b9187,
        type: 2}
    - target: {fileID: 114919863713329672, guid: 5702e839c26040d42b40429b7dbb89cc,
        type: 3}
      propertyPath: onSwordSelect
      value: 
      objectReference: {fileID: 11400000, guid: 0c289bb4f482899439be628809a36a19,
        type: 2}
    m_RemovedComponents: []
  m_SourcePrefab: {fileID: 100100000, guid: 5702e839c26040d42b40429b7dbb89cc, type: 3}
--- !u!1001 &1506613288
PrefabInstance:
  m_ObjectHideFlags: 0
  serializedVersion: 2
  m_Modification:
    m_TransformParent: {fileID: 1893504798}
    m_Modifications:
    - target: {fileID: 4360823754290682, guid: dca4a46237666594aae4c02dc49e9ed3, type: 3}
      propertyPath: m_RootOrder
      value: 5
      objectReference: {fileID: 0}
    - target: {fileID: 4360823754290682, guid: dca4a46237666594aae4c02dc49e9ed3, type: 3}
      propertyPath: m_LocalPosition.x
      value: -5
      objectReference: {fileID: 0}
    - target: {fileID: 4360823754290682, guid: dca4a46237666594aae4c02dc49e9ed3, type: 3}
      propertyPath: m_LocalPosition.y
      value: 0
      objectReference: {fileID: 0}
    - target: {fileID: 4360823754290682, guid: dca4a46237666594aae4c02dc49e9ed3, type: 3}
      propertyPath: m_LocalPosition.z
      value: 0
      objectReference: {fileID: 0}
    - target: {fileID: 4360823754290682, guid: dca4a46237666594aae4c02dc49e9ed3, type: 3}
      propertyPath: m_LocalRotation.w
      value: 0.7071067
      objectReference: {fileID: 0}
    - target: {fileID: 4360823754290682, guid: dca4a46237666594aae4c02dc49e9ed3, type: 3}
      propertyPath: m_LocalRotation.x
      value: -0.7071068
      objectReference: {fileID: 0}
    - target: {fileID: 4360823754290682, guid: dca4a46237666594aae4c02dc49e9ed3, type: 3}
      propertyPath: m_LocalRotation.y
      value: -0
      objectReference: {fileID: 0}
    - target: {fileID: 4360823754290682, guid: dca4a46237666594aae4c02dc49e9ed3, type: 3}
      propertyPath: m_LocalRotation.z
      value: -0
      objectReference: {fileID: 0}
    - target: {fileID: 114889108461879984, guid: dca4a46237666594aae4c02dc49e9ed3,
        type: 3}
      propertyPath: swordData
      value: 
      objectReference: {fileID: 11400000, guid: 19cc0ffc6a0077c4ca37fe5951df8a06,
        type: 2}
    - target: {fileID: 114889108461879984, guid: dca4a46237666594aae4c02dc49e9ed3,
        type: 3}
      propertyPath: onSwordSelect
      value: 
      objectReference: {fileID: 11400000, guid: 726abc388be0e5c4d9b9aa9e75f059b3,
        type: 2}
    m_RemovedComponents: []
  m_SourcePrefab: {fileID: 100100000, guid: dca4a46237666594aae4c02dc49e9ed3, type: 3}
--- !u!4 &1545192334 stripped
Transform:
  m_CorrespondingSourceObject: {fileID: 4196808307524600, guid: 5702e839c26040d42b40429b7dbb89cc,
    type: 3}
  m_PrefabInstance: {fileID: 1496437134}
  m_PrefabAsset: {fileID: 0}
--- !u!4 &1671477898 stripped
Transform:
  m_CorrespondingSourceObject: {fileID: 4933422604388220, guid: c1005caa6941a45418635cdf0f1139ea,
    type: 3}
  m_PrefabInstance: {fileID: 985363700}
  m_PrefabAsset: {fileID: 0}
--- !u!114 &1699880008 stripped
MonoBehaviour:
  m_CorrespondingSourceObject: {fileID: 114819868484012288, guid: 149c551c1f78ff844892ddc7b4591a81,
    type: 3}
  m_PrefabInstance: {fileID: 947174232}
  m_PrefabAsset: {fileID: 0}
  m_GameObject: {fileID: 0}
  m_Enabled: 1
  m_EditorHideFlags: 0
  m_Script: {fileID: 11500000, guid: 5f7201a12d95ffc409449d95f23cf332, type: 3}
  m_Name: 
  m_EditorClassIdentifier: 
--- !u!1001 &1745653464
PrefabInstance:
  m_ObjectHideFlags: 0
  serializedVersion: 2
  m_Modification:
    m_TransformParent: {fileID: 1893504798}
    m_Modifications:
    - target: {fileID: 4568489727032634, guid: 52231d642efb9b54ea6b8739d77908c5, type: 3}
      propertyPath: m_RootOrder
      value: 1
      objectReference: {fileID: 0}
    - target: {fileID: 4568489727032634, guid: 52231d642efb9b54ea6b8739d77908c5, type: 3}
      propertyPath: m_LocalPosition.x
      value: 5
      objectReference: {fileID: 0}
    - target: {fileID: 4568489727032634, guid: 52231d642efb9b54ea6b8739d77908c5, type: 3}
      propertyPath: m_LocalPosition.y
      value: 0
      objectReference: {fileID: 0}
    - target: {fileID: 4568489727032634, guid: 52231d642efb9b54ea6b8739d77908c5, type: 3}
      propertyPath: m_LocalPosition.z
      value: 0
      objectReference: {fileID: 0}
    - target: {fileID: 4568489727032634, guid: 52231d642efb9b54ea6b8739d77908c5, type: 3}
      propertyPath: m_LocalRotation.w
      value: 0.7071067
      objectReference: {fileID: 0}
    - target: {fileID: 4568489727032634, guid: 52231d642efb9b54ea6b8739d77908c5, type: 3}
      propertyPath: m_LocalRotation.x
      value: -0.7071068
      objectReference: {fileID: 0}
    - target: {fileID: 4568489727032634, guid: 52231d642efb9b54ea6b8739d77908c5, type: 3}
      propertyPath: m_LocalRotation.y
      value: -0
      objectReference: {fileID: 0}
    - target: {fileID: 4568489727032634, guid: 52231d642efb9b54ea6b8739d77908c5, type: 3}
      propertyPath: m_LocalRotation.z
      value: -0
      objectReference: {fileID: 0}
    - target: {fileID: 114197732231314864, guid: 52231d642efb9b54ea6b8739d77908c5,
        type: 3}
      propertyPath: swordData
      value: 
      objectReference: {fileID: 11400000, guid: c5b814d1a919ba8479742d1ef2531bf6,
        type: 2}
    - target: {fileID: 114197732231314864, guid: 52231d642efb9b54ea6b8739d77908c5,
        type: 3}
      propertyPath: onSwordSelect
      value: 
      objectReference: {fileID: 11400000, guid: 141ae7c8712f27243ba26a37fd94dd80,
        type: 2}
    m_RemovedComponents: []
  m_SourcePrefab: {fileID: 100100000, guid: 52231d642efb9b54ea6b8739d77908c5, type: 3}
--- !u!114 &1771661582 stripped
MonoBehaviour:
  m_CorrespondingSourceObject: {fileID: 114096612776099566, guid: 149c551c1f78ff844892ddc7b4591a81,
    type: 3}
  m_PrefabInstance: {fileID: 947174232}
  m_PrefabAsset: {fileID: 0}
  m_GameObject: {fileID: 0}
  m_Enabled: 1
  m_EditorHideFlags: 0
  m_Script: {fileID: 11500000, guid: 5f7201a12d95ffc409449d95f23cf332, type: 3}
  m_Name: 
  m_EditorClassIdentifier: 
--- !u!1001 &1773880809
PrefabInstance:
  m_ObjectHideFlags: 0
  serializedVersion: 2
  m_Modification:
    m_TransformParent: {fileID: 1893504798}
    m_Modifications:
    - target: {fileID: 4253070978743176, guid: 39069f295ce0e20479c06ddb8196bb35, type: 3}
      propertyPath: m_RootOrder
      value: 0
      objectReference: {fileID: 0}
    - target: {fileID: 4253070978743176, guid: 39069f295ce0e20479c06ddb8196bb35, type: 3}
      propertyPath: m_LocalPosition.x
      value: 7.5
      objectReference: {fileID: 0}
    - target: {fileID: 4253070978743176, guid: 39069f295ce0e20479c06ddb8196bb35, type: 3}
      propertyPath: m_LocalPosition.y
      value: 0
      objectReference: {fileID: 0}
    - target: {fileID: 4253070978743176, guid: 39069f295ce0e20479c06ddb8196bb35, type: 3}
      propertyPath: m_LocalPosition.z
      value: 0
      objectReference: {fileID: 0}
    - target: {fileID: 4253070978743176, guid: 39069f295ce0e20479c06ddb8196bb35, type: 3}
      propertyPath: m_LocalRotation.w
      value: 0.7071067
      objectReference: {fileID: 0}
    - target: {fileID: 4253070978743176, guid: 39069f295ce0e20479c06ddb8196bb35, type: 3}
      propertyPath: m_LocalRotation.x
      value: -0.7071068
      objectReference: {fileID: 0}
    - target: {fileID: 4253070978743176, guid: 39069f295ce0e20479c06ddb8196bb35, type: 3}
      propertyPath: m_LocalRotation.y
      value: -0
      objectReference: {fileID: 0}
    - target: {fileID: 4253070978743176, guid: 39069f295ce0e20479c06ddb8196bb35, type: 3}
      propertyPath: m_LocalRotation.z
      value: -0
      objectReference: {fileID: 0}
    - target: {fileID: 114602543209253182, guid: 39069f295ce0e20479c06ddb8196bb35,
        type: 3}
      propertyPath: swordData
      value: 
      objectReference: {fileID: 11400000, guid: 6e8a05b02b05f2e468f2ab9e91adba06,
        type: 2}
    - target: {fileID: 114602543209253182, guid: 39069f295ce0e20479c06ddb8196bb35,
        type: 3}
      propertyPath: onSwordSelect
      value: 
      objectReference: {fileID: 11400000, guid: 2c4b53cfece838f49892abaa67166460,
        type: 2}
    m_RemovedComponents: []
  m_SourcePrefab: {fileID: 100100000, guid: 39069f295ce0e20479c06ddb8196bb35, type: 3}
--- !u!850595691 &1821784543
LightingSettings:
  m_ObjectHideFlags: 0
  m_CorrespondingSourceObject: {fileID: 0}
  m_PrefabInstance: {fileID: 0}
  m_PrefabAsset: {fileID: 0}
  m_Name: Settings.lighting
  serializedVersion: 3
  m_GIWorkflowMode: 1
  m_EnableBakedLightmaps: 1
  m_EnableRealtimeLightmaps: 1
  m_RealtimeEnvironmentLighting: 1
  m_BounceScale: 1
  m_AlbedoBoost: 1
  m_IndirectOutputScale: 1
  m_UsingShadowmask: 1
  m_BakeBackend: 0
  m_LightmapMaxSize: 1024
  m_BakeResolution: 40
  m_Padding: 2
  m_TextureCompression: 1
  m_AO: 0
  m_AOMaxDistance: 1
  m_CompAOExponent: 1
  m_CompAOExponentDirect: 0
  m_ExtractAO: 0
  m_MixedBakeMode: 2
  m_LightmapsBakeMode: 1
  m_FilterMode: 1
  m_LightmapParameters: {fileID: 15204, guid: 0000000000000000f000000000000000, type: 0}
  m_ExportTrainingData: 0
  m_TrainingDataDestination: TrainingData
  m_RealtimeResolution: 2
  m_ForceWhiteAlbedo: 0
  m_ForceUpdates: 0
  m_FinalGather: 0
  m_FinalGatherRayCount: 256
  m_FinalGatherFiltering: 1
  m_PVRCulling: 1
  m_PVRSampling: 1
  m_PVRDirectSampleCount: 32
  m_PVRSampleCount: 500
  m_PVREnvironmentSampleCount: 500
  m_PVREnvironmentReferencePointCount: 2048
  m_LightProbeSampleCountMultiplier: 4
  m_PVRBounces: 2
  m_PVRMinBounces: 2
  m_PVREnvironmentMIS: 0
  m_PVRFilteringMode: 2
  m_PVRDenoiserTypeDirect: 0
  m_PVRDenoiserTypeIndirect: 0
  m_PVRDenoiserTypeAO: 0
  m_PVRFilterTypeDirect: 0
  m_PVRFilterTypeIndirect: 0
  m_PVRFilterTypeAO: 0
  m_PVRFilteringGaussRadiusDirect: 1
  m_PVRFilteringGaussRadiusIndirect: 5
  m_PVRFilteringGaussRadiusAO: 2
  m_PVRFilteringAtrousPositionSigmaDirect: 0.5
  m_PVRFilteringAtrousPositionSigmaIndirect: 2
  m_PVRFilteringAtrousPositionSigmaAO: 1
--- !u!1001 &1882356582
PrefabInstance:
  m_ObjectHideFlags: 0
  serializedVersion: 2
  m_Modification:
    m_TransformParent: {fileID: 1893504798}
    m_Modifications:
    - target: {fileID: 4452291970521904, guid: b8bc53f0eae47e34db6ca6fe84e1055c, type: 3}
      propertyPath: m_RootOrder
      value: 6
      objectReference: {fileID: 0}
    - target: {fileID: 4452291970521904, guid: b8bc53f0eae47e34db6ca6fe84e1055c, type: 3}
      propertyPath: m_LocalPosition.x
      value: -7.5
      objectReference: {fileID: 0}
    - target: {fileID: 4452291970521904, guid: b8bc53f0eae47e34db6ca6fe84e1055c, type: 3}
      propertyPath: m_LocalPosition.y
      value: 0
      objectReference: {fileID: 0}
    - target: {fileID: 4452291970521904, guid: b8bc53f0eae47e34db6ca6fe84e1055c, type: 3}
      propertyPath: m_LocalPosition.z
      value: 0
      objectReference: {fileID: 0}
    - target: {fileID: 4452291970521904, guid: b8bc53f0eae47e34db6ca6fe84e1055c, type: 3}
      propertyPath: m_LocalRotation.w
      value: 0.7071067
      objectReference: {fileID: 0}
    - target: {fileID: 4452291970521904, guid: b8bc53f0eae47e34db6ca6fe84e1055c, type: 3}
      propertyPath: m_LocalRotation.x
      value: -0.7071068
      objectReference: {fileID: 0}
    - target: {fileID: 4452291970521904, guid: b8bc53f0eae47e34db6ca6fe84e1055c, type: 3}
      propertyPath: m_LocalRotation.y
      value: -0
      objectReference: {fileID: 0}
    - target: {fileID: 4452291970521904, guid: b8bc53f0eae47e34db6ca6fe84e1055c, type: 3}
      propertyPath: m_LocalRotation.z
      value: -0
      objectReference: {fileID: 0}
    - target: {fileID: 114838149804592962, guid: b8bc53f0eae47e34db6ca6fe84e1055c,
        type: 3}
      propertyPath: swordData
      value: 
      objectReference: {fileID: 11400000, guid: 149b4d42ad6a14e418ceef14e22e56b7,
        type: 2}
    - target: {fileID: 114838149804592962, guid: b8bc53f0eae47e34db6ca6fe84e1055c,
        type: 3}
      propertyPath: onSwordSelect
      value: 
      objectReference: {fileID: 11400000, guid: c7e6bf7eafdeb324db759baf7a41f8c2,
        type: 2}
    m_RemovedComponents: []
  m_SourcePrefab: {fileID: 100100000, guid: b8bc53f0eae47e34db6ca6fe84e1055c, type: 3}
--- !u!1 &1893504797
GameObject:
  m_ObjectHideFlags: 0
  m_CorrespondingSourceObject: {fileID: 0}
  m_PrefabInstance: {fileID: 0}
  m_PrefabAsset: {fileID: 0}
  serializedVersion: 6
  m_Component:
  - component: {fileID: 1893504798}
  m_Layer: 0
  m_Name: Swords
  m_TagString: Untagged
  m_Icon: {fileID: 0}
  m_NavMeshLayer: 0
  m_StaticEditorFlags: 4294967295
  m_IsActive: 1
--- !u!4 &1893504798
Transform:
  m_ObjectHideFlags: 0
  m_CorrespondingSourceObject: {fileID: 0}
  m_PrefabInstance: {fileID: 0}
  m_PrefabAsset: {fileID: 0}
  m_GameObject: {fileID: 1893504797}
  m_LocalRotation: {x: 0, y: 0, z: 0, w: 1}
  m_LocalPosition: {x: 0, y: 0, z: 0}
  m_LocalScale: {x: 1, y: 1, z: 1}
  m_Children:
  - {fileID: 730712620}
  - {fileID: 47073600}
  - {fileID: 1545192334}
  - {fileID: 1671477898}
  - {fileID: 354912689}
  - {fileID: 948752558}
  - {fileID: 1314794256}
  m_Father: {fileID: 0}
  m_RootOrder: 1
  m_LocalEulerAnglesHint: {x: 0, y: 0, z: 0}
