%YAML 1.1
%TAG !u! tag:unity3d.com,2011:
--- !u!114 &11400000
MonoBehaviour:
  m_ObjectHideFlags: 0
  m_CorrespondingSourceObject: {fileID: 0}
  m_PrefabInstance: {fileID: 0}
  m_PrefabAsset: {fileID: 0}
  m_GameObject: {fileID: 0}
  m_Enabled: 1
  m_EditorHideFlags: 0
  m_Script: {fileID: 11500000, guid: b9708d0e329dc1a45aaa3806a06ae407, type: 3}
  m_Name: 5_Katana
  m_EditorClassIdentifier: 
  swordName: Katana
  icon: {fileID: 21300000, guid: 0b7fdefeb592b5e44b462734170bb9af, type: 3}
  goldCost: 500
  description: Katana
  attackDamage: 5
