ISO-10303-21;
HEADER;
FILE_DESCRIPTION(('FreeCAD Model'),'2;1');
FILE_NAME(
'/home/aleph/local/yellowfin/production_
parts/jigs/bore-gauges/bore-gauge.step','2017-12-18T12:15:09',('Author')
  ,(''),'Open CASCADE STEP processor 6.9','FreeCAD','Unknown');
FILE_SCHEMA(('AUTOMOTIVE_DESIGN { 1 0 10303 214 1 1 1 1 }'));
ENDSEC;
DATA;
#1 = APPLICATION_PROTOCOL_DEFINITION('international standard',
  'automotive_design',2000,#2);
#2 = APPLICATION_CONTEXT(
  'core data for automotive mechanical design processes');
#3 = SHAPE_DEFINITION_REPRESENTATION(#4,#10);
#4 = PRODUCT_DEFINITION_SHAPE('','',#5);
#5 = PRODUCT_DEFINITION('design','',#6,#9);
#6 = PRODUCT_DEFINITION_FORMATION('','',#7);
#7 = PRODUCT('Sketch001','Sketch001','',(#8));
#8 = PRODUCT_CONTEXT('',#2,'mechanical');
#9 = PRODUCT_DEFINITION_CONTEXT('part definition',#2,'design');
#10 = GEOMETRICALLY_BOUNDED_WIREFRAME_SHAPE_REPRESENTATION('',(#11,#15),
  #24);
#11 = AXIS2_PLACEMENT_3D('',#12,#13,#14);
#12 = CARTESIAN_POINT('',(0.,0.,0.));
#13 = DIRECTION('',(0.,0.,1.));
#14 = DIRECTION('',(1.,0.,-0.));
#15 = GEOMETRIC_CURVE_SET('',(#16));
#16 = TRIMMED_CURVE('',#17,(#22,PARAMETER_VALUE(0.)),(#23,
    PARAMETER_VALUE(6.28318530718)),.T.,.PARAMETER.);
#17 = CIRCLE('',#18,1.6);
#18 = AXIS2_PLACEMENT_3D('',#19,#20,#21);
#19 = CARTESIAN_POINT('',(0.,0.,50.));
#20 = DIRECTION('',(0.,0.,1.));
#21 = DIRECTION('',(1.,0.,0.));
#22 = CARTESIAN_POINT('',(1.6,0.,50.));
#23 = CARTESIAN_POINT('',(1.6,0.,50.));
#24 = ( GEOMETRIC_REPRESENTATION_CONTEXT(3) 
GLOBAL_UNCERTAINTY_ASSIGNED_CONTEXT((#28)) GLOBAL_UNIT_ASSIGNED_CONTEXT(
(#25,#26,#27)) REPRESENTATION_CONTEXT('Context #1',
  '3D Context with UNIT and UNCERTAINTY') );
#25 = ( LENGTH_UNIT() NAMED_UNIT(*) SI_UNIT(.MILLI.,.METRE.) );
#26 = ( NAMED_UNIT(*) PLANE_ANGLE_UNIT() SI_UNIT($,.RADIAN.) );
#27 = ( NAMED_UNIT(*) SI_UNIT($,.STERADIAN.) SOLID_ANGLE_UNIT() );
#28 = UNCERTAINTY_MEASURE_WITH_UNIT(LENGTH_MEASURE(1.E-07),#25,
  'distance_accuracy_value','confusion accuracy');
#29 = PRODUCT_RELATED_PRODUCT_CATEGORY('part',$,(#7));
#30 = MECHANICAL_DESIGN_GEOMETRIC_PRESENTATION_REPRESENTATION('',(#31),
  #24);
#31 = STYLED_ITEM('color',(#32),#15);
#32 = PRESENTATION_STYLE_ASSIGNMENT((#33,#39));
#33 = SURFACE_STYLE_USAGE(.BOTH.,#34);
#34 = SURFACE_SIDE_STYLE('',(#35));
#35 = SURFACE_STYLE_FILL_AREA(#36);
#36 = FILL_AREA_STYLE('',(#37));
#37 = FILL_AREA_STYLE_COLOUR('',#38);
#38 = COLOUR_RGB('',0.800000011921,0.800000011921,0.800000011921);
#39 = CURVE_STYLE('',#40,POSITIVE_LENGTH_MEASURE(0.1),#38);
#40 = DRAUGHTING_PRE_DEFINED_CURVE_FONT('continuous');
ENDSEC;
END-ISO-10303-21;
