ISO-10303-21;
HEADER;
/* Generated by software containing ST-Developer
 * from STEP Tools, Inc. (www.steptools.com) 
 */

FILE_DESCRIPTION(
/* description */ (''),
/* implementation_level */ '2;1');

FILE_NAME(
/* name */ 'Y:\\Engineering\\Products\\E3D-v6\\CAD\\V6\\Volcano Nozzle.
stp',
/* time_stamp */ '2018-02-22T16:41:29+00:00',
/* author */ ('Rory'),
/* organization */ (''),
/* preprocessor_version */ 'ST-DEVELOPER v15.6',
/* originating_system */ 'Autodesk Inventor 2015',
/* authorisation */ '');

FILE_SCHEMA (('AUTOMOTIVE_DESIGN { 1 0 10303 214 3 1 1 }'));
ENDSEC;

DATA;
#10=MECHANICAL_DESIGN_GEOMETRIC_PRESENTATION_REPRESENTATION('',(#13),#915);
#11=SHAPE_REPRESENTATION_RELATIONSHIP('SRR','None',#924,#12);
#12=ADVANCED_BREP_SHAPE_REPRESENTATION($,(#14),#914);
#13=STYLED_ITEM('',(#933),#14);
#14=MANIFOLD_SOLID_BREP('Solid1',#392);
#15=TOROIDAL_SURFACE('',#407,3.4415,0.6);
#16=TOROIDAL_SURFACE('',#409,3.7415,0.3);
#17=TOROIDAL_SURFACE('',#411,3.7415,0.3);
#18=TOROIDAL_SURFACE('',#413,3.7415,0.3);
#19=TOROIDAL_SURFACE('',#415,3.7415,0.3);
#20=TOROIDAL_SURFACE('',#417,3.7415,0.3);
#21=TOROIDAL_SURFACE('',#422,3.7415,0.3);
#22=LINE('',#582,#34);
#23=LINE('',#597,#35);
#24=LINE('',#611,#36);
#25=LINE('',#651,#37);
#26=LINE('',#665,#38);
#27=LINE('',#703,#39);
#28=LINE('',#715,#40);
#29=LINE('',#743,#41);
#30=LINE('',#756,#42);
#31=LINE('',#768,#43);
#32=LINE('',#807,#44);
#33=LINE('',#858,#45);
#34=VECTOR('',#457,2.1);
#35=VECTOR('',#458,2.64464028744931);
#36=VECTOR('',#459,2.1);
#37=VECTOR('',#462,2.64464028744931);
#38=VECTOR('',#463,2.1);
#39=VECTOR('',#466,2.64464028744931);
#40=VECTOR('',#467,2.1);
#41=VECTOR('',#470,2.1);
#42=VECTOR('',#471,2.64464028744932);
#43=VECTOR('',#472,2.1);
#44=VECTOR('',#475,2.64464028744931);
#45=VECTOR('',#478,2.64464028744931);
#46=B_SPLINE_CURVE_WITH_KNOTS('',3,(#558,#559,#560,#561,#562,#563,#564,
#565,#566,#567,#568,#569,#570,#571,#572,#573,#574,#575,#576,#577,#578,#579,
#580),.UNSPECIFIED.,.F.,.F.,(4,2,2,2,2,3,2,2,2,2,4),(-0.213780675695334,
-0.199138244916225,-0.179283604711742,-0.146290487845967,-0.0731452439229834,
0.,0.0731452439229834,0.146290487845967,0.179283604711742,0.199138244916225,
0.213780675695334),.UNSPECIFIED.);
#47=B_SPLINE_CURVE_WITH_KNOTS('',3,(#584,#585,#586,#587,#588,#589,#590,
#591,#592,#593,#594,#595),.UNSPECIFIED.,.F.,.F.,(4,2,2,2,2,4),(0.529181047352515,
0.565729020841495,0.585777565276361,0.598176860855539,0.602616316106569,
0.606605512062915),.UNSPECIFIED.);
#48=B_SPLINE_CURVE_WITH_KNOTS('',3,(#599,#600,#601,#602,#603,#604,#605,
#606,#607,#608,#609,#610),.UNSPECIFIED.,.F.,.F.,(4,2,2,2,2,4),(0.202201837354305,
0.206191033310651,0.210630488561681,0.223029784140859,0.243078328575725,
0.279626302064706),.UNSPECIFIED.);
#49=B_SPLINE_CURVE_WITH_KNOTS('',3,(#614,#615,#616,#617,#618,#619,#620,
#621,#622,#623,#624,#625,#626,#627,#628,#629,#630,#631,#632,#633,#634,#635,
#636),.UNSPECIFIED.,.F.,.F.,(4,2,2,2,2,3,2,2,2,2,4),(-0.213780675695334,
-0.199138244916225,-0.179283604711742,-0.146290487845967,-0.0731452439229834,
0.,0.0731452439229835,0.146290487845967,0.179283604711742,0.199138244916225,
0.213780675695335),.UNSPECIFIED.);
#50=B_SPLINE_CURVE_WITH_KNOTS('',3,(#638,#639,#640,#641,#642,#643,#644,
#645,#646,#647,#648,#649),.UNSPECIFIED.,.F.,.F.,(4,2,2,2,2,4),(0.529181047352515,
0.565729020841495,0.585777565276362,0.59817686085554,0.60261631610657,0.606605512062915),
 .UNSPECIFIED.);
#51=B_SPLINE_CURVE_WITH_KNOTS('',3,(#653,#654,#655,#656,#657,#658,#659,
#660,#661,#662,#663,#664),.UNSPECIFIED.,.F.,.F.,(4,2,2,2,2,4),(0.202201837354305,
0.206191033310651,0.210630488561681,0.223029784140859,0.243078328575725,
0.279626302064706),.UNSPECIFIED.);
#52=B_SPLINE_CURVE_WITH_KNOTS('',3,(#668,#669,#670,#671,#672,#673,#674,
#675,#676,#677,#678,#679,#680,#681,#682,#683,#684,#685,#686,#687,#688,#689,
#690),.UNSPECIFIED.,.F.,.F.,(4,2,2,2,2,3,2,2,2,2,4),(-0.213780675695335,
-0.199138244916225,-0.179283604711742,-0.146290487845967,-0.0731452439229837,
0.,0.0731452439229836,0.146290487845967,0.179283604711742,0.199138244916225,
0.213780675695335),.UNSPECIFIED.);
#53=B_SPLINE_CURVE_WITH_KNOTS('',3,(#692,#693,#694,#695,#696,#697,#698,
#699,#700,#701),.UNSPECIFIED.,.F.,.F.,(4,2,2,2,4),(0.529945755860292,0.579887771686052,
0.597335630657852,0.602935158285089,0.607752574824581),.UNSPECIFIED.);
#54=B_SPLINE_CURVE_WITH_KNOTS('',3,(#705,#706,#707,#708,#709,#710,#711,
#712,#713,#714),.UNSPECIFIED.,.F.,.F.,(4,2,2,2,4),(0.202584191608194,0.207401608147686,
0.213001135774923,0.230448994746723,0.280391010572483),.UNSPECIFIED.);
#55=B_SPLINE_CURVE_WITH_KNOTS('',3,(#719,#720,#721,#722,#723,#724,#725,
#726,#727,#728,#729,#730,#731,#732,#733,#734,#735,#736,#737,#738,#739,#740,
#741),.UNSPECIFIED.,.F.,.F.,(4,2,2,2,2,3,2,2,2,2,4),(-0.213780675695335,
-0.199138244916226,-0.179283604711742,-0.146290487845967,-0.0731452439229837,
0.,0.0731452439229837,0.146290487845967,0.179283604711743,0.199138244916226,
0.213780675695335),.UNSPECIFIED.);
#56=B_SPLINE_CURVE_WITH_KNOTS('',3,(#745,#746,#747,#748,#749,#750,#751,
#752,#753,#754),.UNSPECIFIED.,.F.,.F.,(4,2,2,2,4),(0.529945755860293,0.579887771686053,
0.597335630657853,0.60293515828509,0.607752574824582),.UNSPECIFIED.);
#57=B_SPLINE_CURVE_WITH_KNOTS('',3,(#758,#759,#760,#761,#762,#763,#764,
#765,#766,#767),.UNSPECIFIED.,.F.,.F.,(4,2,2,2,4),(0.202584191608194,0.207401608147686,
0.213001135774924,0.230448994746723,0.280391010572483),.UNSPECIFIED.);
#58=B_SPLINE_CURVE_WITH_KNOTS('',3,(#770,#771,#772,#773,#774,#775,#776,
#777,#778,#779,#780,#781,#782,#783,#784,#785,#786,#787,#788,#789,#790,#791,
#792),.UNSPECIFIED.,.F.,.F.,(4,2,2,2,2,3,2,2,2,2,4),(-0.213780675695334,
-0.199138244916225,-0.179283604711742,-0.146290487845967,-0.0731452439229834,
0.,0.0731452439229834,0.146290487845967,0.179283604711742,0.199138244916225,
0.213780675695334),.UNSPECIFIED.);
#59=B_SPLINE_CURVE_WITH_KNOTS('',3,(#794,#795,#796,#797,#798,#799,#800,
#801,#802,#803,#804,#805),.UNSPECIFIED.,.F.,.F.,(4,2,2,2,2,4),(0.529181047352515,
0.565729020841495,0.585777565276361,0.598176860855539,0.60261631610657,
0.606605512062915),.UNSPECIFIED.);
#60=B_SPLINE_CURVE_WITH_KNOTS('',3,(#808,#809,#810,#811,#812,#813,#814,
#815,#816,#817,#818,#819),.UNSPECIFIED.,.F.,.F.,(4,2,2,2,2,4),(0.202201837354305,
0.206191033310651,0.210630488561681,0.223029784140859,0.243078328575725,
0.279626302064706),.UNSPECIFIED.);
#61=B_SPLINE_CURVE_WITH_KNOTS('',3,(#821,#822,#823,#824,#825,#826,#827,
#828,#829,#830,#831,#832,#833,#834,#835,#836,#837,#838,#839,#840,#841,#842,
#843),.UNSPECIFIED.,.F.,.F.,(4,2,2,2,2,3,2,2,2,2,4),(-0.213780675695334,
-0.199138244916225,-0.179283604711742,-0.146290487845967,-0.0731452439229835,
0.,0.0731452439229835,0.146290487845967,0.179283604711742,0.199138244916225,
0.213780675695334),.UNSPECIFIED.);
#62=B_SPLINE_CURVE_WITH_KNOTS('',3,(#845,#846,#847,#848,#849,#850,#851,
#852,#853,#854,#855,#856),.UNSPECIFIED.,.F.,.F.,(4,2,2,2,2,4),(0.529181047352515,
0.565729020841495,0.585777565276361,0.598176860855539,0.602616316106569,
0.606605512062915),.UNSPECIFIED.);
#63=B_SPLINE_CURVE_WITH_KNOTS('',3,(#859,#860,#861,#862,#863,#864,#865,
#866,#867,#868,#869,#870),.UNSPECIFIED.,.F.,.F.,(4,2,2,2,2,4),(0.202201837354305,
0.206191033310651,0.210630488561681,0.223029784140859,0.243078328575725,
0.279626302064705),.UNSPECIFIED.);
#64=CYLINDRICAL_SURFACE('',#399,1.6);
#65=CYLINDRICAL_SURFACE('',#427,3.);
#66=CYLINDRICAL_SURFACE('',#431,2.5);
#67=CYLINDRICAL_SURFACE('',#436,0.3);
#68=PLANE('',#397);
#69=PLANE('',#401);
#70=PLANE('',#402);
#71=PLANE('',#403);
#72=PLANE('',#404);
#73=PLANE('',#405);
#74=PLANE('',#406);
#75=PLANE('',#419);
#76=PLANE('',#423);
#77=PLANE('',#438);
#78=FACE_BOUND('',#119,.T.);
#79=FACE_BOUND('',#121,.T.);
#80=FACE_BOUND('',#123,.T.);
#81=FACE_BOUND('',#131,.T.);
#82=FACE_BOUND('',#138,.T.);
#83=FACE_BOUND('',#141,.T.);
#84=FACE_BOUND('',#143,.T.);
#85=FACE_BOUND('',#145,.T.);
#86=FACE_BOUND('',#147,.T.);
#87=FACE_BOUND('',#149,.T.);
#88=FACE_BOUND('',#151,.T.);
#89=FACE_BOUND('',#153,.T.);
#90=FACE_BOUND('',#155,.T.);
#91=FACE_BOUND('',#157,.T.);
#92=FACE_OUTER_BOUND('',#118,.T.);
#93=FACE_OUTER_BOUND('',#120,.T.);
#94=FACE_OUTER_BOUND('',#122,.T.);
#95=FACE_OUTER_BOUND('',#124,.T.);
#96=FACE_OUTER_BOUND('',#125,.T.);
#97=FACE_OUTER_BOUND('',#126,.T.);
#98=FACE_OUTER_BOUND('',#127,.T.);
#99=FACE_OUTER_BOUND('',#128,.T.);
#100=FACE_OUTER_BOUND('',#129,.T.);
#101=FACE_OUTER_BOUND('',#130,.T.);
#102=FACE_OUTER_BOUND('',#132,.T.);
#103=FACE_OUTER_BOUND('',#133,.T.);
#104=FACE_OUTER_BOUND('',#134,.T.);
#105=FACE_OUTER_BOUND('',#135,.T.);
#106=FACE_OUTER_BOUND('',#136,.T.);
#107=FACE_OUTER_BOUND('',#137,.T.);
#108=FACE_OUTER_BOUND('',#139,.T.);
#109=FACE_OUTER_BOUND('',#140,.T.);
#110=FACE_OUTER_BOUND('',#142,.T.);
#111=FACE_OUTER_BOUND('',#144,.T.);
#112=FACE_OUTER_BOUND('',#146,.T.);
#113=FACE_OUTER_BOUND('',#148,.T.);
#114=FACE_OUTER_BOUND('',#150,.T.);
#115=FACE_OUTER_BOUND('',#152,.T.);
#116=FACE_OUTER_BOUND('',#154,.T.);
#117=FACE_OUTER_BOUND('',#156,.T.);
#118=EDGE_LOOP('',(#263));
#119=EDGE_LOOP('',(#264));
#120=EDGE_LOOP('',(#265));
#121=EDGE_LOOP('',(#266));
#122=EDGE_LOOP('',(#267));
#123=EDGE_LOOP('',(#268));
#124=EDGE_LOOP('',(#269,#270,#271,#272,#273,#274));
#125=EDGE_LOOP('',(#275,#276,#277,#278,#279,#280));
#126=EDGE_LOOP('',(#281,#282,#283,#284,#285,#286));
#127=EDGE_LOOP('',(#287,#288,#289,#290,#291,#292));
#128=EDGE_LOOP('',(#293,#294,#295,#296,#297,#298));
#129=EDGE_LOOP('',(#299,#300,#301,#302,#303,#304));
#130=EDGE_LOOP('',(#305,#306,#307,#308,#309,#310));
#131=EDGE_LOOP('',(#311));
#132=EDGE_LOOP('',(#312,#313,#314));
#133=EDGE_LOOP('',(#315,#316,#317));
#134=EDGE_LOOP('',(#318,#319,#320));
#135=EDGE_LOOP('',(#321,#322,#323));
#136=EDGE_LOOP('',(#324,#325,#326));
#137=EDGE_LOOP('',(#327,#328,#329,#330,#331,#332,#333,#334,#335,#336,#337,
#338));
#138=EDGE_LOOP('',(#339));
#139=EDGE_LOOP('',(#340,#341,#342));
#140=EDGE_LOOP('',(#343));
#141=EDGE_LOOP('',(#344));
#142=EDGE_LOOP('',(#345));
#143=EDGE_LOOP('',(#346));
#144=EDGE_LOOP('',(#347));
#145=EDGE_LOOP('',(#348));
#146=EDGE_LOOP('',(#349));
#147=EDGE_LOOP('',(#350));
#148=EDGE_LOOP('',(#351));
#149=EDGE_LOOP('',(#352));
#150=EDGE_LOOP('',(#353));
#151=EDGE_LOOP('',(#354));
#152=EDGE_LOOP('',(#355));
#153=EDGE_LOOP('',(#356));
#154=EDGE_LOOP('',(#357));
#155=EDGE_LOOP('',(#358));
#156=EDGE_LOOP('',(#359));
#157=EDGE_LOOP('',(#360));
#158=CIRCLE('',#395,1.85);
#159=CIRCLE('',#396,1.6);
#160=CIRCLE('',#398,2.4);
#161=CIRCLE('',#400,1.6);
#162=CIRCLE('',#408,3.4415);
#163=CIRCLE('',#410,3.7415);
#164=CIRCLE('',#412,3.7415);
#165=CIRCLE('',#414,3.7415);
#166=CIRCLE('',#416,3.7415);
#167=CIRCLE('',#418,3.7415);
#168=CIRCLE('',#420,3.7415);
#169=CIRCLE('',#421,2.5);
#170=CIRCLE('',#424,2.15041507641942);
#171=CIRCLE('',#426,3.);
#172=CIRCLE('',#428,3.);
#173=CIRCLE('',#430,0.75);
#174=CIRCLE('',#432,2.5);
#175=CIRCLE('',#435,0.3);
#176=CIRCLE('',#437,0.3);
#177=VERTEX_POINT('',#545);
#178=VERTEX_POINT('',#547);
#179=VERTEX_POINT('',#550);
#180=VERTEX_POINT('',#553);
#181=VERTEX_POINT('',#556);
#182=VERTEX_POINT('',#557);
#183=VERTEX_POINT('',#581);
#184=VERTEX_POINT('',#583);
#185=VERTEX_POINT('',#596);
#186=VERTEX_POINT('',#598);
#187=VERTEX_POINT('',#613);
#188=VERTEX_POINT('',#637);
#189=VERTEX_POINT('',#650);
#190=VERTEX_POINT('',#652);
#191=VERTEX_POINT('',#667);
#192=VERTEX_POINT('',#691);
#193=VERTEX_POINT('',#702);
#194=VERTEX_POINT('',#704);
#195=VERTEX_POINT('',#717);
#196=VERTEX_POINT('',#718);
#197=VERTEX_POINT('',#742);
#198=VERTEX_POINT('',#744);
#199=VERTEX_POINT('',#755);
#200=VERTEX_POINT('',#757);
#201=VERTEX_POINT('',#793);
#202=VERTEX_POINT('',#806);
#203=VERTEX_POINT('',#844);
#204=VERTEX_POINT('',#857);
#205=VERTEX_POINT('',#872);
#206=VERTEX_POINT('',#886);
#207=VERTEX_POINT('',#890);
#208=VERTEX_POINT('',#893);
#209=VERTEX_POINT('',#896);
#210=VERTEX_POINT('',#899);
#211=VERTEX_POINT('',#902);
#212=VERTEX_POINT('',#906);
#213=VERTEX_POINT('',#909);
#214=EDGE_CURVE('',#177,#177,#158,.T.);
#215=EDGE_CURVE('',#178,#178,#159,.T.);
#216=EDGE_CURVE('',#179,#179,#160,.T.);
#217=EDGE_CURVE('',#180,#180,#161,.T.);
#218=EDGE_CURVE('',#181,#182,#46,.T.);
#219=EDGE_CURVE('',#181,#183,#22,.T.);
#220=EDGE_CURVE('',#184,#183,#47,.T.);
#221=EDGE_CURVE('',#185,#184,#23,.T.);
#222=EDGE_CURVE('',#186,#185,#48,.T.);
#223=EDGE_CURVE('',#182,#186,#24,.T.);
#224=EDGE_CURVE('',#182,#187,#49,.T.);
#225=EDGE_CURVE('',#188,#186,#50,.T.);
#226=EDGE_CURVE('',#189,#188,#25,.T.);
#227=EDGE_CURVE('',#190,#189,#51,.T.);
#228=EDGE_CURVE('',#187,#190,#26,.T.);
#229=EDGE_CURVE('',#187,#191,#52,.T.);
#230=EDGE_CURVE('',#192,#190,#53,.T.);
#231=EDGE_CURVE('',#193,#192,#27,.T.);
#232=EDGE_CURVE('',#194,#193,#54,.T.);
#233=EDGE_CURVE('',#191,#194,#28,.T.);
#234=EDGE_CURVE('',#195,#196,#55,.T.);
#235=EDGE_CURVE('',#197,#195,#29,.T.);
#236=EDGE_CURVE('',#198,#197,#56,.T.);
#237=EDGE_CURVE('',#199,#198,#30,.T.);
#238=EDGE_CURVE('',#200,#199,#57,.T.);
#239=EDGE_CURVE('',#196,#200,#31,.T.);
#240=EDGE_CURVE('',#196,#181,#58,.T.);
#241=EDGE_CURVE('',#201,#200,#59,.T.);
#242=EDGE_CURVE('',#202,#201,#32,.T.);
#243=EDGE_CURVE('',#183,#202,#60,.T.);
#244=EDGE_CURVE('',#191,#195,#61,.T.);
#245=EDGE_CURVE('',#203,#194,#62,.T.);
#246=EDGE_CURVE('',#204,#203,#33,.T.);
#247=EDGE_CURVE('',#197,#204,#63,.T.);
#248=EDGE_CURVE('',#205,#205,#162,.T.);
#249=EDGE_CURVE('',#193,#203,#163,.T.);
#250=EDGE_CURVE('',#189,#192,#164,.T.);
#251=EDGE_CURVE('',#185,#188,#165,.T.);
#252=EDGE_CURVE('',#204,#198,#166,.T.);
#253=EDGE_CURVE('',#199,#201,#167,.T.);
#254=EDGE_CURVE('',#202,#184,#168,.T.);
#255=EDGE_CURVE('',#206,#206,#169,.T.);
#256=EDGE_CURVE('',#207,#207,#170,.T.);
#257=EDGE_CURVE('',#208,#208,#171,.T.);
#258=EDGE_CURVE('',#209,#209,#172,.T.);
#259=EDGE_CURVE('',#210,#210,#173,.T.);
#260=EDGE_CURVE('',#211,#211,#174,.T.);
#261=EDGE_CURVE('',#212,#212,#175,.T.);
#262=EDGE_CURVE('',#213,#213,#176,.T.);
#263=ORIENTED_EDGE('',*,*,#214,.T.);
#264=ORIENTED_EDGE('',*,*,#215,.T.);
#265=ORIENTED_EDGE('',*,*,#216,.F.);
#266=ORIENTED_EDGE('',*,*,#214,.F.);
#267=ORIENTED_EDGE('',*,*,#217,.F.);
#268=ORIENTED_EDGE('',*,*,#215,.F.);
#269=ORIENTED_EDGE('',*,*,#218,.F.);
#270=ORIENTED_EDGE('',*,*,#219,.T.);
#271=ORIENTED_EDGE('',*,*,#220,.F.);
#272=ORIENTED_EDGE('',*,*,#221,.F.);
#273=ORIENTED_EDGE('',*,*,#222,.F.);
#274=ORIENTED_EDGE('',*,*,#223,.F.);
#275=ORIENTED_EDGE('',*,*,#224,.F.);
#276=ORIENTED_EDGE('',*,*,#223,.T.);
#277=ORIENTED_EDGE('',*,*,#225,.F.);
#278=ORIENTED_EDGE('',*,*,#226,.F.);
#279=ORIENTED_EDGE('',*,*,#227,.F.);
#280=ORIENTED_EDGE('',*,*,#228,.F.);
#281=ORIENTED_EDGE('',*,*,#229,.F.);
#282=ORIENTED_EDGE('',*,*,#228,.T.);
#283=ORIENTED_EDGE('',*,*,#230,.F.);
#284=ORIENTED_EDGE('',*,*,#231,.F.);
#285=ORIENTED_EDGE('',*,*,#232,.F.);
#286=ORIENTED_EDGE('',*,*,#233,.F.);
#287=ORIENTED_EDGE('',*,*,#234,.F.);
#288=ORIENTED_EDGE('',*,*,#235,.F.);
#289=ORIENTED_EDGE('',*,*,#236,.F.);
#290=ORIENTED_EDGE('',*,*,#237,.F.);
#291=ORIENTED_EDGE('',*,*,#238,.F.);
#292=ORIENTED_EDGE('',*,*,#239,.F.);
#293=ORIENTED_EDGE('',*,*,#240,.F.);
#294=ORIENTED_EDGE('',*,*,#239,.T.);
#295=ORIENTED_EDGE('',*,*,#241,.F.);
#296=ORIENTED_EDGE('',*,*,#242,.F.);
#297=ORIENTED_EDGE('',*,*,#243,.F.);
#298=ORIENTED_EDGE('',*,*,#219,.F.);
#299=ORIENTED_EDGE('',*,*,#244,.F.);
#300=ORIENTED_EDGE('',*,*,#233,.T.);
#301=ORIENTED_EDGE('',*,*,#245,.F.);
#302=ORIENTED_EDGE('',*,*,#246,.F.);
#303=ORIENTED_EDGE('',*,*,#247,.F.);
#304=ORIENTED_EDGE('',*,*,#235,.T.);
#305=ORIENTED_EDGE('',*,*,#244,.T.);
#306=ORIENTED_EDGE('',*,*,#234,.T.);
#307=ORIENTED_EDGE('',*,*,#240,.T.);
#308=ORIENTED_EDGE('',*,*,#218,.T.);
#309=ORIENTED_EDGE('',*,*,#224,.T.);
#310=ORIENTED_EDGE('',*,*,#229,.T.);
#311=ORIENTED_EDGE('',*,*,#248,.T.);
#312=ORIENTED_EDGE('',*,*,#245,.T.);
#313=ORIENTED_EDGE('',*,*,#232,.T.);
#314=ORIENTED_EDGE('',*,*,#249,.T.);
#315=ORIENTED_EDGE('',*,*,#227,.T.);
#316=ORIENTED_EDGE('',*,*,#250,.T.);
#317=ORIENTED_EDGE('',*,*,#230,.T.);
#318=ORIENTED_EDGE('',*,*,#222,.T.);
#319=ORIENTED_EDGE('',*,*,#251,.T.);
#320=ORIENTED_EDGE('',*,*,#225,.T.);
#321=ORIENTED_EDGE('',*,*,#236,.T.);
#322=ORIENTED_EDGE('',*,*,#247,.T.);
#323=ORIENTED_EDGE('',*,*,#252,.T.);
#324=ORIENTED_EDGE('',*,*,#238,.T.);
#325=ORIENTED_EDGE('',*,*,#253,.T.);
#326=ORIENTED_EDGE('',*,*,#241,.T.);
#327=ORIENTED_EDGE('',*,*,#242,.T.);
#328=ORIENTED_EDGE('',*,*,#253,.F.);
#329=ORIENTED_EDGE('',*,*,#237,.T.);
#330=ORIENTED_EDGE('',*,*,#252,.F.);
#331=ORIENTED_EDGE('',*,*,#246,.T.);
#332=ORIENTED_EDGE('',*,*,#249,.F.);
#333=ORIENTED_EDGE('',*,*,#231,.T.);
#334=ORIENTED_EDGE('',*,*,#250,.F.);
#335=ORIENTED_EDGE('',*,*,#226,.T.);
#336=ORIENTED_EDGE('',*,*,#251,.F.);
#337=ORIENTED_EDGE('',*,*,#221,.T.);
#338=ORIENTED_EDGE('',*,*,#254,.F.);
#339=ORIENTED_EDGE('',*,*,#255,.F.);
#340=ORIENTED_EDGE('',*,*,#243,.T.);
#341=ORIENTED_EDGE('',*,*,#254,.T.);
#342=ORIENTED_EDGE('',*,*,#220,.T.);
#343=ORIENTED_EDGE('',*,*,#248,.F.);
#344=ORIENTED_EDGE('',*,*,#256,.T.);
#345=ORIENTED_EDGE('',*,*,#257,.T.);
#346=ORIENTED_EDGE('',*,*,#216,.T.);
#347=ORIENTED_EDGE('',*,*,#258,.T.);
#348=ORIENTED_EDGE('',*,*,#257,.F.);
#349=ORIENTED_EDGE('',*,*,#256,.F.);
#350=ORIENTED_EDGE('',*,*,#259,.T.);
#351=ORIENTED_EDGE('',*,*,#260,.F.);
#352=ORIENTED_EDGE('',*,*,#255,.T.);
#353=ORIENTED_EDGE('',*,*,#258,.F.);
#354=ORIENTED_EDGE('',*,*,#260,.T.);
#355=ORIENTED_EDGE('',*,*,#261,.F.);
#356=ORIENTED_EDGE('',*,*,#217,.T.);
#357=ORIENTED_EDGE('',*,*,#262,.F.);
#358=ORIENTED_EDGE('',*,*,#261,.T.);
#359=ORIENTED_EDGE('',*,*,#259,.F.);
#360=ORIENTED_EDGE('',*,*,#262,.T.);
#361=CONICAL_SURFACE('',#394,1.725,45.0000000000002);
#362=CONICAL_SURFACE('',#425,2.7,45.0000000000001);
#363=CONICAL_SURFACE('',#429,1.45020753820971,35.);
#364=CONICAL_SURFACE('',#433,2.75,70.);
#365=CONICAL_SURFACE('',#434,0.95,30.);
#366=ADVANCED_FACE('',(#92,#78),#361,.F.);
#367=ADVANCED_FACE('',(#93,#79),#68,.T.);
#368=ADVANCED_FACE('',(#94,#80),#64,.F.);
#369=ADVANCED_FACE('',(#95),#69,.T.);
#370=ADVANCED_FACE('',(#96),#70,.T.);
#371=ADVANCED_FACE('',(#97),#71,.T.);
#372=ADVANCED_FACE('',(#98),#72,.T.);
#373=ADVANCED_FACE('',(#99),#73,.T.);
#374=ADVANCED_FACE('',(#100),#74,.T.);
#375=ADVANCED_FACE('',(#101,#81),#15,.T.);
#376=ADVANCED_FACE('',(#102),#16,.T.);
#377=ADVANCED_FACE('',(#103),#17,.T.);
#378=ADVANCED_FACE('',(#104),#18,.T.);
#379=ADVANCED_FACE('',(#105),#19,.T.);
#380=ADVANCED_FACE('',(#106),#20,.T.);
#381=ADVANCED_FACE('',(#107,#82),#75,.T.);
#382=ADVANCED_FACE('',(#108),#21,.T.);
#383=ADVANCED_FACE('',(#109,#83),#76,.T.);
#384=ADVANCED_FACE('',(#110,#84),#362,.T.);
#385=ADVANCED_FACE('',(#111,#85),#65,.T.);
#386=ADVANCED_FACE('',(#112,#86),#363,.T.);
#387=ADVANCED_FACE('',(#113,#87),#66,.T.);
#388=ADVANCED_FACE('',(#114,#88),#364,.T.);
#389=ADVANCED_FACE('',(#115,#89),#365,.F.);
#390=ADVANCED_FACE('',(#116,#90),#67,.F.);
#391=ADVANCED_FACE('',(#117,#91),#77,.T.);
#392=CLOSED_SHELL('',(#366,#367,#368,#369,#370,#371,#372,#373,#374,#375,
#376,#377,#378,#379,#380,#381,#382,#383,#384,#385,#386,#387,#388,#389,#390,
#391));
#393=AXIS2_PLACEMENT_3D('placement',#543,#439,#440);
#394=AXIS2_PLACEMENT_3D('',#544,#441,#442);
#395=AXIS2_PLACEMENT_3D('',#546,#443,#444);
#396=AXIS2_PLACEMENT_3D('',#548,#445,#446);
#397=AXIS2_PLACEMENT_3D('',#549,#447,#448);
#398=AXIS2_PLACEMENT_3D('',#551,#449,#450);
#399=AXIS2_PLACEMENT_3D('',#552,#451,#452);
#400=AXIS2_PLACEMENT_3D('',#554,#453,#454);
#401=AXIS2_PLACEMENT_3D('',#555,#455,#456);
#402=AXIS2_PLACEMENT_3D('',#612,#460,#461);
#403=AXIS2_PLACEMENT_3D('',#666,#464,#465);
#404=AXIS2_PLACEMENT_3D('',#716,#468,#469);
#405=AXIS2_PLACEMENT_3D('',#769,#473,#474);
#406=AXIS2_PLACEMENT_3D('',#820,#476,#477);
#407=AXIS2_PLACEMENT_3D('',#871,#479,#480);
#408=AXIS2_PLACEMENT_3D('',#873,#481,#482);
#409=AXIS2_PLACEMENT_3D('',#874,#483,#484);
#410=AXIS2_PLACEMENT_3D('',#875,#485,#486);
#411=AXIS2_PLACEMENT_3D('',#876,#487,#488);
#412=AXIS2_PLACEMENT_3D('',#877,#489,#490);
#413=AXIS2_PLACEMENT_3D('',#878,#491,#492);
#414=AXIS2_PLACEMENT_3D('',#879,#493,#494);
#415=AXIS2_PLACEMENT_3D('',#880,#495,#496);
#416=AXIS2_PLACEMENT_3D('',#881,#497,#498);
#417=AXIS2_PLACEMENT_3D('',#882,#499,#500);
#418=AXIS2_PLACEMENT_3D('',#883,#501,#502);
#419=AXIS2_PLACEMENT_3D('',#884,#503,#504);
#420=AXIS2_PLACEMENT_3D('',#885,#505,#506);
#421=AXIS2_PLACEMENT_3D('',#887,#507,#508);
#422=AXIS2_PLACEMENT_3D('',#888,#509,#510);
#423=AXIS2_PLACEMENT_3D('',#889,#511,#512);
#424=AXIS2_PLACEMENT_3D('',#891,#513,#514);
#425=AXIS2_PLACEMENT_3D('',#892,#515,#516);
#426=AXIS2_PLACEMENT_3D('',#894,#517,#518);
#427=AXIS2_PLACEMENT_3D('',#895,#519,#520);
#428=AXIS2_PLACEMENT_3D('',#897,#521,#522);
#429=AXIS2_PLACEMENT_3D('',#898,#523,#524);
#430=AXIS2_PLACEMENT_3D('',#900,#525,#526);
#431=AXIS2_PLACEMENT_3D('',#901,#527,#528);
#432=AXIS2_PLACEMENT_3D('',#903,#529,#530);
#433=AXIS2_PLACEMENT_3D('',#904,#531,#532);
#434=AXIS2_PLACEMENT_3D('',#905,#533,#534);
#435=AXIS2_PLACEMENT_3D('',#907,#535,#536);
#436=AXIS2_PLACEMENT_3D('',#908,#537,#538);
#437=AXIS2_PLACEMENT_3D('',#910,#539,#540);
#438=AXIS2_PLACEMENT_3D('',#911,#541,#542);
#439=DIRECTION('axis',(0.,0.,1.));
#440=DIRECTION('refdir',(1.,0.,0.));
#441=DIRECTION('center_axis',(3.04227983818753E-16,0.,1.));
#442=DIRECTION('ref_axis',(-1.,0.,1.63136744946288E-16));
#443=DIRECTION('center_axis',(3.04227983818753E-16,0.,1.));
#444=DIRECTION('ref_axis',(-1.,0.,3.04227983818753E-16));
#445=DIRECTION('center_axis',(-3.04227983818753E-16,0.,-1.));
#446=DIRECTION('ref_axis',(-1.,0.,0.));
#447=DIRECTION('center_axis',(3.04227983818753E-16,0.,1.));
#448=DIRECTION('ref_axis',(1.,0.,-3.5527136788005E-16));
#449=DIRECTION('center_axis',(-3.04227983818753E-16,0.,-1.));
#450=DIRECTION('ref_axis',(-1.,0.,3.04227983818753E-16));
#451=DIRECTION('center_axis',(3.04227983818753E-16,0.,1.));
#452=DIRECTION('ref_axis',(1.,0.,0.));
#453=DIRECTION('center_axis',(3.04227983818753E-16,0.,1.));
#454=DIRECTION('ref_axis',(1.,0.,-3.04227983818753E-16));
#455=DIRECTION('center_axis',(-9.61469896372151E-16,-1.,2.93547654519989E-31));
#456=DIRECTION('ref_axis',(1.,-9.76996261670138E-16,-3.10862446895044E-16));
#457=DIRECTION('',(3.04227983818753E-16,0.,1.));
#458=DIRECTION('',(1.,-9.61469896372151E-16,-3.04227983818753E-16));
#459=DIRECTION('',(3.04227983818753E-16,0.,1.));
#460=DIRECTION('center_axis',(-0.866025403784439,-0.499999999999999,2.6440736937774E-16));
#461=DIRECTION('ref_axis',(0.499999999999999,-0.866025403784439,-1.55431223447522E-16));
#462=DIRECTION('',(0.499999999999999,-0.866025403784439,-1.52113991909376E-16));
#463=DIRECTION('',(3.04227983818753E-16,0.,1.));
#464=DIRECTION('center_axis',(-0.866025403784438,0.500000000000001,2.6440736937774E-16));
#465=DIRECTION('ref_axis',(-0.500000000000001,-0.866025403784438,1.33226762955019E-16));
#466=DIRECTION('',(-0.500000000000001,-0.866025403784438,1.52113991909377E-16));
#467=DIRECTION('',(3.04227983818753E-16,0.,1.));
#468=DIRECTION('center_axis',(0.866025403784439,0.499999999999999,-2.6440736937774E-16));
#469=DIRECTION('ref_axis',(-0.499999999999999,0.866025403784439,1.33226762955019E-16));
#470=DIRECTION('',(-3.04227983818753E-16,0.,-1.));
#471=DIRECTION('',(-0.499999999999999,0.866025403784439,1.52113991909376E-16));
#472=DIRECTION('',(3.04227983818753E-16,0.,1.));
#473=DIRECTION('center_axis',(0.866025403784438,-0.500000000000001,-2.6440736937774E-16));
#474=DIRECTION('ref_axis',(0.500000000000001,0.866025403784438,-1.55431223447522E-16));
#475=DIRECTION('',(0.500000000000001,0.866025403784438,-1.52113991909377E-16));
#476=DIRECTION('center_axis',(5.49411369355515E-16,1.,-1.67741516868565E-31));
#477=DIRECTION('ref_axis',(-1.,5.32907051820075E-16,3.10862446895044E-16));
#478=DIRECTION('',(-1.,5.49411369355515E-16,3.04227983818753E-16));
#479=DIRECTION('center_axis',(3.04227983818753E-16,0.,1.));
#480=DIRECTION('ref_axis',(1.,0.,-2.19764547742206E-16));
#481=DIRECTION('center_axis',(3.04227983818753E-16,0.,1.));
#482=DIRECTION('ref_axis',(-1.,1.22464679914735E-16,3.04227983818753E-16));
#483=DIRECTION('center_axis',(3.04227983818753E-16,0.,1.));
#484=DIRECTION('ref_axis',(1.,0.,-2.19764547742206E-16));
#485=DIRECTION('center_axis',(-3.04227983818753E-16,0.,-1.));
#486=DIRECTION('ref_axis',(-1.,1.22464679914735E-16,3.04227983818753E-16));
#487=DIRECTION('center_axis',(3.04227983818753E-16,0.,1.));
#488=DIRECTION('ref_axis',(1.,0.,-2.19764547742206E-16));
#489=DIRECTION('center_axis',(-3.04227983818753E-16,0.,-1.));
#490=DIRECTION('ref_axis',(-1.,1.22464679914735E-16,3.04227983818753E-16));
#491=DIRECTION('center_axis',(3.04227983818753E-16,0.,1.));
#492=DIRECTION('ref_axis',(1.,0.,-2.19764547742206E-16));
#493=DIRECTION('center_axis',(-3.04227983818753E-16,0.,-1.));
#494=DIRECTION('ref_axis',(-1.,1.22464679914735E-16,3.04227983818753E-16));
#495=DIRECTION('center_axis',(3.04227983818753E-16,0.,1.));
#496=DIRECTION('ref_axis',(1.,0.,-2.19764547742206E-16));
#497=DIRECTION('center_axis',(-3.04227983818753E-16,0.,-1.));
#498=DIRECTION('ref_axis',(-1.,1.22464679914735E-16,3.04227983818753E-16));
#499=DIRECTION('center_axis',(3.04227983818753E-16,0.,1.));
#500=DIRECTION('ref_axis',(1.,0.,-2.19764547742206E-16));
#501=DIRECTION('center_axis',(-3.04227983818753E-16,0.,-1.));
#502=DIRECTION('ref_axis',(-1.,1.22464679914735E-16,3.04227983818753E-16));
#503=DIRECTION('center_axis',(3.04227983818753E-16,0.,1.));
#504=DIRECTION('ref_axis',(1.,0.,-2.66453525910038E-16));
#505=DIRECTION('center_axis',(-3.04227983818753E-16,0.,-1.));
#506=DIRECTION('ref_axis',(-1.,1.22464679914735E-16,3.04227983818753E-16));
#507=DIRECTION('center_axis',(3.04227983818753E-16,0.,1.));
#508=DIRECTION('ref_axis',(1.,0.,-3.04227983818753E-16));
#509=DIRECTION('center_axis',(3.04227983818753E-16,0.,1.));
#510=DIRECTION('ref_axis',(1.,0.,-2.19764547742206E-16));
#511=DIRECTION('center_axis',(-3.04227983818753E-16,0.,-1.));
#512=DIRECTION('ref_axis',(-1.,0.,3.10862446895044E-16));
#513=DIRECTION('center_axis',(3.04227983818753E-16,0.,1.));
#514=DIRECTION('ref_axis',(1.,0.,-3.04227983818753E-16));
#515=DIRECTION('center_axis',(-3.04227983818753E-16,0.,-1.));
#516=DIRECTION('ref_axis',(-1.,0.,1.35212437252779E-16));
#517=DIRECTION('center_axis',(3.04227983818753E-16,0.,1.));
#518=DIRECTION('ref_axis',(-1.,0.,0.));
#519=DIRECTION('center_axis',(3.04227983818753E-16,0.,1.));
#520=DIRECTION('ref_axis',(1.,0.,0.));
#521=DIRECTION('center_axis',(3.04227983818753E-16,0.,1.));
#522=DIRECTION('ref_axis',(1.,0.,-3.04227983818753E-16));
#523=DIRECTION('center_axis',(3.04227983818753E-16,0.,1.));
#524=DIRECTION('ref_axis',(1.,0.,0.));
#525=DIRECTION('center_axis',(3.04227983818753E-16,0.,1.));
#526=DIRECTION('ref_axis',(1.,0.,-3.04227983818753E-16));
#527=DIRECTION('center_axis',(3.04227983818753E-16,0.,1.));
#528=DIRECTION('ref_axis',(1.,0.,0.));
#529=DIRECTION('center_axis',(3.04227983818753E-16,0.,1.));
#530=DIRECTION('ref_axis',(1.,0.,-3.04227983818753E-16));
#531=DIRECTION('center_axis',(3.04227983818753E-16,0.,1.));
#532=DIRECTION('ref_axis',(1.,0.,0.));
#533=DIRECTION('center_axis',(3.04227983818753E-16,0.,1.));
#534=DIRECTION('ref_axis',(1.,0.,0.));
#535=DIRECTION('center_axis',(3.04227983818753E-16,0.,1.));
#536=DIRECTION('ref_axis',(1.,0.,-3.04227983818753E-16));
#537=DIRECTION('center_axis',(3.04227983818753E-16,0.,1.));
#538=DIRECTION('ref_axis',(1.,0.,0.));
#539=DIRECTION('center_axis',(3.04227983818753E-16,0.,1.));
#540=DIRECTION('ref_axis',(1.,0.,-3.04227983818753E-16));
#541=DIRECTION('center_axis',(-3.04227983818753E-16,0.,-1.));
#542=DIRECTION('ref_axis',(-1.,0.,3.04227983818753E-16));
#543=CARTESIAN_POINT('',(0.,0.,0.));
#544=CARTESIAN_POINT('Origin',(6.36907222717056E-15,0.,20.875));
#545=CARTESIAN_POINT('',(1.85000000000001,2.2655965784226E-16,21.));
#546=CARTESIAN_POINT('Origin',(6.40710072514791E-15,0.,21.));
#547=CARTESIAN_POINT('',(1.60000000000001,-1.95943487863577E-16,20.75));
#548=CARTESIAN_POINT('Origin',(6.33104372919322E-15,0.,20.75));
#549=CARTESIAN_POINT('Origin',(1.60000000000001,0.,21.));
#550=CARTESIAN_POINT('',(2.40000000000001,-2.93915231795365E-16,21.));
#551=CARTESIAN_POINT('Origin',(6.40710072514791E-15,0.,21.));
#552=CARTESIAN_POINT('Origin',(3.69211939905735E-15,0.,12.0758330249198));
#553=CARTESIAN_POINT('',(1.6,0.,3.15166604983954));
#554=CARTESIAN_POINT('Origin',(9.77138072966787E-16,0.,3.15166604983954));
#555=CARTESIAN_POINT('Origin',(-2.02075,-3.50004166939481,2.));
#556=CARTESIAN_POINT('',(2.02075,-3.50004166939481,2.6));
#557=CARTESIAN_POINT('',(-2.02075,-3.50004166939481,2.6));
#558=CARTESIAN_POINT('Ctrl Pts',(2.02075,-3.50004166939481,2.6));
#559=CARTESIAN_POINT('Ctrl Pts',(2.02075,-3.50004166939481,2.55119189740297));
#560=CARTESIAN_POINT('Ctrl Pts',(2.00553386046635,-3.50004166939481,2.49463324144627));
#561=CARTESIAN_POINT('Ctrl Pts',(1.95257113422312,-3.50004166939481,2.39256608637196));
#562=CARTESIAN_POINT('Ctrl Pts',(1.89859670141586,-3.50004166939481,2.3343074526296));
#563=CARTESIAN_POINT('Ctrl Pts',(1.7600356840338,-3.50004166939481,2.22552829669422));
#564=CARTESIAN_POINT('Ctrl Pts',(1.64004422320691,-3.50004166939481,2.1705848576234));
#565=CARTESIAN_POINT('Ctrl Pts',(1.3040360077648,-3.50004166939481,2.05981910103613));
#566=CARTESIAN_POINT('Ctrl Pts',(1.04177402448127,-3.50004166939481,2.03162346612218));
#567=CARTESIAN_POINT('Ctrl Pts',(0.511656720744284,-3.50004166939481,2.00329535260361));
#568=CARTESIAN_POINT('Ctrl Pts',(0.243817479743275,-3.50004166939481,2.00286276875037));
#569=CARTESIAN_POINT('Ctrl Pts',(-2.73754473421458E-15,-3.50004166939481,
2.00286276875037));
#570=CARTESIAN_POINT('Ctrl Pts',(-0.243817479743281,-3.50004166939481,2.00286276875037));
#571=CARTESIAN_POINT('Ctrl Pts',(-0.511656720744289,-3.50004166939481,2.00329535260361));
#572=CARTESIAN_POINT('Ctrl Pts',(-1.04177402448128,-3.50004166939481,2.03162346612218));
#573=CARTESIAN_POINT('Ctrl Pts',(-1.3040360077648,-3.50004166939481,2.05981910103613));
#574=CARTESIAN_POINT('Ctrl Pts',(-1.64004422320691,-3.50004166939481,2.1705848576234));
#575=CARTESIAN_POINT('Ctrl Pts',(-1.7600356840338,-3.50004166939481,2.22552829669422));
#576=CARTESIAN_POINT('Ctrl Pts',(-1.89859670141586,-3.50004166939481,2.33430745262961));
#577=CARTESIAN_POINT('Ctrl Pts',(-1.95257113422313,-3.50004166939481,2.39256608637196));
#578=CARTESIAN_POINT('Ctrl Pts',(-2.00553386046635,-3.50004166939481,2.49463324144627));
#579=CARTESIAN_POINT('Ctrl Pts',(-2.02075,-3.50004166939481,2.55119189740297));
#580=CARTESIAN_POINT('Ctrl Pts',(-2.02075,-3.50004166939481,2.6));
#581=CARTESIAN_POINT('',(2.02075,-3.50004166939481,4.7));
#582=CARTESIAN_POINT('',(2.02075,-3.50004166939481,3.5));
#583=CARTESIAN_POINT('',(1.32232014372465,-3.50004166939481,5.));
#584=CARTESIAN_POINT('Ctrl Pts',(1.32232014372465,-3.50004166939481,5.));
#585=CARTESIAN_POINT('Ctrl Pts',(1.44414672202126,-3.50004166939481,5.));
#586=CARTESIAN_POINT('Ctrl Pts',(1.58990261297038,-3.50004166939481,4.9887177080322));
#587=CARTESIAN_POINT('Ctrl Pts',(1.77249007237784,-3.50004166939481,4.94125665837086));
#588=CARTESIAN_POINT('Ctrl Pts',(1.84758735680089,-3.50004166939481,4.91312297721121));
#589=CARTESIAN_POINT('Ctrl Pts',(1.93798026376,-3.50004166939481,4.85372943706395));
#590=CARTESIAN_POINT('Ctrl Pts',(1.97483845168779,-3.50004166939481,4.82054277594179));
#591=CARTESIAN_POINT('Ctrl Pts',(2.00360213868894,-3.50004166939481,4.77234387583553));
#592=CARTESIAN_POINT('Ctrl Pts',(2.01084121077467,-3.50004166939481,4.75612857312013));
#593=CARTESIAN_POINT('Ctrl Pts',(2.01848264992118,-3.50004166939481,4.72909219477232));
#594=CARTESIAN_POINT('Ctrl Pts',(2.02075,-3.50004166939481,4.71329731985449));
#595=CARTESIAN_POINT('Ctrl Pts',(2.02075,-3.50004166939481,4.7));
#596=CARTESIAN_POINT('',(-1.32232014372466,-3.50004166939481,5.));
#597=CARTESIAN_POINT('',(0.239624999999999,-3.50004166939481,5.));
#598=CARTESIAN_POINT('',(-2.02075,-3.50004166939481,4.7));
#599=CARTESIAN_POINT('Ctrl Pts',(-2.02075,-3.50004166939481,4.7));
#600=CARTESIAN_POINT('Ctrl Pts',(-2.02075,-3.50004166939481,4.71329731985449));
#601=CARTESIAN_POINT('Ctrl Pts',(-2.01848264992118,-3.50004166939481,4.72909219477232));
#602=CARTESIAN_POINT('Ctrl Pts',(-2.01084121077467,-3.50004166939481,4.75612857312013));
#603=CARTESIAN_POINT('Ctrl Pts',(-2.00360213868895,-3.50004166939481,4.77234387583553));
#604=CARTESIAN_POINT('Ctrl Pts',(-1.97483845168779,-3.50004166939481,4.82054277594179));
#605=CARTESIAN_POINT('Ctrl Pts',(-1.93798026376001,-3.50004166939481,4.85372943706395));
#606=CARTESIAN_POINT('Ctrl Pts',(-1.84758735680089,-3.50004166939481,4.91312297721122));
#607=CARTESIAN_POINT('Ctrl Pts',(-1.77249007237784,-3.50004166939481,4.94125665837086));
#608=CARTESIAN_POINT('Ctrl Pts',(-1.58990261297038,-3.50004166939481,4.9887177080322));
#609=CARTESIAN_POINT('Ctrl Pts',(-1.44414672202126,-3.50004166939481,5.));
#610=CARTESIAN_POINT('Ctrl Pts',(-1.32232014372466,-3.50004166939481,5.));
#611=CARTESIAN_POINT('',(-2.02075,-3.50004166939481,3.5));
#612=CARTESIAN_POINT('Origin',(-4.0415,3.0140820395097E-15,2.));
#613=CARTESIAN_POINT('',(-4.0415,3.33066907387547E-15,2.6));
#614=CARTESIAN_POINT('Ctrl Pts',(-2.02075,-3.50004166939481,2.6));
#615=CARTESIAN_POINT('Ctrl Pts',(-2.02075,-3.50004166939481,2.55119189740297));
#616=CARTESIAN_POINT('Ctrl Pts',(-2.02835806976683,-3.48686410601114,2.49463324144627));
#617=CARTESIAN_POINT('Ctrl Pts',(-2.05483943288844,-3.44099703963083,2.39256608637196));
#618=CARTESIAN_POINT('Ctrl Pts',(-2.08182664929207,-3.39425380966488,2.33430745262961));
#619=CARTESIAN_POINT('Ctrl Pts',(-2.1511071579831,-3.2742564486378,2.22552829669422));
#620=CARTESIAN_POINT('Ctrl Pts',(-2.21110288839655,-3.1703407953245,2.1705848576234));
#621=CARTESIAN_POINT('Ctrl Pts',(-2.3791069961176,-2.87934914487136,2.05981910103613));
#622=CARTESIAN_POINT('Ctrl Pts',(-2.51023798775937,-2.65222360490094,2.03162346612218));
#623=CARTESIAN_POINT('Ctrl Pts',(-2.77529663962786,-2.193128552879,2.00329535260361));
#624=CARTESIAN_POINT('Ctrl Pts',(-2.90921626012836,-1.96117296604178,2.00286276875038));
#625=CARTESIAN_POINT('Ctrl Pts',(-3.031125,-1.7500208346974,2.00286276875038));
#626=CARTESIAN_POINT('Ctrl Pts',(-3.15303373987164,-1.53886870335303,2.00286276875038));
#627=CARTESIAN_POINT('Ctrl Pts',(-3.28695336037214,-1.30691311651581,2.00329535260361));
#628=CARTESIAN_POINT('Ctrl Pts',(-3.55201201224064,-0.847818064493868,2.03162346612218));
#629=CARTESIAN_POINT('Ctrl Pts',(-3.6831430038824,-0.620692524523441,2.05981910103613));
#630=CARTESIAN_POINT('Ctrl Pts',(-3.85114711160346,-0.3297008740703,2.1705848576234));
#631=CARTESIAN_POINT('Ctrl Pts',(-3.9111428420169,-0.225785220757009,2.22552829669422));
#632=CARTESIAN_POINT('Ctrl Pts',(-3.98042335070793,-0.105787859729927,2.33430745262961));
#633=CARTESIAN_POINT('Ctrl Pts',(-4.00741056711156,-0.0590446297639791,
2.39256608637196));
#634=CARTESIAN_POINT('Ctrl Pts',(-4.03389193023318,-0.0131775633836634,
2.49463324144627));
#635=CARTESIAN_POINT('Ctrl Pts',(-4.0415,3.39215538877322E-15,2.55119189740297));
#636=CARTESIAN_POINT('Ctrl Pts',(-4.0415,3.33084452609735E-15,2.6));
#637=CARTESIAN_POINT('',(-2.36996492813767,-2.89518367109885,5.));
#638=CARTESIAN_POINT('Ctrl Pts',(-2.36996492813767,-2.89518367109885,5.));
#639=CARTESIAN_POINT('Ctrl Pts',(-2.30905163898937,-3.00068858275984,5.));
#640=CARTESIAN_POINT('Ctrl Pts',(-2.23617369351481,-3.12691688707301,4.9887177080322));
#641=CARTESIAN_POINT('Ctrl Pts',(-2.14487996381108,-3.28504226533233,4.94125665837086));
#642=CARTESIAN_POINT('Ctrl Pts',(-2.10733132159956,-3.35007842139792,4.91312297721122));
#643=CARTESIAN_POINT('Ctrl Pts',(-2.06213486812,-3.42836097514643,4.85372943706395));
#644=CARTESIAN_POINT('Ctrl Pts',(-2.04370577415611,-3.46028110222936,4.82054277594179));
#645=CARTESIAN_POINT('Ctrl Pts',(-2.02932393065553,-3.48519118587886,4.77234387583553));
#646=CARTESIAN_POINT('Ctrl Pts',(-2.02570439461267,-3.49146040620493,4.75612857312013));
#647=CARTESIAN_POINT('Ctrl Pts',(-2.02188367503941,-3.49807808662728,4.72909219477232));
#648=CARTESIAN_POINT('Ctrl Pts',(-2.02075,-3.50004166939481,4.71329731985449));
#649=CARTESIAN_POINT('Ctrl Pts',(-2.02075,-3.50004166939481,4.7));
#650=CARTESIAN_POINT('',(-3.69228507186233,-0.604857998295959,5.));
#651=CARTESIAN_POINT('',(-3.2238125,-1.41627629471397,5.));
#652=CARTESIAN_POINT('',(-4.0415,3.33066907387547E-15,4.7));
#653=CARTESIAN_POINT('Ctrl Pts',(-4.0415,1.33358298068744E-15,4.7));
#654=CARTESIAN_POINT('Ctrl Pts',(-4.0415,1.30015086510447E-15,4.71329731985449));
#655=CARTESIAN_POINT('Ctrl Pts',(-4.04036632496059,-0.00196358276752907,
4.72909219477233));
#656=CARTESIAN_POINT('Ctrl Pts',(-4.03654560538733,-0.00858126318987874,
4.75612857312013));
#657=CARTESIAN_POINT('Ctrl Pts',(-4.03292606934447,-0.014850483515945,4.77234387583553));
#658=CARTESIAN_POINT('Ctrl Pts',(-4.01854422584389,-0.0397605671654476,
4.82054277594179));
#659=CARTESIAN_POINT('Ctrl Pts',(-4.00011513188,-0.0716806942483713,4.85372943706395));
#660=CARTESIAN_POINT('Ctrl Pts',(-3.95491867840044,-0.149963247996889,4.91312297721122));
#661=CARTESIAN_POINT('Ctrl Pts',(-3.91737003618892,-0.214999404062475,4.94125665837086));
#662=CARTESIAN_POINT('Ctrl Pts',(-3.82607630648519,-0.373124782321792,4.9887177080322));
#663=CARTESIAN_POINT('Ctrl Pts',(-3.75319836101063,-0.499353086634968,5.));
#664=CARTESIAN_POINT('Ctrl Pts',(-3.69228507186233,-0.604857998295959,5.));
#665=CARTESIAN_POINT('',(-4.0415,3.33066907387547E-15,3.5));
#666=CARTESIAN_POINT('Origin',(-2.02075,3.50004166939481,2.));
#667=CARTESIAN_POINT('',(-2.02075,3.50004166939481,2.6));
#668=CARTESIAN_POINT('Ctrl Pts',(-4.0415,1.94289029309402E-15,2.6));
#669=CARTESIAN_POINT('Ctrl Pts',(-4.0415,1.88157943041815E-15,2.55119189740297));
#670=CARTESIAN_POINT('Ctrl Pts',(-4.03389193023318,0.0131775633836688,2.49463324144627));
#671=CARTESIAN_POINT('Ctrl Pts',(-4.00741056711156,0.0590446297639843,2.39256608637196));
#672=CARTESIAN_POINT('Ctrl Pts',(-3.98042335070793,0.105787859729932,2.33430745262961));
#673=CARTESIAN_POINT('Ctrl Pts',(-3.9111428420169,0.225785220757014,2.22552829669422));
#674=CARTESIAN_POINT('Ctrl Pts',(-3.85114711160346,0.329700874070303,2.1705848576234));
#675=CARTESIAN_POINT('Ctrl Pts',(-3.6831430038824,0.620692524523443,2.05981910103613));
#676=CARTESIAN_POINT('Ctrl Pts',(-3.55201201224064,0.84781806449387,2.03162346612218));
#677=CARTESIAN_POINT('Ctrl Pts',(-3.28695336037214,1.30691311651581,2.00329535260361));
#678=CARTESIAN_POINT('Ctrl Pts',(-3.15303373987164,1.53886870335303,2.00286276875038));
#679=CARTESIAN_POINT('Ctrl Pts',(-3.031125,1.75002083469741,2.00286276875038));
#680=CARTESIAN_POINT('Ctrl Pts',(-2.90921626012836,1.96117296604178,2.00286276875038));
#681=CARTESIAN_POINT('Ctrl Pts',(-2.77529663962785,2.193128552879,2.00329535260361));
#682=CARTESIAN_POINT('Ctrl Pts',(-2.51023798775936,2.65222360490094,2.03162346612218));
#683=CARTESIAN_POINT('Ctrl Pts',(-2.3791069961176,2.87934914487137,2.05981910103613));
#684=CARTESIAN_POINT('Ctrl Pts',(-2.21110288839654,3.17034079532451,2.1705848576234));
#685=CARTESIAN_POINT('Ctrl Pts',(-2.1511071579831,3.2742564486378,2.22552829669422));
#686=CARTESIAN_POINT('Ctrl Pts',(-2.08182664929207,3.39425380966488,2.33430745262961));
#687=CARTESIAN_POINT('Ctrl Pts',(-2.05483943288843,3.44099703963083,2.39256608637196));
#688=CARTESIAN_POINT('Ctrl Pts',(-2.02835806976682,3.48686410601114,2.49463324144627));
#689=CARTESIAN_POINT('Ctrl Pts',(-2.02075,3.50004166939481,2.55119189740297));
#690=CARTESIAN_POINT('Ctrl Pts',(-2.02075,3.50004166939481,2.6));
#691=CARTESIAN_POINT('',(-3.69228507186233,0.604857998295965,5.));
#692=CARTESIAN_POINT('Ctrl Pts',(-3.69228507186233,0.604857998295965,5.));
#693=CARTESIAN_POINT('Ctrl Pts',(-3.77552176490526,0.46068781689159,5.));
#694=CARTESIAN_POINT('Ctrl Pts',(-3.87501444863464,0.288361433690916,4.98233357271132));
#695=CARTESIAN_POINT('Ctrl Pts',(-3.976855849155,0.111966953675682,4.88760626140557));
#696=CARTESIAN_POINT('Ctrl Pts',(-4.00604416895093,0.0614113008015701,4.84935691535678));
#697=CARTESIAN_POINT('Ctrl Pts',(-4.02884394766545,0.0219209256666952,4.78752890465593));
#698=CARTESIAN_POINT('Ctrl Pts',(-4.03424576320623,0.0125647066969409,4.76790858585565));
#699=CARTESIAN_POINT('Ctrl Pts',(-4.03984651984167,0.0028639116435404,4.73504183893002));
#700=CARTESIAN_POINT('Ctrl Pts',(-4.0415,4.39190725761383E-15,4.71605805513164));
#701=CARTESIAN_POINT('Ctrl Pts',(-4.0415,4.35153410264174E-15,4.7));
#702=CARTESIAN_POINT('',(-2.36996492813767,2.89518367109885,5.));
#703=CARTESIAN_POINT('',(-2.2134375,3.16629712941138,5.));
#704=CARTESIAN_POINT('',(-2.02075,3.50004166939481,4.7));
#705=CARTESIAN_POINT('Ctrl Pts',(-2.02075,3.50004166939481,4.7));
#706=CARTESIAN_POINT('Ctrl Pts',(-2.02075,3.50004166939481,4.71605805513164));
#707=CARTESIAN_POINT('Ctrl Pts',(-2.02240348015833,3.49717775775127,4.73504183893002));
#708=CARTESIAN_POINT('Ctrl Pts',(-2.02800423679376,3.48747696269787,4.76790858585565));
#709=CARTESIAN_POINT('Ctrl Pts',(-2.03340605233455,3.47812074372812,4.78752890465592));
#710=CARTESIAN_POINT('Ctrl Pts',(-2.05620583104907,3.43863036859324,4.84935691535678));
#711=CARTESIAN_POINT('Ctrl Pts',(-2.08539415084499,3.38807471571913,4.88760626140557));
#712=CARTESIAN_POINT('Ctrl Pts',(-2.18723555136535,3.2116802357039,4.98233357271132));
#713=CARTESIAN_POINT('Ctrl Pts',(-2.28672823509474,3.03935385250322,5.));
#714=CARTESIAN_POINT('Ctrl Pts',(-2.36996492813767,2.89518367109885,5.));
#715=CARTESIAN_POINT('',(-2.02075,3.50004166939481,3.5));
#716=CARTESIAN_POINT('Origin',(4.0415,-4.08451408709346E-15,2.));
#717=CARTESIAN_POINT('',(2.02075,3.50004166939481,2.6));
#718=CARTESIAN_POINT('',(4.0415,-9.89882007750806E-16,2.6));
#719=CARTESIAN_POINT('Ctrl Pts',(2.02075,3.50004166939481,2.6));
#720=CARTESIAN_POINT('Ctrl Pts',(2.02075,3.50004166939481,2.55119189740297));
#721=CARTESIAN_POINT('Ctrl Pts',(2.02835806976683,3.48686410601114,2.49463324144627));
#722=CARTESIAN_POINT('Ctrl Pts',(2.05483943288844,3.44099703963083,2.39256608637196));
#723=CARTESIAN_POINT('Ctrl Pts',(2.08182664929207,3.39425380966488,2.33430745262961));
#724=CARTESIAN_POINT('Ctrl Pts',(2.1511071579831,3.2742564486378,2.22552829669422));
#725=CARTESIAN_POINT('Ctrl Pts',(2.21110288839655,3.17034079532451,2.1705848576234));
#726=CARTESIAN_POINT('Ctrl Pts',(2.3791069961176,2.87934914487137,2.05981910103613));
#727=CARTESIAN_POINT('Ctrl Pts',(2.51023798775937,2.65222360490094,2.03162346612218));
#728=CARTESIAN_POINT('Ctrl Pts',(2.77529663962786,2.193128552879,2.0032953526036));
#729=CARTESIAN_POINT('Ctrl Pts',(2.90921626012836,1.96117296604178,2.00286276875037));
#730=CARTESIAN_POINT('Ctrl Pts',(3.031125,1.7500208346974,2.00286276875037));
#731=CARTESIAN_POINT('Ctrl Pts',(3.15303373987164,1.53886870335302,2.00286276875037));
#732=CARTESIAN_POINT('Ctrl Pts',(3.28695336037215,1.30691311651581,2.0032953526036));
#733=CARTESIAN_POINT('Ctrl Pts',(3.55201201224064,0.847818064493864,2.03162346612218));
#734=CARTESIAN_POINT('Ctrl Pts',(3.6831430038824,0.620692524523437,2.05981910103613));
#735=CARTESIAN_POINT('Ctrl Pts',(3.85114711160346,0.329700874070296,2.1705848576234));
#736=CARTESIAN_POINT('Ctrl Pts',(3.9111428420169,0.225785220757006,2.22552829669422));
#737=CARTESIAN_POINT('Ctrl Pts',(3.98042335070793,0.105787859729925,2.3343074526296));
#738=CARTESIAN_POINT('Ctrl Pts',(4.00741056711157,0.0590446297639768,2.39256608637196));
#739=CARTESIAN_POINT('Ctrl Pts',(4.03389193023318,0.0131775633836612,2.49463324144626));
#740=CARTESIAN_POINT('Ctrl Pts',(4.0415,-3.37849725369077E-15,2.55119189740297));
#741=CARTESIAN_POINT('Ctrl Pts',(4.0415,-3.43980811636664E-15,2.6));
#742=CARTESIAN_POINT('',(2.02075,3.50004166939481,4.7));
#743=CARTESIAN_POINT('',(2.02075,3.50004166939481,3.5));
#744=CARTESIAN_POINT('',(2.36996492813767,2.89518367109885,5.));
#745=CARTESIAN_POINT('Ctrl Pts',(2.36996492813767,2.89518367109885,5.));
#746=CARTESIAN_POINT('Ctrl Pts',(2.28672823509474,3.03935385250322,5.));
#747=CARTESIAN_POINT('Ctrl Pts',(2.18723555136536,3.2116802357039,4.98233357271132));
#748=CARTESIAN_POINT('Ctrl Pts',(2.085394150845,3.38807471571913,4.88760626140557));
#749=CARTESIAN_POINT('Ctrl Pts',(2.05620583104907,3.43863036859324,4.84935691535678));
#750=CARTESIAN_POINT('Ctrl Pts',(2.03340605233455,3.47812074372812,4.78752890465592));
#751=CARTESIAN_POINT('Ctrl Pts',(2.02800423679377,3.48747696269787,4.76790858585565));
#752=CARTESIAN_POINT('Ctrl Pts',(2.02240348015833,3.49717775775127,4.73504183893002));
#753=CARTESIAN_POINT('Ctrl Pts',(2.02075,3.50004166939481,4.71605805513164));
#754=CARTESIAN_POINT('Ctrl Pts',(2.02075,3.50004166939481,4.7));
#755=CARTESIAN_POINT('',(3.69228507186233,0.604857998295957,5.));
#756=CARTESIAN_POINT('',(3.8488125,0.333744539983425,5.));
#757=CARTESIAN_POINT('',(4.0415,0.,4.7));
#758=CARTESIAN_POINT('Ctrl Pts',(4.0415,-3.38529290067008E-15,4.7));
#759=CARTESIAN_POINT('Ctrl Pts',(4.0415,-3.42566605564217E-15,4.71605805513164));
#760=CARTESIAN_POINT('Ctrl Pts',(4.03984651984167,0.00286391164353231,4.73504183893002));
#761=CARTESIAN_POINT('Ctrl Pts',(4.03424576320624,0.0125647066969325,4.76790858585565));
#762=CARTESIAN_POINT('Ctrl Pts',(4.02884394766545,0.021920925666687,4.78752890465592));
#763=CARTESIAN_POINT('Ctrl Pts',(4.00604416895093,0.0614113008015621,4.84935691535678));
#764=CARTESIAN_POINT('Ctrl Pts',(3.97685584915501,0.111966953675674,4.88760626140557));
#765=CARTESIAN_POINT('Ctrl Pts',(3.87501444863465,0.288361433690908,4.98233357271132));
#766=CARTESIAN_POINT('Ctrl Pts',(3.77552176490526,0.460687816891582,5.));
#767=CARTESIAN_POINT('Ctrl Pts',(3.69228507186233,0.604857998295957,5.));
#768=CARTESIAN_POINT('',(4.0415,-4.9960036108132E-15,3.5));
#769=CARTESIAN_POINT('Origin',(2.02075,-3.50004166939481,2.));
#770=CARTESIAN_POINT('Ctrl Pts',(4.0415,-3.96510279700137E-15,2.6));
#771=CARTESIAN_POINT('Ctrl Pts',(4.0415,-4.02641365967724E-15,2.55119189740297));
#772=CARTESIAN_POINT('Ctrl Pts',(4.03389193023318,-0.0131775633836706,2.49463324144627));
#773=CARTESIAN_POINT('Ctrl Pts',(4.00741056711156,-0.0590446297639863,2.39256608637196));
#774=CARTESIAN_POINT('Ctrl Pts',(3.98042335070793,-0.105787859729935,2.3343074526296));
#775=CARTESIAN_POINT('Ctrl Pts',(3.9111428420169,-0.225785220757017,2.22552829669422));
#776=CARTESIAN_POINT('Ctrl Pts',(3.85114711160346,-0.329700874070308,2.1705848576234));
#777=CARTESIAN_POINT('Ctrl Pts',(3.6831430038824,-0.620692524523448,2.05981910103613));
#778=CARTESIAN_POINT('Ctrl Pts',(3.55201201224064,-0.847818064493874,2.03162346612218));
#779=CARTESIAN_POINT('Ctrl Pts',(3.28695336037214,-1.30691311651582,2.0032953526036));
#780=CARTESIAN_POINT('Ctrl Pts',(3.15303373987164,-1.53886870335303,2.00286276875037));
#781=CARTESIAN_POINT('Ctrl Pts',(3.031125,-1.75002083469741,2.00286276875037));
#782=CARTESIAN_POINT('Ctrl Pts',(2.90921626012836,-1.96117296604178,2.00286276875037));
#783=CARTESIAN_POINT('Ctrl Pts',(2.77529663962786,-2.193128552879,2.00329535260361));
#784=CARTESIAN_POINT('Ctrl Pts',(2.51023798775936,-2.65222360490094,2.03162346612218));
#785=CARTESIAN_POINT('Ctrl Pts',(2.3791069961176,-2.87934914487137,2.05981910103613));
#786=CARTESIAN_POINT('Ctrl Pts',(2.21110288839654,-3.17034079532451,2.1705848576234));
#787=CARTESIAN_POINT('Ctrl Pts',(2.1511071579831,-3.2742564486378,2.22552829669422));
#788=CARTESIAN_POINT('Ctrl Pts',(2.08182664929207,-3.39425380966488,2.3343074526296));
#789=CARTESIAN_POINT('Ctrl Pts',(2.05483943288844,-3.44099703963083,2.39256608637196));
#790=CARTESIAN_POINT('Ctrl Pts',(2.02835806976682,-3.48686410601114,2.49463324144627));
#791=CARTESIAN_POINT('Ctrl Pts',(2.02075,-3.50004166939481,2.55119189740297));
#792=CARTESIAN_POINT('Ctrl Pts',(2.02075,-3.50004166939481,2.6));
#793=CARTESIAN_POINT('',(3.69228507186233,-0.604857998295966,5.));
#794=CARTESIAN_POINT('Ctrl Pts',(3.69228507186233,-0.604857998295966,5.));
#795=CARTESIAN_POINT('Ctrl Pts',(3.75319836101063,-0.499353086634975,5.));
#796=CARTESIAN_POINT('Ctrl Pts',(3.82607630648519,-0.373124782321799,4.9887177080322));
#797=CARTESIAN_POINT('Ctrl Pts',(3.91737003618892,-0.214999404062483,4.94125665837086));
#798=CARTESIAN_POINT('Ctrl Pts',(3.95491867840045,-0.149963247996896,4.91312297721122));
#799=CARTESIAN_POINT('Ctrl Pts',(4.00011513188,-0.0716806942483785,4.85372943706395));
#800=CARTESIAN_POINT('Ctrl Pts',(4.0185442258439,-0.039760567165455,4.82054277594179));
#801=CARTESIAN_POINT('Ctrl Pts',(4.03292606934447,-0.0148504835159523,4.77234387583553));
#802=CARTESIAN_POINT('Ctrl Pts',(4.03654560538734,-0.00858126318988503,
4.75612857312013));
#803=CARTESIAN_POINT('Ctrl Pts',(4.04036632496059,-0.00196358276753586,
4.72909219477232));
#804=CARTESIAN_POINT('Ctrl Pts',(4.0415,-3.93174266310875E-15,4.71329731985448));
#805=CARTESIAN_POINT('Ctrl Pts',(4.0415,-3.96517477869171E-15,4.7));
#806=CARTESIAN_POINT('',(2.36996492813767,-2.89518367109885,5.));
#807=CARTESIAN_POINT('',(2.8384375,-2.08376537468083,5.));
#808=CARTESIAN_POINT('Ctrl Pts',(2.02075,-3.50004166939481,4.7));
#809=CARTESIAN_POINT('Ctrl Pts',(2.02075,-3.50004166939481,4.71329731985449));
#810=CARTESIAN_POINT('Ctrl Pts',(2.02188367503941,-3.49807808662728,4.72909219477232));
#811=CARTESIAN_POINT('Ctrl Pts',(2.02570439461266,-3.49146040620493,4.75612857312013));
#812=CARTESIAN_POINT('Ctrl Pts',(2.02932393065553,-3.48519118587886,4.77234387583553));
#813=CARTESIAN_POINT('Ctrl Pts',(2.0437057741561,-3.46028110222936,4.82054277594179));
#814=CARTESIAN_POINT('Ctrl Pts',(2.06213486812,-3.42836097514644,4.85372943706395));
#815=CARTESIAN_POINT('Ctrl Pts',(2.10733132159956,-3.35007842139792,4.91312297721122));
#816=CARTESIAN_POINT('Ctrl Pts',(2.14487996381108,-3.28504226533233,4.94125665837086));
#817=CARTESIAN_POINT('Ctrl Pts',(2.23617369351481,-3.12691688707302,4.9887177080322));
#818=CARTESIAN_POINT('Ctrl Pts',(2.30905163898937,-3.00068858275984,5.));
#819=CARTESIAN_POINT('Ctrl Pts',(2.36996492813767,-2.89518367109885,5.));
#820=CARTESIAN_POINT('Origin',(2.02075,3.50004166939481,2.));
#821=CARTESIAN_POINT('Ctrl Pts',(-2.02075,3.50004166939481,2.6));
#822=CARTESIAN_POINT('Ctrl Pts',(-2.02075,3.50004166939481,2.55119189740297));
#823=CARTESIAN_POINT('Ctrl Pts',(-2.00553386046635,3.50004166939481,2.49463324144627));
#824=CARTESIAN_POINT('Ctrl Pts',(-1.95257113422312,3.50004166939481,2.39256608637196));
#825=CARTESIAN_POINT('Ctrl Pts',(-1.89859670141586,3.50004166939481,2.33430745262961));
#826=CARTESIAN_POINT('Ctrl Pts',(-1.7600356840338,3.50004166939481,2.22552829669422));
#827=CARTESIAN_POINT('Ctrl Pts',(-1.64004422320691,3.50004166939481,2.1705848576234));
#828=CARTESIAN_POINT('Ctrl Pts',(-1.3040360077648,3.50004166939481,2.05981910103613));
#829=CARTESIAN_POINT('Ctrl Pts',(-1.04177402448127,3.50004166939481,2.03162346612218));
#830=CARTESIAN_POINT('Ctrl Pts',(-0.511656720744285,3.50004166939481,2.00329535260361));
#831=CARTESIAN_POINT('Ctrl Pts',(-0.243817479743276,3.50004166939481,2.00286276875037));
#832=CARTESIAN_POINT('Ctrl Pts',(2.55060265334023E-15,3.50004166939481,
2.00286276875037));
#833=CARTESIAN_POINT('Ctrl Pts',(0.243817479743281,3.50004166939481,2.00286276875037));
#834=CARTESIAN_POINT('Ctrl Pts',(0.51165672074429,3.50004166939481,2.00329535260361));
#835=CARTESIAN_POINT('Ctrl Pts',(1.04177402448128,3.50004166939481,2.03162346612218));
#836=CARTESIAN_POINT('Ctrl Pts',(1.30403600776481,3.50004166939481,2.05981910103613));
#837=CARTESIAN_POINT('Ctrl Pts',(1.64004422320691,3.50004166939481,2.1705848576234));
#838=CARTESIAN_POINT('Ctrl Pts',(1.7600356840338,3.50004166939481,2.22552829669422));
#839=CARTESIAN_POINT('Ctrl Pts',(1.89859670141586,3.50004166939481,2.3343074526296));
#840=CARTESIAN_POINT('Ctrl Pts',(1.95257113422313,3.50004166939481,2.39256608637196));
#841=CARTESIAN_POINT('Ctrl Pts',(2.00553386046636,3.50004166939481,2.49463324144627));
#842=CARTESIAN_POINT('Ctrl Pts',(2.02075,3.50004166939481,2.55119189740297));
#843=CARTESIAN_POINT('Ctrl Pts',(2.02075,3.50004166939481,2.6));
#844=CARTESIAN_POINT('',(-1.32232014372465,3.50004166939481,5.));
#845=CARTESIAN_POINT('Ctrl Pts',(-1.32232014372465,3.50004166939481,5.));
#846=CARTESIAN_POINT('Ctrl Pts',(-1.44414672202125,3.50004166939481,5.));
#847=CARTESIAN_POINT('Ctrl Pts',(-1.58990261297038,3.50004166939481,4.9887177080322));
#848=CARTESIAN_POINT('Ctrl Pts',(-1.77249007237783,3.50004166939481,4.94125665837086));
#849=CARTESIAN_POINT('Ctrl Pts',(-1.84758735680088,3.50004166939481,4.91312297721122));
#850=CARTESIAN_POINT('Ctrl Pts',(-1.93798026376,3.50004166939481,4.85372943706395));
#851=CARTESIAN_POINT('Ctrl Pts',(-1.97483845168779,3.50004166939481,4.82054277594179));
#852=CARTESIAN_POINT('Ctrl Pts',(-2.00360213868894,3.50004166939481,4.77234387583553));
#853=CARTESIAN_POINT('Ctrl Pts',(-2.01084121077467,3.50004166939481,4.75612857312013));
#854=CARTESIAN_POINT('Ctrl Pts',(-2.01848264992117,3.50004166939481,4.72909219477232));
#855=CARTESIAN_POINT('Ctrl Pts',(-2.02074999999999,3.50004166939481,4.71329731985449));
#856=CARTESIAN_POINT('Ctrl Pts',(-2.02074999999999,3.50004166939481,4.7));
#857=CARTESIAN_POINT('',(1.32232014372466,3.50004166939481,5.));
#858=CARTESIAN_POINT('',(2.260375,3.50004166939481,5.));
#859=CARTESIAN_POINT('Ctrl Pts',(2.02075,3.50004166939481,4.7));
#860=CARTESIAN_POINT('Ctrl Pts',(2.02075,3.50004166939481,4.71329731985449));
#861=CARTESIAN_POINT('Ctrl Pts',(2.01848264992118,3.50004166939481,4.72909219477232));
#862=CARTESIAN_POINT('Ctrl Pts',(2.01084121077467,3.50004166939481,4.75612857312013));
#863=CARTESIAN_POINT('Ctrl Pts',(2.00360213868895,3.50004166939481,4.77234387583553));
#864=CARTESIAN_POINT('Ctrl Pts',(1.97483845168779,3.50004166939481,4.82054277594179));
#865=CARTESIAN_POINT('Ctrl Pts',(1.93798026376001,3.50004166939481,4.85372943706395));
#866=CARTESIAN_POINT('Ctrl Pts',(1.84758735680089,3.50004166939481,4.91312297721121));
#867=CARTESIAN_POINT('Ctrl Pts',(1.77249007237784,3.50004166939481,4.94125665837086));
#868=CARTESIAN_POINT('Ctrl Pts',(1.58990261297039,3.50004166939481,4.9887177080322));
#869=CARTESIAN_POINT('Ctrl Pts',(1.44414672202126,3.50004166939481,5.));
#870=CARTESIAN_POINT('Ctrl Pts',(1.32232014372466,3.50004166939481,5.));
#871=CARTESIAN_POINT('Origin',(8.09305822882848E-16,0.,2.6));
#872=CARTESIAN_POINT('',(3.4415,0.,2.));
#873=CARTESIAN_POINT('Origin',(6.26769032591596E-16,0.,2.));
#874=CARTESIAN_POINT('Origin',(1.44818458890223E-15,0.,4.7));
#875=CARTESIAN_POINT('Origin',(1.53945298404786E-15,0.,5.));
#876=CARTESIAN_POINT('Origin',(1.44818458890223E-15,0.,4.7));
#877=CARTESIAN_POINT('Origin',(1.53945298404786E-15,0.,5.));
#878=CARTESIAN_POINT('Origin',(1.44818458890223E-15,0.,4.7));
#879=CARTESIAN_POINT('Origin',(1.53945298404786E-15,0.,5.));
#880=CARTESIAN_POINT('Origin',(1.44818458890223E-15,0.,4.7));
#881=CARTESIAN_POINT('Origin',(1.53945298404786E-15,0.,5.));
#882=CARTESIAN_POINT('Origin',(1.44818458890223E-15,0.,4.7));
#883=CARTESIAN_POINT('Origin',(1.53945298404786E-15,0.,5.));
#884=CARTESIAN_POINT('Origin',(2.5,0.,5.));
#885=CARTESIAN_POINT('Origin',(1.53945298404786E-15,0.,5.));
#886=CARTESIAN_POINT('',(2.5,0.,5.));
#887=CARTESIAN_POINT('Origin',(1.53945298404786E-15,0.,5.));
#888=CARTESIAN_POINT('Origin',(1.44818458890223E-15,0.,4.7));
#889=CARTESIAN_POINT('Origin',(4.0415,0.,2.));
#890=CARTESIAN_POINT('',(2.15041507641942,0.,2.));
#891=CARTESIAN_POINT('Origin',(6.26769032591596E-16,0.,2.));
#892=CARTESIAN_POINT('Origin',(6.31583233000228E-15,0.,20.7));
#893=CARTESIAN_POINT('',(3.00000000000001,3.67394039744206E-16,20.4));
#894=CARTESIAN_POINT('Origin',(6.22456393485665E-15,0.,20.4));
#895=CARTESIAN_POINT('Origin',(4.22913032509716E-15,0.,13.8409925585666));
#896=CARTESIAN_POINT('',(3.,0.,6.6819851171331));
#897=CARTESIAN_POINT('Origin',(2.05115992504641E-15,0.,6.6819851171331));
#898=CARTESIAN_POINT('Origin',(3.22541048772843E-16,0.,1.));
#899=CARTESIAN_POINT('',(0.75,0.,0.));
#900=CARTESIAN_POINT('Origin',(1.83130649540895E-17,0.,2.28170987864065E-16));
#901=CARTESIAN_POINT('Origin',(1.76762397191192E-15,0.,5.75));
#902=CARTESIAN_POINT('',(2.5,0.,6.5));
#903=CARTESIAN_POINT('Origin',(1.99579495977599E-15,0.,6.5));
#904=CARTESIAN_POINT('Origin',(2.0234774424112E-15,0.,6.59099255856655));
#905=CARTESIAN_POINT('Origin',(6.34628161678877E-16,0.,2.02583302491977));
#906=CARTESIAN_POINT('',(0.3,0.,0.9));
#907=CARTESIAN_POINT('Origin',(2.92118250390967E-16,0.,0.9));
#908=CARTESIAN_POINT('Origin',(1.55215657672528E-16,0.,0.45));
#909=CARTESIAN_POINT('',(0.3,0.,-1.38777878078145E-16));
#910=CARTESIAN_POINT('Origin',(1.83130649540894E-17,0.,-4.75094829325186E-17));
#911=CARTESIAN_POINT('Origin',(0.75,0.,0.));
#912=UNCERTAINTY_MEASURE_WITH_UNIT(LENGTH_MEASURE(0.01),#916,
'DISTANCE_ACCURACY_VALUE',
'Maximum model space distance between geometric entities at asserted c
onnectivities');
#913=UNCERTAINTY_MEASURE_WITH_UNIT(LENGTH_MEASURE(1.E-6),#916,
'DISTANCE_ACCURACY_VALUE',
'Maximum model space distance between geometric entities at asserted c
onnectivities');
#914=(
GEOMETRIC_REPRESENTATION_CONTEXT(3)
GLOBAL_UNCERTAINTY_ASSIGNED_CONTEXT((#912))
GLOBAL_UNIT_ASSIGNED_CONTEXT((#916,#919,#917))
REPRESENTATION_CONTEXT('','3D')
);
#915=(
GEOMETRIC_REPRESENTATION_CONTEXT(3)
GLOBAL_UNCERTAINTY_ASSIGNED_CONTEXT((#913))
GLOBAL_UNIT_ASSIGNED_CONTEXT((#916,#919,#917))
REPRESENTATION_CONTEXT('','3D')
);
#916=(
LENGTH_UNIT()
NAMED_UNIT(*)
SI_UNIT(.MILLI.,.METRE.)
);
#917=(
NAMED_UNIT(*)
SI_UNIT($,.STERADIAN.)
SOLID_ANGLE_UNIT()
);
#918=DIMENSIONAL_EXPONENTS(0.,0.,0.,0.,0.,0.,0.);
#919=(
CONVERSION_BASED_UNIT('degree',#921)
NAMED_UNIT(#918)
PLANE_ANGLE_UNIT()
);
#920=(
NAMED_UNIT(*)
PLANE_ANGLE_UNIT()
SI_UNIT($,.RADIAN.)
);
#921=PLANE_ANGLE_MEASURE_WITH_UNIT(PLANE_ANGLE_MEASURE(0.01745329252),#920);
#922=SHAPE_DEFINITION_REPRESENTATION(#923,#924);
#923=PRODUCT_DEFINITION_SHAPE('',$,#926);
#924=SHAPE_REPRESENTATION('',(#393),#914);
#925=PRODUCT_DEFINITION_CONTEXT('part definition',#930,'design');
#926=PRODUCT_DEFINITION('v6.5.1 Nozzle 300-600-LONG',
'v6.5.1 Nozzle 300-600-LONG',#927,#925);
#927=PRODUCT_DEFINITION_FORMATION('',$,#932);
#928=PRODUCT_RELATED_PRODUCT_CATEGORY('v6.5.1 Nozzle 300-600-LONG',
'v6.5.1 Nozzle 300-600-LONG',(#932));
#929=APPLICATION_PROTOCOL_DEFINITION('international standard',
'automotive_design',2009,#930);
#930=APPLICATION_CONTEXT(
'Core Data for Automotive Mechanical Design Process');
#931=PRODUCT_CONTEXT('part definition',#930,'mechanical');
#932=PRODUCT('v6.5.1 Nozzle 300-600-LONG','v6.5.1 Nozzle 300-600-LONG',
$,(#931));
#933=PRESENTATION_STYLE_ASSIGNMENT((#934));
#934=SURFACE_STYLE_USAGE(.BOTH.,#935);
#935=SURFACE_SIDE_STYLE($,(#936));
#936=SURFACE_STYLE_FILL_AREA(#937);
#937=FILL_AREA_STYLE($,(#938));
#938=FILL_AREA_STYLE_COLOUR($,#939);
#939=COLOUR_RGB('',1.,0.682352941176471,0.);
ENDSEC;
END-ISO-10303-21;
