,Config,dim09,ucl,lcl
Chart Title,PP-FP0156 Z Top Plate Dim09,5.122,5.75,4.25
X-axis,,5.262,,
Y-axis 1,dim09,5.158,,
Y-axis 2,,5.074,,
Y-axis 3,,5.155,,
Y-axis 4,,5.212,,
UCL,ucl,5.192,,
LCL,lcl,5.123,,
X label,Index,5.212,,
Y label,Dimensions (mm),5.168,,
hist1,dim09,5.132,,
hist2,,5.09,,
change index,,5.118,,
change,,5.159,,
,,5.071,,
,,5.135,,
,,5.172,,
,,5.203,,
,,4.982,,
