,Config,,dim06,ucl,lcl
Chart Title,PP-FP0152 Corner Bracket Powder Coat Thickness,4,0.1016,0.125,0.05
X-axis,,3.5,0.0889,,
Y-axis 1,dim06,4.7,0.11938,,
Y-axis 2,,3.7,0.09398,,
Y-axis 3,,4.4,0.11176,,
Y-axis 4,,3.7,0.09398,,
UCL,ucl,2.9,0.07366,,
LCL,lcl,3.4,0.08636,,
X label,Index,3.2,0.08128,,
Y label,Dimensions (mm),3.3,0.08382,,
hist1,dim06,3.7,0.09398,,
hist2,,3.1,0.07874,,
change index,,4.3,0.10922,,
change,,4.8,0.12192,,
,,3.1,0.07874,,
,,2.8,0.07112,,
,,3.6,0.09144,,
,,3.5,0.0889,,
,,2.8,0.07112,,
,,3.1,0.07874,,
,,2.4,0.06096,,
,,3.4,0.08636,,
,,4.1,0.10414,,
,,3.4,0.08636,,
,,2.3,0.05842,,
,,3.1,0.07874,,
,,3,0.0762,,
,,4.6,0.11684,,
,,3.8,0.09652,,
,,4.1,0.10414,,
,,3.4,0.08636,,
,,3.2,0.08128,,
,,3.8,0.09652,,
,,4.4,0.11176,,
,,4.7,0.11938,,
,,3.8,0.09652,,
,,4.4,0.11176,,
,,4.1,0.10414,,
,,3.8,0.09652,,
,,4.8,0.12192,,
,,4.3,0.10922,,
,,4.2,0.10668,,
,,5.4,0.13716,,
,,5.5,0.1397,,
,,5.4,0.13716,,
,,3.8,0.09652,,
,,4.3,0.10922,,
,,3.6,0.09144,,
,,3.9,0.09906,,
,,3.9,0.09906,,
,,3.9,0.09906,,
,,4.5,0.1143,,
,,4.4,0.11176,,
,,4.1,0.10414,,
,,4.6,0.11684,,
,,4.3,0.10922,,
,,3.4,0.08636,,
,,3.5,0.0889,,
,,2.9,0.07366,,
,,3.2,0.08128,,
,,3,0.0762,,
,,3.2,0.08128,,
,,2.5,0.0635,,
,,3,0.0762,,
,,3,0.0762,,
,,3,0.0762,,
,,3.1,0.07874,,
,,3.3,0.08382,,
,,3.8,0.09652,,
,,4.5,0.1143,,
,,4.5,0.1143,,
,,3.5,0.0889,,
,,4.2,0.10668,,
,,4.5,0.1143,,
,,3.6,0.09144,,
,,3.6,0.09144,,
,,3.8,0.09652,,
,,3.5,0.0889,,
,,3.1,0.07874,,
,,4.1,0.10414,,
,,3.3,0.08382,,
,,3.5,0.0889,,
,,4.1,0.10414,,
,,3.6,0.09144,,
,,3.2,0.08128,,
,,4,0.1016,,
,,3.6,0.09144,,
,,3.1,0.07874,,
,,3.5,0.0889,,
,,3.6,0.09144,,
,,3.5,0.0889,,
,,3.3,0.08382,,
,,3.3,0.08382,,
,,3.5,0.0889,,
,,3.6,0.09144,,
,,3.4,0.08636,,
,,3.7,0.09398,,
,,3.5,0.0889,,
,,3.5,0.0889,,
,,4.1,0.10414,,
,,4.1,0.10414,,
,,3.1,0.07874,,
,,3.2,0.08128,,
,,3.6,0.09144,,
,,3.3,0.08382,,
,,3.4,0.08636,,
,,3.7,0.09398,,
,,4,0.1016,,
,,4.6,0.11684,,
,,4,0.1016,,
,,4.5,0.1143,,
,,3,0.0762,,
,,3.1,0.07874,,
,,3,0.0762,,
,,3.1,0.07874,,
,,3.5,0.0889,,
,,3,0.0762,,
,,2.5,0.0635,,
,,3,0.0762,,
,,3.2,0.08128,,
,,3,0.0762,,
,,3.9,0.09906,,
,,3,0.0762,,
,,3.1,0.07874,,
,,4,0.1016,,
,,4,0.1016,,
,,3.2,0.08128,,
,,3.6,0.09144,,
,,2.4,0.06096,,
,,3,0.0762,,
,,3.2,0.08128,,
,,3.2,0.08128,,
,,3,0.0762,,
,,3.5,0.0889,,
,,2.8,0.07112,,
,,2.4,0.06096,,
,,3.5,0.0889,,
,,3.9,0.09906,,
,,4.6,0.11684,,
,,4.6,0.11684,,
,,4,0.1016,,
,,2.9,0.07366,,
,,3.1,0.07874,,
,,3.1,0.07874,,
