\relax 
\providecommand\hyper@newdestlabel[2]{}
\providecommand*\new@tpo@label[2]{}
\providecommand\HyperFirstAtBeginDocument{\AtBeginDocument}
\HyperFirstAtBeginDocument{\ifx\hyper@anchor\@undefined
\global\let\oldcontentsline\contentsline
\gdef\contentsline#1#2#3#4{\oldcontentsline{#1}{#2}{#3}}
\global\let\oldnewlabel\newlabel
\gdef\newlabel#1#2{\newlabelxx{#1}#2}
\gdef\newlabelxx#1#2#3#4#5#6{\oldnewlabel{#1}{{#2}{#3}}}
\AtEndDocument{\ifx\hyper@anchor\@undefined
\let\contentsline\oldcontentsline
\let\newlabel\oldnewlabel
\fi}
\fi}
\global\let\hyper@last\relax 
\gdef\HyperFirstAtBeginDocument#1{#1}
\providecommand\HyField@AuxAddToFields[1]{}
\providecommand\HyField@AuxAddToCoFields[2]{}
\@writefile{lof}{\contentsline {figure}{\numberline {1}{\ignorespaces Schematic 01 of PP-FP0149.\relax }}{1}{figure.caption.1}}
\providecommand*\caption@xref[2]{\@setref\relax\@undefined{#1}}
\newlabel{fig:diagram}{{1}{1}{Schematic 01 of PP-FP0149.\relax }{figure.caption.1}{}}
\@writefile{lof}{\contentsline {figure}{\numberline {2}{\ignorespaces Schematic 02 of PP-FP0149.\relax }}{1}{figure.caption.2}}
\newlabel{fig:diagram02}{{2}{1}{Schematic 02 of PP-FP0149.\relax }{figure.caption.2}{}}
\@writefile{toc}{\contentsline {section}{\numberline {1}Dimensions}{2}{section.1}}
\@writefile{lof}{\contentsline {figure}{\numberline {3}{\ignorespaces Dimensions of Drawing 1.\relax }}{2}{figure.caption.3}}
\newlabel{fig:dimension01}{{3}{2}{Dimensions of Drawing 1.\relax }{figure.caption.3}{}}
\@writefile{lof}{\contentsline {figure}{\numberline {4}{\ignorespaces Dimensions of Drawing 2.\relax }}{2}{figure.caption.4}}
\newlabel{fig:dimension02}{{4}{2}{Dimensions of Drawing 2.\relax }{figure.caption.4}{}}
