,Config,diameter,ucl,lcl
Chart Title,EL-MS0531: Decoder Wheel Diameter,12.63,12.7,12.6
X-axis,,12.63,,
Y-axis 1,diameter,12.63,,
Y-axis 2,,12.63,,
Y-axis 3,,12.63,,
Y-axis 4,,12.62,,
UCL,ucl,12.63,,
LCL,lcl,12.66,,
X label,Index,12.63,,
Y label,Dimension,12.64,,
hist1,diameter,12.64,,
hist2,,12.63,,
hist3,,12.64,,
hist4,,12.63,,
change index,,12.64,,
change,,12.65,,
,,12.68,,
,,12.68,,
,,12.64,,
,,12.64,,
,,12.65,,
,,12.61,,
,,12.68,,
,,12.62,,
,,12.66,,
,,12.63,,
,,12.63,,
,,12.62,,
