,Config,dim23,ucl,lcl
Chart Title,PP-MP0232: Motor Mount ambidextrous Dim23,16.96,17.55,16.05
X-axis,,16.97,,
Y-axis 1,dim23,16.87,,
Y-axis 2,,16.87,,
Y-axis 3,,16.84,,
Y-axis 4,,16.9,,
UCL,ucl,16.85,,
LCL,lcl,16.85,,
X label,Index,16.88,,
Y label,Dimension (mm),16.86,,
hist1,dim23,16.9,,
hist2,,16.9,,
hist3,,16.86,,
hist4,,16.87,,
change index,,16.89,,
change,,16.85,,
,,16.86,,
,,16.93,,
,,16.84,,
,,16.85,,
,,16.85,,
,,16.85,,
,,16.86,,
,,16.93,,
,,16.94,,
,,16.86,,
,,16.67,,
