,Config,dim01,ucl,lcl
Chart Title,PP-MP0234: Archim Heatsink Dim01,9.694,9.78,9.28
X-axis,,9.652,,
Y-axis 1,dim01,9.648,,
Y-axis 2,,9.621,,
Y-axis 3,,9.645,,
Y-axis 4,,9.638,,
UCL,ucl,9.671,,
LCL,lcl,9.644,,
X label,Index,9.637,,
Y label,Dimensions (mm),9.637,,
hist1,dim01,9.633,,
hist2,,9.656,,
hist3,,9.643,,
hist4,,9.64,,
change index,,9.638,,
change,,9.629,,
,,9.639,,
,,9.645,,
,,9.619,,
,,9.651,,
