,Config,dim01,ucl,lcl
Chart Title,PP-MP0216: Quiver Bed Mount Plate Dim01,101.14,101.75,100.25
X-axis,,101.21,,
Y-axis 1,dim01,101.09,,
Y-axis 2,,101.12,,
Y-axis 3,,100.83,,
Y-axis 4,,100.83,,
UCL,ucl,101.12,,
LCL,lcl,101.07,,
X label,Index,100.84,,
Y label,Dimensions (mm),100.9,,
hist1,dim01,101,,
hist2,,101.25,,
hist3,,100.69,,
hist4,,100.91,,
change index,,100.93,,
change,,101.13,,
,,100.94,,
,,101.14,,
,,100.93,,
,,101.16,,
