,Config,X-motor,X-idler constant,ucl,lcl
Chart Title,"PP-GP0373: X Motor Mount, Quiver",57.04,57.4,12.25,12
X-axis,,56.98,56.79,,
Y-axis 1,X-motor,56.95,56.74,,
Y-axis 2,X-idler constant,56.89,56.6,,
Y-axis 3,,56.89,56.6,,
Y-axis 4,,56.91,56.62,,
UCL,ucl,56.86,56.7,,
LCL,lcl,56.82,56.64,,
X label,Sample number,56.99,56.56,,
Y label,Dimension (mm),,,,
hist1,X-motor,,,,
hist2,X-idler constant,,,,
hist3,,,,,
hist4,,,,,
change index,,,,,
change,,,,,
