,Config,dim01,ucl,lcl
Chart Title,PP-GP0391: Y Cable Cover,5.39,5.4,5
X-axis,,5.5,,
Y-axis 1,dim01,5.4,,
Y-axis 2,,5.46,,
Y-axis 3,,5.26,,
Y-axis 4,,5.36,,
UCL,ucl,5.3,,
LCL,lcl,5.32,,
X label,Index,5.2,,
Y label,Dimension (mm),5.19,,
hist1,dim01,4.95,,
hist2,,4.76,,
hist3,,5.13,,
hist4,,4.95,,
change index,,5.25,,
change,,5.35,,
,,5.38,,
,,5.48,,
,,4.91,,
,,4.99,,
,,5.42,,
,,5.5,,
,,5.38,,
,,5.48,,
,,5,,
,,4.91,,
,,5.25,,
,,5.28,,
,,5.03,,
,,5.14,,
