,Config,dim03,UCL,LCL
Chart Title,PP-FP0153 Interconnect Housing Dim03,78.19,78.75,77.25
X-axis,,78.2,,
Y-axis 1,dim03,78.16,,
Y-axis 2,,78.21,,
Y-axis 3,,78.2,,
Y-axis 4,,78.22,,
UCL,UCL,78.16,,
LCL,LCL,78.24,,
X label,Index,78.22,,
Y label,Dimension(mm),78.25,,
hist1,dim03,78.23,,
hist2,,78.22,,
change index,,78.17,,
change,,78.22,,
,,78.21,,
,,78.21,,
,,78.19,,
,,78.25,,
