,Config,dim18,ucl,lcl
Chart Title,"PP-MP0229: Back plate, quiver Dim18",4.63,5.35,3.85
X-axis,,4.66,,
Y-axis 1,dim18,4.66,,
Y-axis 2,,4.64,,
Y-axis 3,,4.65,,
Y-axis 4,,4.66,,
UCL,ucl,4.71,,
LCL,lcl,4.66,,
X label,Index,4.62,,
Y label,Dimension (mm),4.6,,
hist1,dim18,4.69,,
hist2,,4.66,,
hist3,,4.6,,
hist4,,4.67,,
change index,,4.73,,
change,,4.68,,
,,4.64,,
,,4.71,,
,,4.67,,
,,4.46,,
