\contentsline {figure}{\numberline {1}{\ignorespaces Schematic of PP-FP0153.\relax }}{2}
\contentsline {figure}{\numberline {2}{\ignorespaces Dimension 01\relax }}{2}
\contentsline {figure}{\numberline {3}{\ignorespaces Dimension 02\relax }}{3}
\contentsline {figure}{\numberline {4}{\ignorespaces Dimension 04\relax }}{3}
\contentsline {figure}{\numberline {5}{\ignorespaces Dimension 05\relax }}{4}
