,Config,dim02,ucl,lcl
Chart Title,PP-FP0156 Z Top Plate Dim02,54.75,55.75,54.25
X-axis,,54.84,,
Y-axis 1,dim02,54.9,,
Y-axis 2,,54.75,,
Y-axis 3,,54.97,,
Y-axis 4,,55.05,,
UCL,ucl,55.05,,
LCL,lcl,54.95,,
X label,Index,55.11,,
Y label,Dimensions (mm),54.84,,
hist1,dim02,54.72,,
hist2,,54.8,,
change index,,54.09,,
change,,55,,
,,55.08,,
,,55.09,,
,,55.07,,
,,55.07,,
,,54.89,,
