EESchema Schematic File Version 2
LIBS:TAZ7_Wiring-rescue
LIBS:power
LIBS:device
LIBS:transistors
LIBS:conn
LIBS:linear
LIBS:regul
LIBS:74xx
LIBS:cmos4000
LIBS:adc-dac
LIBS:memory
LIBS:xilinx
LIBS:microcontrollers
LIBS:dsp
LIBS:microchip
LIBS:analog_switches
LIBS:motorola
LIBS:texas
LIBS:intel
LIBS:audio
LIBS:interface
LIBS:digital-audio
LIBS:philips
LIBS:display
LIBS:cypress
LIBS:siliconi
LIBS:opto
LIBS:atmel
LIBS:contrib
LIBS:valves
LIBS:TAZ6_Wiring-cache
LIBS:TAZ7_Wiring-cache
EELAYER 25 0
EELAYER END
$Descr A2 23386 16535
encoding utf-8
Sheet 1 1
Title ""
Date ""
Rev ""
Comp ""
Comment1 ""
Comment2 ""
Comment3 ""
Comment4 ""
$EndDescr
$Comp
L IEC320_FILT_FUSE J?
U 1 1 5A0E1CF0
P 1650 3100
F 0 "J?" H 1650 3850 60  0001 C CNN
F 1 "IEC320_FILT_FUSE" H 1650 3650 60  0000 C CNN
F 2 "" H 1650 3100 60  0001 C CNN
F 3 "" H 1650 3100 60  0001 C CNN
	1    1650 3100
	1    0    0    -1  
$EndComp
$Comp
L AC_SWITCH_LAMP S?
U 1 1 5A0E2279
P 1650 5950
F 0 "S?" H 1250 5150 60  0001 C CNN
F 1 "AC_SWITCH_LAMP" V 1250 5950 60  0000 C CNN
F 2 "" H 1650 5800 60  0001 C CNN
F 3 "" H 1650 5800 60  0001 C CNN
	1    1650 5950
	1    0    0    -1  
$EndComp
$Comp
L BED_HEATER H?
U 1 1 5A0EF97B
P 14700 1150
F 0 "H?" H 14700 750 60  0001 C CNN
F 1 "BED_HEATER" V 15050 1150 60  0000 C CNN
F 2 "" H 14750 1200 60  0001 C CNN
F 3 "" H 14750 1200 60  0001 C CNN
	1    14700 1150
	0    -1   -1   0   
$EndComp
$Comp
L THERMISTOR RT?
U 1 1 5A0EFF57
P 3650 4200
F 0 "RT?" H 3650 3900 60  0001 C CNN
F 1 "THERMISTOR" H 3650 4500 60  0001 C CNN
F 2 "" H 3400 4200 60  0001 C CNN
F 3 "" H 3400 4200 60  0001 C CNN
	1    3650 4200
	1    0    0    -1  
$EndComp
$Comp
L THERMISTOR RT?
U 1 1 5A0F002C
P 3650 5300
F 0 "RT?" H 3650 5000 60  0001 C CNN
F 1 "THERMISTOR" H 3650 5600 60  0001 C CNN
F 2 "" H 3400 5300 60  0001 C CNN
F 3 "" H 3400 5300 60  0001 C CNN
	1    3650 5300
	1    0    0    -1  
$EndComp
$Comp
L THERMISTOR RT?
U 1 1 5A0F00EB
P 3650 6500
F 0 "RT?" H 3650 6200 60  0001 C CNN
F 1 "THERMISTOR" H 3650 6800 60  0001 C CNN
F 2 "" H 3400 6500 60  0001 C CNN
F 3 "" H 3400 6500 60  0001 C CNN
	1    3650 6500
	1    0    0    -1  
$EndComp
$Comp
L POWER_SUPPLY_500W PS?
U 1 1 5A0F0E3A
P 4950 3000
F 0 "PS?" H 4950 3550 60  0000 C CNN
F 1 "POWER_SUPPLY_500W" H 4950 2650 60  0000 C CNN
F 2 "" H 5000 2450 60  0001 C CNN
F 3 "" H 5000 2450 60  0001 C CNN
	1    4950 3000
	1    0    0    -1  
$EndComp
$Comp
L LIMIT_SWITCH SW?
U 1 1 5A0F197D
P 1350 8300
F 0 "SW?" H 1350 8000 60  0001 C CNN
F 1 "LIMIT_SWITCH" H 1350 8600 60  0001 C CNN
F 2 "" H 1200 8300 60  0001 C CNN
F 3 "" H 1200 8300 60  0001 C CNN
	1    1350 8300
	1    0    0    -1  
$EndComp
$Comp
L LIMIT_SWITCH SW?
U 1 1 5A0F1B64
P 1350 9200
F 0 "SW?" H 1350 8900 60  0001 C CNN
F 1 "LIMIT_SWITCH" H 1350 9500 60  0001 C CNN
F 2 "" H 1200 9200 60  0001 C CNN
F 3 "" H 1200 9200 60  0001 C CNN
	1    1350 9200
	1    0    0    -1  
$EndComp
NoConn ~ 9550 7250
NoConn ~ 9550 7350
NoConn ~ 9550 7850
$Comp
L Z_PROBE Z?
U 1 1 5A0F4593
P 1350 10300
F 0 "Z?" H 1350 9950 60  0000 C CNN
F 1 "Z_PROBE" H 1350 10800 60  0000 C CNN
F 2 "" H 1350 10300 60  0001 C CNN
F 3 "" H 1350 10300 60  0001 C CNN
	1    1350 10300
	1    0    0    -1  
$EndComp
$Comp
L GNDPWR #PWR?
U 1 1 5A0F5279
P 2350 4750
F 0 "#PWR?" H 2350 4550 50  0001 C CNN
F 1 "GNDPWR" H 2350 4620 50  0001 C CNN
F 2 "" H 2350 4700 50  0000 C CNN
F 3 "" H 2350 4700 50  0000 C CNN
	1    2350 4750
	1    0    0    -1  
$EndComp
$Comp
L GNDPWR #PWR?
U 1 1 5A0F56CB
P 3950 3150
F 0 "#PWR?" H 3950 2950 50  0001 C CNN
F 1 "GNDPWR" H 3950 3020 50  0001 C CNN
F 2 "" H 3950 3100 50  0000 C CNN
F 3 "" H 3950 3100 50  0000 C CNN
	1    3950 3150
	1    0    0    -1  
$EndComp
NoConn ~ 9550 4600
NoConn ~ 9550 4700
NoConn ~ 9550 5050
NoConn ~ 9550 5400
NoConn ~ 9550 5750
NoConn ~ 8100 6250
NoConn ~ 8100 6500
NoConn ~ 8100 6800
Wire Wire Line
	2350 4750 2350 4700
Wire Wire Line
	2350 4700 1650 4700
Wire Wire Line
	1650 4700 1650 4500
Wire Wire Line
	1900 4500 1900 4950
Wire Wire Line
	1900 4950 1800 4950
Wire Wire Line
	1800 4950 1800 5100
Wire Wire Line
	1400 4500 1400 4950
Wire Wire Line
	1400 4950 1500 4950
Wire Wire Line
	1500 4950 1500 5100
Wire Wire Line
	4200 2900 3950 2900
Wire Wire Line
	3950 2900 3950 3150
Wire Wire Line
	1800 6850 1800 7100
Wire Wire Line
	1800 7100 2700 7100
Wire Wire Line
	2700 7100 2700 2800
Wire Wire Line
	2700 2800 4200 2800
Wire Wire Line
	1500 6850 1500 7300
Wire Wire Line
	1500 7300 2900 7300
Wire Wire Line
	2900 7300 2900 2700
Wire Wire Line
	2900 2700 4200 2700
Wire Wire Line
	5000 2700 7900 2700
Wire Wire Line
	7900 2700 7900 2900
Wire Wire Line
	7900 2900 8100 2900
Wire Wire Line
	5000 2800 7500 2800
Wire Wire Line
	7500 2800 7500 3100
Wire Wire Line
	7500 3100 8100 3100
Wire Wire Line
	5000 2900 7100 2900
Wire Wire Line
	7100 2900 7100 3300
Wire Wire Line
	7100 3300 8100 3300
Wire Wire Line
	5000 3000 8100 3000
Wire Wire Line
	5000 3100 7300 3100
Wire Wire Line
	7300 3100 7300 3200
Wire Wire Line
	7300 3200 8100 3200
Wire Wire Line
	5000 3200 6900 3200
Wire Wire Line
	6900 3200 6900 3400
Wire Wire Line
	6900 3400 8100 3400
Wire Wire Line
	7700 3600 8100 3600
Wire Wire Line
	6000 5200 6000 3850
Wire Wire Line
	6300 6400 6300 4100
Wire Wire Line
	6300 4100 8100 4100
Wire Wire Line
	6400 6600 6400 4200
Wire Wire Line
	6400 4200 8100 4200
Wire Wire Line
	4600 8200 1800 8200
Wire Wire Line
	4600 8400 1800 8400
Wire Wire Line
	2000 10500 5600 10500
Wire Wire Line
	11100 7400 14100 7400
Wire Wire Line
	11100 7700 13800 7700
Wire Wire Line
	13800 7700 13800 10150
Wire Wire Line
	11100 7600 13900 7600
Wire Wire Line
	13900 7600 13900 10250
Wire Wire Line
	11100 7500 14000 7500
Wire Wire Line
	14000 7500 14000 10350
Wire Wire Line
	14100 7400 14100 10450
Wire Wire Line
	11100 7250 14300 7250
Wire Wire Line
	14300 7250 14300 7750
Wire Wire Line
	11100 7150 14400 7150
Wire Wire Line
	14400 7150 14400 7850
Wire Wire Line
	11100 7050 14500 7050
Wire Wire Line
	14500 7050 14500 7950
Wire Wire Line
	11100 6950 14600 6950
Wire Wire Line
	14600 6950 14600 8050
Wire Wire Line
	11100 6800 16900 6800
Wire Wire Line
	16900 6800 16900 5950
Wire Wire Line
	11100 6700 16800 6700
Wire Wire Line
	16800 6700 16800 5850
Wire Wire Line
	11100 6600 16700 6600
Wire Wire Line
	16700 6600 16700 5750
Wire Wire Line
	11100 6500 16600 6500
Wire Wire Line
	16600 6500 16600 5650
Wire Wire Line
	11100 6350 16400 6350
Wire Wire Line
	16400 6350 16400 4650
Wire Wire Line
	11100 6250 16300 6250
Wire Wire Line
	16300 6250 16300 4550
Wire Wire Line
	11100 6150 16200 6150
Wire Wire Line
	16200 6150 16200 4450
Wire Wire Line
	11100 6050 16100 6050
Wire Wire Line
	16100 6050 16100 4350
Wire Wire Line
	11100 5900 15900 5900
Wire Wire Line
	15900 5900 15900 3350
Wire Wire Line
	11100 5800 15800 5800
Wire Wire Line
	15800 5800 15800 3250
Wire Wire Line
	11100 5700 15700 5700
Wire Wire Line
	15700 5700 15700 3150
Wire Wire Line
	11100 5600 15600 5600
Wire Wire Line
	15600 5600 15600 3050
Wire Wire Line
	11100 5450 15400 5450
Wire Wire Line
	11100 5350 15300 5350
Wire Wire Line
	11100 5250 15200 5250
Wire Wire Line
	11100 5150 15100 5150
Wire Wire Line
	15100 5150 15100 1450
Wire Wire Line
	20900 5950 20900 6100
Wire Wire Line
	20900 6100 21300 6100
Wire Wire Line
	20900 5650 20900 5500
Wire Wire Line
	20900 5500 21300 5500
Wire Wire Line
	21100 5750 21100 5700
Wire Wire Line
	21100 5700 21300 5700
Wire Wire Line
	21100 5850 21100 5900
Wire Wire Line
	21100 5900 21300 5900
Wire Wire Line
	20900 4350 20900 4200
Wire Wire Line
	20900 4200 21300 4200
Wire Wire Line
	20900 4650 20900 4800
Wire Wire Line
	20900 4800 21300 4800
Wire Wire Line
	21100 4450 21100 4400
Wire Wire Line
	21100 4400 21300 4400
Wire Wire Line
	21100 4550 21100 4600
Wire Wire Line
	21100 4600 21300 4600
Wire Wire Line
	20900 3050 20900 2900
Wire Wire Line
	20900 2900 21300 2900
Wire Wire Line
	20900 3350 20900 3500
Wire Wire Line
	20900 3500 21300 3500
Wire Wire Line
	21100 3250 21100 3300
Wire Wire Line
	21100 3300 21300 3300
Wire Wire Line
	21100 3150 21100 3100
Wire Wire Line
	21100 3100 21300 3100
Wire Wire Line
	20800 2200 21300 2200
Wire Wire Line
	20900 2000 21300 2000
Wire Wire Line
	21000 1800 21300 1800
Wire Wire Line
	21100 1600 21300 1600
$Comp
L CGrid16_F J?
U 1 1 5A1486F8
P 18750 4750
F 0 "J?" H 18750 3500 60  0001 C CNN
F 1 "CGrid16_F" H 18750 6150 60  0001 C CNN
F 2 "" H 18750 4750 60  0001 C CNN
F 3 "" H 18750 4750 60  0001 C CNN
	1    18750 4750
	1    0    0    -1  
$EndComp
$Comp
L CGrid16_M J?
U 1 1 5A14886D
P 19000 4750
F 0 "J?" H 19000 3500 60  0001 C CNN
F 1 "CGrid16_M" H 19000 6150 60  0001 C CNN
F 2 "" H 19000 4750 60  0001 C CNN
F 3 "" H 19000 4750 60  0001 C CNN
	1    19000 4750
	1    0    0    -1  
$EndComp
Wire Wire Line
	20900 3050 19600 3050
Wire Wire Line
	19600 3050 19600 3550
Wire Wire Line
	19600 3550 19200 3550
Wire Wire Line
	21100 3150 19700 3150
Wire Wire Line
	19700 3150 19700 3700
Wire Wire Line
	19700 3700 19200 3700
Wire Wire Line
	21100 3250 19800 3250
Wire Wire Line
	19800 3250 19800 3850
Wire Wire Line
	19800 3850 19200 3850
Wire Wire Line
	20900 3350 19900 3350
Wire Wire Line
	19900 3350 19900 4000
Wire Wire Line
	19900 4000 19200 4000
Wire Notes Line
	20300 2950 20500 2950
Wire Notes Line
	20500 2950 20500 3450
Wire Notes Line
	20500 3450 20300 3450
Wire Notes Line
	20300 3450 20300 2950
Wire Wire Line
	19200 4150 20000 4150
Wire Wire Line
	20000 4150 20000 3650
Wire Wire Line
	20000 3650 20400 3650
Wire Wire Line
	20400 3650 20400 3450
Wire Wire Line
	21100 4450 19200 4450
Wire Wire Line
	20900 4350 19650 4350
Wire Wire Line
	19650 4350 19650 4300
Wire Wire Line
	19650 4300 19200 4300
Wire Wire Line
	21100 4550 19650 4550
Wire Wire Line
	19650 4550 19650 4600
Wire Wire Line
	19650 4600 19200 4600
Wire Wire Line
	20900 4650 19750 4650
Wire Wire Line
	19750 4650 19750 4750
Wire Wire Line
	19750 4750 19200 4750
Wire Notes Line
	20300 4250 20500 4250
Wire Notes Line
	20500 4250 20500 4750
Wire Notes Line
	20500 4750 20300 4750
Wire Notes Line
	20300 4750 20300 4250
Wire Wire Line
	19200 4900 20400 4900
Wire Wire Line
	20400 4900 20400 4750
Wire Wire Line
	20900 5650 19850 5650
Wire Wire Line
	19850 5650 19850 5050
Wire Wire Line
	19850 5050 19200 5050
Wire Wire Line
	21100 5750 19750 5750
Wire Wire Line
	19750 5750 19750 5200
Wire Wire Line
	19750 5200 19200 5200
Wire Wire Line
	21100 5850 19650 5850
Wire Wire Line
	19650 5850 19650 5350
Wire Wire Line
	19650 5350 19200 5350
Wire Wire Line
	20900 5950 19550 5950
Wire Wire Line
	19550 5950 19550 5500
Wire Wire Line
	19550 5500 19200 5500
Wire Notes Line
	20300 5550 20500 5550
Wire Notes Line
	20500 5550 20500 6050
Wire Notes Line
	20500 6050 20300 6050
Wire Notes Line
	20300 6050 20300 5550
NoConn ~ 19200 5800
NoConn ~ 18550 5800
Wire Wire Line
	19200 5650 19450 5650
Wire Wire Line
	19450 5650 19450 6150
Wire Wire Line
	19450 6150 20400 6150
Wire Wire Line
	20400 6150 20400 6050
Wire Wire Line
	18100 3050 18100 3550
Wire Wire Line
	18100 3550 18550 3550
Wire Wire Line
	15700 3150 18000 3150
Wire Wire Line
	18000 3150 18000 3700
Wire Wire Line
	18000 3700 18550 3700
Wire Wire Line
	15800 3250 17900 3250
Wire Wire Line
	17900 3250 17900 3850
Wire Wire Line
	17900 3850 18550 3850
Wire Wire Line
	15900 3350 17800 3350
Wire Wire Line
	17800 3350 17800 4000
Wire Wire Line
	17800 4000 18550 4000
Wire Wire Line
	16100 4350 18100 4350
Wire Wire Line
	18100 4350 18100 4300
Wire Wire Line
	18100 4300 18550 4300
Wire Wire Line
	16200 4450 18550 4450
Wire Wire Line
	18100 4550 18100 4600
Wire Wire Line
	18100 4600 18550 4600
Wire Wire Line
	18000 4650 18000 4750
Wire Wire Line
	18000 4750 18550 4750
Wire Notes Line
	17100 2950 17300 2950
Wire Notes Line
	17300 2950 17300 3450
Wire Notes Line
	17300 3450 17100 3450
Wire Notes Line
	17100 3450 17100 2950
Wire Wire Line
	18550 4150 17700 4150
Wire Wire Line
	17700 4150 17700 3650
Wire Wire Line
	17700 3650 17200 3650
Wire Wire Line
	17200 3650 17200 3850
$Comp
L GNDPWR #PWR?
U 1 1 5A14F87F
P 17200 3850
F 0 "#PWR?" H 17200 3650 50  0001 C CNN
F 1 "GNDPWR" H 17200 3720 50  0001 C CNN
F 2 "" H 17200 3800 50  0000 C CNN
F 3 "" H 17200 3800 50  0000 C CNN
	1    17200 3850
	1    0    0    -1  
$EndComp
Wire Notes Line
	17100 4250 17300 4250
Wire Notes Line
	17300 4250 17300 4750
Wire Notes Line
	17300 4750 17100 4750
Wire Notes Line
	17100 4750 17100 4250
Wire Wire Line
	18550 4900 17200 4900
Wire Wire Line
	17200 4900 17200 5050
$Comp
L GNDPWR #PWR?
U 1 1 5A150426
P 17200 5050
F 0 "#PWR?" H 17200 4850 50  0001 C CNN
F 1 "GNDPWR" H 17200 4920 50  0001 C CNN
F 2 "" H 17200 5000 50  0000 C CNN
F 3 "" H 17200 5000 50  0000 C CNN
	1    17200 5050
	1    0    0    -1  
$EndComp
Wire Wire Line
	16600 5650 17900 5650
Wire Wire Line
	17900 5650 17900 5050
Wire Wire Line
	17900 5050 18550 5050
Wire Wire Line
	16700 5750 18000 5750
Wire Wire Line
	18000 5750 18000 5200
Wire Wire Line
	18000 5200 18550 5200
Wire Wire Line
	16800 5850 18100 5850
Wire Wire Line
	18100 5850 18100 5350
Wire Wire Line
	18100 5350 18550 5350
Wire Wire Line
	16900 5950 18200 5950
Wire Wire Line
	18200 5950 18200 5500
Wire Wire Line
	18200 5500 18550 5500
Wire Notes Line
	17100 5550 17300 5550
Wire Notes Line
	17300 5550 17300 6050
Wire Notes Line
	17300 6050 17100 6050
Wire Notes Line
	17100 6050 17100 5550
Wire Wire Line
	18550 5650 18300 5650
Wire Wire Line
	18300 5650 18300 6050
$Comp
L GNDPWR #PWR?
U 1 1 5A151790
P 18300 6050
F 0 "#PWR?" H 18300 5850 50  0001 C CNN
F 1 "GNDPWR" H 18300 5920 50  0001 C CNN
F 2 "" H 18300 6000 50  0000 C CNN
F 3 "" H 18300 6000 50  0000 C CNN
	1    18300 6050
	1    0    0    -1  
$EndComp
$Comp
L Canon2_M U?
U 1 1 5A152D23
P 4750 5300
F 0 "U?" H 4750 5000 60  0001 C CNN
F 1 "Canon2_M" H 4750 5600 60  0001 C CNN
F 2 "" H 4800 5300 60  0001 C CNN
F 3 "" H 4800 5300 60  0001 C CNN
	1    4750 5300
	1    0    0    -1  
$EndComp
$Comp
L Canon2_F U?
U 1 1 5A1536A6
P 5050 5300
F 0 "U?" H 5050 5000 60  0001 C CNN
F 1 "Canon2_F" H 5050 5600 60  0001 C CNN
F 2 "" H 5050 5300 60  0001 C CNN
F 3 "" H 5050 5300 60  0001 C CNN
	1    5050 5300
	1    0    0    -1  
$EndComp
Wire Notes Line
	15250 7650 15450 7650
Wire Notes Line
	15450 7650 15450 8150
Wire Notes Line
	15450 8150 15250 8150
Wire Notes Line
	15250 8150 15250 7650
Wire Notes Line
	15250 10100 15450 10100
Wire Notes Line
	15450 10100 15450 10600
Wire Notes Line
	15450 10600 15250 10600
Wire Notes Line
	15250 10600 15250 10100
$Comp
L GNDPWR #PWR?
U 1 1 5A15AD1A
P 16850 10800
F 0 "#PWR?" H 16850 10600 50  0001 C CNN
F 1 "GNDPWR" H 16850 10670 50  0001 C CNN
F 2 "" H 16850 10750 50  0000 C CNN
F 3 "" H 16850 10750 50  0000 C CNN
	1    16850 10800
	1    0    0    -1  
$EndComp
Wire Wire Line
	4250 6400 4600 6400
Wire Wire Line
	4250 6600 4600 6600
Wire Wire Line
	5250 6400 6300 6400
Wire Wire Line
	5250 6600 6400 6600
Text Notes 16850 7200 0    60   ~ 0
EXTRUDER HARNESS CONNECTOR
Text Notes 18100 2950 0    60   ~ 0
EXTRUDER HARNESS CONNECTOR
Text Notes 4450 5050 0    60   ~ 0
P/O EXTRUDER 2 CONN
$Comp
L BED_HEAT_CONN_F U?
U 1 1 5A15A206
P 13650 4200
F 0 "U?" H 13550 3900 60  0001 C CNN
F 1 "BED_HEAT_CONN_F" H 13550 4500 60  0001 C CNN
F 2 "" H 13550 4200 60  0001 C CNN
F 3 "" H 13550 4200 60  0001 C CNN
	1    13650 4200
	1    0    0    -1  
$EndComp
$Comp
L BED_HEAT_CONN_M U?
U 1 1 5A15A463
P 14100 4200
F 0 "U?" H 14000 3900 60  0001 C CNN
F 1 "BED_HEAT_CONN_M" H 14000 4500 60  0001 C CNN
F 2 "" H 13950 4200 60  0001 C CNN
F 3 "" H 13950 4200 60  0001 C CNN
	1    14100 4200
	1    0    0    -1  
$EndComp
$Comp
L CGrid20_3_M J?
U 1 1 5A15A09B
P 4800 10100
F 0 "J?" H 4800 9850 60  0001 C CNN
F 1 "CGrid20_3_M" H 4800 10350 60  0001 C CNN
F 2 "" H 4800 10100 60  0001 C CNN
F 3 "" H 4800 10100 60  0001 C CNN
	1    4800 10100
	1    0    0    -1  
$EndComp
$Comp
L CGrid20_3_F J?
U 1 1 5A15A172
P 5100 10100
F 0 "J?" H 5100 9850 60  0001 C CNN
F 1 "CGrid20_3_F" H 5100 10350 60  0001 C CNN
F 2 "" H 5050 10100 60  0001 C CNN
F 3 "" H 5050 10100 60  0001 C CNN
	1    5100 10100
	1    0    0    -1  
$EndComp
Wire Wire Line
	4550 10100 1750 10100
Text Notes 4500 9900 0    60   ~ 0
P/O C-GRID CONN 1
$Comp
L CGrid20_4_F U?
U 1 1 5A15C220
P 5050 9200
F 0 "U?" H 5050 8900 60  0001 C CNN
F 1 "CGrid20_4_F" H 5050 9500 60  0001 C CNN
F 2 "" H 5050 9200 60  0001 C CNN
F 3 "" H 5050 9200 60  0001 C CNN
	1    5050 9200
	1    0    0    -1  
$EndComp
$Comp
L CGrid20_4_M U?
U 1 1 5A15C3ED
P 4750 9200
F 0 "U?" H 4750 8900 60  0001 C CNN
F 1 "CGrid20_4_M" H 4750 9500 60  0001 C CNN
F 2 "" H 4800 9200 60  0001 C CNN
F 3 "" H 4800 9200 60  0001 C CNN
	1    4750 9200
	1    0    0    -1  
$EndComp
Wire Wire Line
	6600 9100 5250 9100
Wire Wire Line
	6700 9300 5250 9300
Wire Wire Line
	1800 9100 4600 9100
Wire Wire Line
	1800 9300 4600 9300
Text Notes 1000 8900 0    60   ~ 0
ERASE SWITCH NO
Text Notes 4500 8950 0    60   ~ 0
P/O C-GRID CONN 1
$Comp
L CGrid20_5_M U?
U 1 1 5A15F7F1
P 4750 4200
F 0 "U?" H 4750 3900 60  0001 C CNN
F 1 "CGrid20_5_M" H 4750 4500 60  0001 C CNN
F 2 "" H 4800 4200 60  0001 C CNN
F 3 "" H 4800 4200 60  0001 C CNN
	1    4750 4200
	1    0    0    -1  
$EndComp
$Comp
L CGrid20_5_F U?
U 1 1 5A15F943
P 5050 4200
F 0 "U?" H 5050 3900 60  0001 C CNN
F 1 "CGrid20_5_F" H 5050 4500 60  0001 C CNN
F 2 "" H 5050 4200 60  0001 C CNN
F 3 "" H 5050 4200 60  0001 C CNN
	1    5050 4200
	1    0    0    -1  
$EndComp
Wire Wire Line
	5700 4100 5250 4100
Wire Wire Line
	4250 4100 4600 4100
Wire Wire Line
	4250 4300 4600 4300
Text Notes 4450 3950 0    60   ~ 0
P/O C-GRID CONN 1
Text Notes 3100 3950 0    60   ~ 0
EXTRUDER 1 THERMISTOR
Text Notes 3100 5050 0    60   ~ 0
EXTRUDER 2 THERMISTOR
Wire Wire Line
	4250 5200 4600 5200
Wire Wire Line
	4250 5400 4600 5400
Wire Wire Line
	5250 5200 6000 5200
Wire Wire Line
	15100 1450 18550 1450
Wire Wire Line
	15200 1550 18300 1550
Wire Wire Line
	18300 1550 18300 1600
Wire Wire Line
	18300 1600 18550 1600
Wire Wire Line
	15300 1650 18200 1650
Wire Wire Line
	18200 1650 18200 1750
Wire Wire Line
	18200 1750 18550 1750
Wire Wire Line
	15400 1750 18100 1750
Wire Wire Line
	18100 1750 18100 1900
Wire Wire Line
	18100 1900 18550 1900
Wire Wire Line
	21100 1600 21100 1450
Wire Wire Line
	21100 1450 19200 1450
Wire Wire Line
	21000 1550 21000 1800
Wire Wire Line
	19200 1600 19400 1600
Wire Wire Line
	19400 1600 19400 1550
Wire Wire Line
	19400 1550 21000 1550
Wire Wire Line
	19200 1750 19500 1750
Wire Wire Line
	19500 1750 19500 1650
Wire Wire Line
	19500 1650 20900 1650
Wire Wire Line
	20900 1650 20900 2000
Wire Wire Line
	19200 1900 19600 1900
Wire Wire Line
	19600 1900 19600 1750
Wire Wire Line
	19600 1750 20800 1750
Wire Wire Line
	20800 1750 20800 2200
Wire Notes Line
	20300 1350 20500 1350
Wire Notes Line
	20500 1350 20500 1850
Wire Notes Line
	20500 1850 20300 1850
Wire Notes Line
	20300 1850 20300 1350
Wire Notes Line
	17400 1350 17600 1350
Wire Notes Line
	17600 1350 17600 1850
Wire Notes Line
	17600 1850 17400 1850
Wire Notes Line
	17400 1850 17400 1350
Wire Wire Line
	19200 2050 20400 2050
Wire Wire Line
	20400 2050 20400 1850
Wire Wire Line
	17500 2050 17500 2250
Wire Wire Line
	18550 2050 17500 2050
$Comp
L GNDPWR #PWR?
U 1 1 5A1687D2
P 17500 2250
F 0 "#PWR?" H 17500 2050 50  0001 C CNN
F 1 "GNDPWR" H 17500 2120 50  0001 C CNN
F 2 "" H 17500 2200 50  0000 C CNN
F 3 "" H 17500 2200 50  0000 C CNN
	1    17500 2250
	1    0    0    -1  
$EndComp
Text Notes 1000 8050 0    60   ~ 0
Z-MAX LIMIT SWITCH NC
Text Notes 4500 8050 0    60   ~ 0
Z-MAX CONNECTOR
Wire Wire Line
	7800 8200 5250 8200
Wire Wire Line
	7900 8400 5250 8400
$Comp
L CGrid10_2_F J?
U 1 1 5A16CE7B
P 6150 10500
F 0 "J?" H 6150 10250 60  0001 C CNN
F 1 "CGrid10_2_F" H 6150 10750 60  0001 C CNN
F 2 "" H 6100 10500 60  0001 C CNN
F 3 "" H 6100 10500 60  0001 C CNN
	1    6150 10500
	1    0    0    -1  
$EndComp
$Comp
L CGrid10_2_M J?
U 1 1 5A16CF14
P 5850 10500
F 0 "J?" H 5850 10250 60  0001 C CNN
F 1 "CGrid10_2_M" H 5850 10750 60  0001 C CNN
F 2 "" H 5850 10500 60  0001 C CNN
F 3 "" H 5850 10500 60  0001 C CNN
	1    5850 10500
	1    0    0    -1  
$EndComp
Text Notes 5550 10300 0    60   ~ 0
P/O C-GRID CONN 3
Wire Wire Line
	5300 10100 6800 10100
Wire Wire Line
	8400 10500 6350 10500
$Comp
L CGrid10_6_F J?
U 1 1 5A171645
P 4700 11200
F 0 "J?" H 4700 10950 60  0001 C CNN
F 1 "CGrid10_6_F" H 4700 11450 60  0001 C CNN
F 2 "" H 4650 11200 60  0001 C CNN
F 3 "" H 4650 11200 60  0001 C CNN
	1    4700 11200
	1    0    0    -1  
$EndComp
$Comp
L CGrid10_6_M J?
U 1 1 5A1716C6
P 4400 11200
F 0 "J?" H 4400 10950 60  0001 C CNN
F 1 "CGrid10_6_M" H 4400 11450 60  0001 C CNN
F 2 "" H 4400 11200 60  0001 C CNN
F 3 "" H 4400 11200 60  0001 C CNN
	1    4400 11200
	1    0    0    -1  
$EndComp
Wire Wire Line
	3400 11200 4150 11200
Wire Wire Line
	3400 10500 3400 11200
Connection ~ 3400 10500
Wire Wire Line
	4900 11200 5500 11200
Wire Wire Line
	5500 11200 5500 11400
$Comp
L D_ALT D?
U 1 1 5A171E33
P 5500 11550
F 0 "D?" H 5500 11650 50  0001 C CNN
F 1 "D_ALT" H 5500 11450 50  0001 C CNN
F 2 "" H 5500 11550 50  0000 C CNN
F 3 "" H 5500 11550 50  0000 C CNN
	1    5500 11550
	0    1    1    0   
$EndComp
Wire Wire Line
	5500 11700 5500 11800
$Comp
L GNDPWR #PWR?
U 1 1 5A1721DE
P 5500 11800
F 0 "#PWR?" H 5500 11600 50  0001 C CNN
F 1 "GNDPWR" H 5500 11670 50  0001 C CNN
F 2 "" H 5500 11750 50  0000 C CNN
F 3 "" H 5500 11750 50  0000 C CNN
	1    5500 11800
	1    0    0    -1  
$EndComp
Text Notes 4100 11000 0    60   ~ 0
P/O C-GRID CONN 3
Text Notes 19100 15250 0    200  ~ 0
TAZ 7 WIRING DIAGRAM
$Comp
L CGrid10_5_F U?
U 1 1 5A172CD1
P 5050 6500
F 0 "U?" H 5050 6200 60  0001 C CNN
F 1 "CGrid10_5_F" H 5050 6800 60  0001 C CNN
F 2 "" H 5050 6500 60  0001 C CNN
F 3 "" H 5050 6500 60  0001 C CNN
	1    5050 6500
	1    0    0    -1  
$EndComp
$Comp
L CGrid10_5_M U?
U 1 1 5A172D42
P 4750 6500
F 0 "U?" H 4750 6200 60  0001 C CNN
F 1 "CGrid10_5_M" H 4750 6800 60  0001 C CNN
F 2 "" H 4800 6500 60  0001 C CNN
F 3 "" H 4800 6500 60  0001 C CNN
	1    4750 6500
	1    0    0    -1  
$EndComp
Text Notes 3150 6250 0    60   ~ 0
BED HEAT THERMISTOR
Text Notes 21500 1300 0    60   ~ 0
X STEPPER MOTOR
Text Notes 21500 3900 0    60   ~ 0
Y STEPPER MOTOR
Text Notes 21400 2600 0    60   ~ 0
Z STEPPER MOTOR LEFT
Text Notes 21400 5250 0    60   ~ 0
Z STEPPER MOTOR RIGHT
Text Notes 17250 2450 0    39   ~ 0
CHASIS GROUND
Text Notes 16950 4050 0    39   ~ 0
CHASIS GROUND
Text Notes 16950 5250 0    39   ~ 0
CHASIS GROUND
Text Notes 18050 6250 0    39   ~ 0
CHASIS GROUND
Text Notes 2100 4950 0    39   ~ 0
CHASIS GROUND
Text Notes 3700 3350 0    39   ~ 0
CHASIS GROUND
Text Notes 5300 12000 0    39   ~ 0
CHASIS GROUND
Text Notes 5650 11600 0    39   ~ 0
TVS DIODE 5V 1500W\nAO PART NUMBER EL-MS0329
$Comp
L FAN FN?
U 1 1 5A176175
P 12750 1200
F 0 "FN?" H 12750 800 60  0001 C CNN
F 1 "FAN" H 12750 1600 60  0001 C CNN
F 2 "" H 12750 1200 60  0001 C CNN
F 3 "" H 12750 1200 60  0001 C CNN
	1    12750 1200
	1    0    0    -1  
$EndComp
Wire Wire Line
	12900 4450 11100 4450
Text Notes 17300 1300 0    39   ~ 0
CABLE SHIELD
Text Notes 20200 1300 0    39   ~ 0
CABLE SHIELD
Text Notes 17000 2900 0    39   ~ 0
CABLE SHIELD
Text Notes 20200 2900 0    39   ~ 0
CABLE SHIELD
Text Notes 17000 4200 0    39   ~ 0
CABLE SHIELD
Text Notes 20200 4200 0    39   ~ 0
CABLE SHIELD
Text Notes 17000 5500 0    39   ~ 0
CABLE SHIELD
Text Notes 20200 5500 0    39   ~ 0
CABLE SHIELD
Text Notes 15150 7600 0    39   ~ 0
CABLE SHIELD
Text Notes 15150 10050 0    39   ~ 0
CABLE SHIELD
Text Notes 12500 850  0    39   ~ 0
24V CONTROL BOX\nCOOLING FAN
Text Notes 900  4850 0    39   ~ 0
ALL WIRES\n16 AWG 300V\nUL 1007/1569
Text Notes 2100 7550 0    39   ~ 0
ALL WIRES\n16 AWG 300V\nUL 1007/1569
Text Notes 6550 2600 0    39   ~ 0
ALL WIRES\n16 AWG 300V\nUL 1007/1569
Text Notes 6800 4750 0    39   ~ 0
ALL WIRES\n24AWG 300V\nUL 1007/1569
Text Notes 13650 5050 0    39   ~ 0
MOTOR WIRES\n22AWG 300V\n
Text Notes 19750 2300 0    39   ~ 0
MOTOR WIRES\n22AWG 300V\n
Text Notes 13150 4650 0    39   ~ 0
BED HEATER WIRES\n16AWG 300V\nUL 1007/1569
Text Notes 13950 4650 0    39   ~ 0
BED HEATER WIRES\n16AWG 300V\nUL 1007/1569
Text Notes 13750 3300 0    39   ~ 0
ALL WIRES\n24AWG 300V\nUL 1007/1569
Text Notes 11300 13150 0    39   ~ 0
WIRE ASSEMBLY\n10_CONDUCTOR\nRIBBON CABLE\n28AWG 300V\n
$Comp
L Archim2_1_A A?
U 1 1 5BA2F0FA
P 9600 5050
F 0 "A?" H 9600 5000 60  0000 C CNN
F 1 "Archim2_1_A" H 9600 7050 60  0000 C CNN
F 2 "" H 10200 6450 60  0001 C CNN
F 3 "" H 10200 6450 60  0001 C CNN
	1    9600 5050
	1    0    0    -1  
$EndComp
Text Notes 17300 1950 0    39   ~ 0
NOT GROUNDED
$Comp
L CGrid6_F J?
U 1 1 5BAE9A93
P 18750 1750
F 0 "J?" H 18700 1100 60  0001 C CNN
F 1 "CGrid6_F" H 18750 2250 60  0001 C CNN
F 2 "" H 18750 1750 60  0001 C CNN
F 3 "" H 18750 1750 60  0001 C CNN
	1    18750 1750
	1    0    0    -1  
$EndComp
$Comp
L CGrid6_M J?
U 1 1 5BAE9E6D
P 19100 1750
F 0 "J?" H 19050 1100 60  0001 C CNN
F 1 "CGrid6_M" H 19000 2250 60  0001 C CNN
F 2 "" H 19000 1750 60  0001 C CNN
F 3 "" H 19000 1750 60  0001 C CNN
	1    19100 1750
	1    0    0    -1  
$EndComp
Text Notes 17000 3550 0    39   ~ 0
NOT GROUNDED
Text Notes 17000 4850 0    39   ~ 0
NOT GROUNDED
Text Notes 18350 1250 0    60   ~ 0
X HARNESS CONNECTOR
$Comp
L CGrid2_M U?
U 1 1 5BB4D77D
P 4750 8300
F 0 "U?" H 4750 8000 60  0000 C CNN
F 1 "CGrid2_M" H 4750 8600 60  0001 C CNN
F 2 "" H 4800 8300 60  0001 C CNN
F 3 "" H 4800 8300 60  0001 C CNN
	1    4750 8300
	1    0    0    -1  
$EndComp
$Comp
L CGrid2_F U?
U 1 1 5BB4D9AD
P 5050 8300
F 0 "U?" H 5050 8000 60  0000 C CNN
F 1 "CGrid2_F" H 5050 8600 60  0001 C CNN
F 2 "" H 5050 8300 60  0001 C CNN
F 3 "" H 5050 8300 60  0001 C CNN
	1    5050 8300
	1    0    0    -1  
$EndComp
Wire Wire Line
	7800 6050 8100 6050
Wire Wire Line
	7900 6150 8100 6150
NoConn ~ 8100 6600
Wire Wire Line
	7800 6050 7800 8200
Wire Wire Line
	7900 6150 7900 8400
$Comp
L CLCD_MODULE MOD?
U 1 1 5BB63FD6
P 9800 14050
F 0 "MOD?" H 9800 13300 60  0001 C CNN
F 1 "CLCD_MODULE" H 9800 14050 60  0000 C CNN
F 2 "" H 9800 14050 60  0001 C CNN
F 3 "" H 9800 14050 60  0001 C CNN
	1    9800 14050
	1    0    0    -1  
$EndComp
Wire Wire Line
	11100 8800 11300 8800
Wire Wire Line
	11300 8800 11300 11750
Wire Wire Line
	11300 11750 11100 11750
Wire Wire Line
	11100 8700 11400 8700
Wire Wire Line
	11400 8700 11400 11850
Wire Wire Line
	11400 11850 11100 11850
Wire Wire Line
	11100 8600 11500 8600
Wire Wire Line
	11500 8600 11500 11950
Wire Wire Line
	11500 11950 11100 11950
Wire Wire Line
	11100 8500 11600 8500
Wire Wire Line
	11600 8500 11600 12050
Wire Wire Line
	11600 12050 11100 12050
Wire Wire Line
	11100 8400 11700 8400
Wire Wire Line
	11700 8400 11700 12150
Wire Wire Line
	11700 12150 11100 12150
Wire Wire Line
	11100 8300 11800 8300
Wire Wire Line
	11800 8300 11800 12250
Wire Wire Line
	11800 12250 11100 12250
Wire Wire Line
	11100 8200 11900 8200
Wire Wire Line
	11900 8200 11900 12350
Wire Wire Line
	11900 12350 11100 12350
Wire Wire Line
	11100 8100 12000 8100
Wire Wire Line
	12000 8100 12000 12450
Wire Wire Line
	12000 12450 11100 12450
Wire Wire Line
	11100 8000 12100 8000
Wire Wire Line
	12100 8000 12100 12550
Wire Wire Line
	12100 12550 11100 12550
Wire Wire Line
	11100 7900 12200 7900
Wire Wire Line
	12200 7900 12200 12650
Wire Wire Line
	12200 12650 11100 12650
NoConn ~ 9350 11400
NoConn ~ 9450 11400
NoConn ~ 9550 11400
NoConn ~ 9650 11400
NoConn ~ 9750 11400
NoConn ~ 9850 11400
NoConn ~ 9950 11400
NoConn ~ 10050 11400
NoConn ~ 10150 11400
NoConn ~ 10250 11400
$Comp
L USB_READER MOD?
U 1 1 5BB68D05
P 7350 14600
F 0 "MOD?" H 7350 13900 60  0001 C CNN
F 1 "USB_READER" H 7350 14800 60  0000 C CNN
F 2 "" H 7350 14600 60  0001 C CNN
F 3 "" H 7350 14600 60  0001 C CNN
	1    7350 14600
	1    0    0    -1  
$EndComp
Wire Wire Line
	8500 12650 7800 12650
Wire Wire Line
	7800 12650 7800 13100
Wire Wire Line
	8500 12550 7700 12550
Wire Wire Line
	7700 12550 7700 13100
Wire Wire Line
	8500 12450 7600 12450
Wire Wire Line
	7600 12450 7600 13100
Wire Wire Line
	8500 12350 7500 12350
Wire Wire Line
	7500 12350 7500 13100
Wire Wire Line
	8500 12250 7400 12250
Wire Wire Line
	7400 12250 7400 13100
Wire Wire Line
	8500 12150 7300 12150
Wire Wire Line
	7300 12150 7300 13100
Wire Wire Line
	8500 12050 7200 12050
Wire Wire Line
	7200 12050 7200 13100
Wire Wire Line
	8500 11950 7100 11950
Wire Wire Line
	7100 11950 7100 13100
Wire Wire Line
	8500 11850 7000 11850
Wire Wire Line
	7000 11850 7000 13100
Wire Wire Line
	8500 11750 6900 11750
Wire Wire Line
	6900 11750 6900 13100
$Comp
L CGrid22_F J?
U 1 1 5BBB7BD7
P 17300 7700
F 0 "J?" H 17250 4650 60  0000 C CNN
F 1 "CGrid22_F" H 17300 8200 60  0001 C CNN
F 2 "" H 17300 7700 60  0001 C CNN
F 3 "" H 17300 7700 60  0001 C CNN
	1    17300 7700
	1    0    0    -1  
$EndComp
$Comp
L CGrid22_M J?
U 1 1 5BBB94AB
P 17650 7700
F 0 "J?" H 17600 4650 60  0000 C CNN
F 1 "CGrid22_M" H 17550 8200 60  0001 C CNN
F 2 "" H 17550 7700 60  0001 C CNN
F 3 "" H 17550 7700 60  0001 C CNN
	1    17650 7700
	1    0    0    -1  
$EndComp
Wire Wire Line
	11100 4300 13400 4300
Wire Wire Line
	11100 4200 13300 4200
Wire Wire Line
	13300 4200 13300 4100
Wire Wire Line
	13300 4100 13400 4100
Wire Wire Line
	14300 4100 14500 4100
Wire Wire Line
	14500 4100 14500 1600
Wire Wire Line
	14300 4300 14900 4300
Wire Wire Line
	14900 4300 14900 1600
Wire Wire Line
	15200 5250 15200 1550
Wire Wire Line
	15300 5350 15300 1650
Wire Wire Line
	15400 5450 15400 1750
Wire Wire Line
	15600 3050 18100 3050
Wire Wire Line
	16300 4550 18100 4550
Wire Wire Line
	16400 4650 18000 4650
$Comp
L MFit3_24_F J?
U 1 1 5BBC693D
P 21850 7700
F 0 "J?" H 21800 4350 60  0000 C CNN
F 1 "MFit3_24_F" H 21850 8200 60  0000 C CNN
F 2 "" H 21850 7700 60  0001 C CNN
F 3 "" H 21850 7700 60  0001 C CNN
	1    21850 7700
	1    0    0    -1  
$EndComp
Wire Wire Line
	14400 7850 17100 7850
Wire Wire Line
	17100 7550 16850 7550
Wire Wire Line
	16850 7550 16850 10800
Wire Wire Line
	17100 8300 12300 8300
Wire Wire Line
	12300 8300 12300 3400
Wire Wire Line
	12300 3400 11100 3400
Wire Wire Line
	10350 9750 10350 10000
Wire Wire Line
	10350 10000 12300 10000
Wire Wire Line
	12300 10000 12300 8450
Wire Wire Line
	12300 8450 17100 8450
Wire Wire Line
	7700 3600 7700 10100
Wire Wire Line
	7700 10100 12400 10100
Wire Wire Line
	12400 10100 12400 8600
Wire Wire Line
	12400 8600 17100 8600
Wire Wire Line
	11100 3000 12500 3000
Wire Wire Line
	12500 3000 12500 8750
Wire Wire Line
	12500 8750 17100 8750
Wire Wire Line
	11100 2900 12600 2900
Wire Wire Line
	12600 2900 12600 8900
Wire Wire Line
	12600 8900 17100 8900
Wire Wire Line
	11100 3200 12700 3200
Wire Wire Line
	12700 3200 12700 9050
Wire Wire Line
	12700 9050 17100 9050
Wire Wire Line
	11100 3100 12800 3100
Wire Wire Line
	12800 3100 12800 9200
Wire Wire Line
	12800 9200 17100 9200
Wire Wire Line
	17100 9350 12500 9350
Wire Wire Line
	12500 9350 12500 10200
Wire Wire Line
	12500 10200 7600 10200
Wire Wire Line
	7600 10200 7600 3850
Wire Wire Line
	7600 3850 8100 3850
Wire Wire Line
	10250 9750 10250 10300
Wire Wire Line
	10250 10300 12600 10300
Wire Wire Line
	12600 10300 12600 9500
Wire Wire Line
	12600 9500 17100 9500
Wire Wire Line
	12900 4450 12900 9800
Wire Wire Line
	12900 9800 17100 9800
Wire Wire Line
	11100 3600 13000 3600
Wire Wire Line
	13000 3600 13000 9950
Wire Wire Line
	13000 9950 17100 9950
Wire Wire Line
	17100 7700 16300 7700
Wire Wire Line
	16300 7700 16300 7750
Wire Wire Line
	16300 7750 14300 7750
Wire Wire Line
	17100 8000 16300 8000
Wire Wire Line
	16300 8000 16300 7950
Wire Wire Line
	16300 7950 14500 7950
Wire Wire Line
	17100 8150 16150 8150
Wire Wire Line
	16150 8150 16150 8050
Wire Wire Line
	16150 8050 14600 8050
Wire Wire Line
	17100 10100 16300 10100
Wire Wire Line
	16300 10100 16300 10150
Wire Wire Line
	16300 10150 13800 10150
Wire Wire Line
	13900 10250 17100 10250
Wire Wire Line
	17100 10400 16300 10400
Wire Wire Line
	16300 10400 16300 10350
Wire Wire Line
	16300 10350 14000 10350
Wire Wire Line
	17100 10550 16150 10550
Wire Wire Line
	16150 10550 16150 10450
Wire Wire Line
	16150 10450 14100 10450
Wire Wire Line
	17750 7550 18150 7550
Wire Wire Line
	18150 7550 18150 7600
Wire Wire Line
	18150 7600 21000 7600
Wire Wire Line
	21000 7600 21000 7850
Wire Wire Line
	21000 7850 21650 7850
Wire Wire Line
	17750 7700 21100 7700
Wire Wire Line
	21100 7700 21100 7400
Wire Wire Line
	21100 7400 21650 7400
Wire Wire Line
	17750 7850 18150 7850
Wire Wire Line
	18150 7850 18150 7800
Wire Wire Line
	18150 7800 20900 7800
Wire Wire Line
	20900 7800 20900 9200
Wire Wire Line
	20900 9200 21650 9200
Wire Wire Line
	17750 8000 18250 8000
Wire Wire Line
	18250 8000 18250 7900
Wire Wire Line
	18250 7900 20800 7900
Wire Wire Line
	20800 7900 20800 8000
Wire Wire Line
	20800 8000 21200 8000
Wire Wire Line
	21200 8000 21200 7550
Wire Wire Line
	21200 7550 21650 7550
Wire Wire Line
	17750 8150 18350 8150
Wire Wire Line
	18350 8150 18350 8000
Wire Wire Line
	18350 8000 20700 8000
Wire Wire Line
	20700 8000 20700 9350
Wire Wire Line
	20700 9350 21650 9350
Wire Wire Line
	17750 8300 18450 8300
Wire Wire Line
	18450 8300 18450 8100
Wire Wire Line
	18450 8100 21300 8100
Wire Wire Line
	21300 8100 21300 7700
Wire Wire Line
	21300 7700 21650 7700
Wire Wire Line
	17750 8450 18550 8450
Wire Wire Line
	18550 8450 18550 8200
Wire Wire Line
	18550 8200 20600 8200
Wire Wire Line
	20600 8200 20600 9500
Wire Wire Line
	20600 9500 21650 9500
Wire Wire Line
	17750 8600 20500 8600
Wire Wire Line
	20500 8600 20500 9800
Wire Wire Line
	20500 9800 21650 9800
Wire Wire Line
	17750 8750 18100 8750
Wire Wire Line
	18100 8750 18100 8700
Wire Wire Line
	18100 8700 21400 8700
Wire Wire Line
	21400 8700 21400 8150
Wire Wire Line
	21400 8150 21650 8150
Wire Wire Line
	17750 8900 18200 8900
Wire Wire Line
	18200 8900 18200 8800
Wire Wire Line
	18200 8800 20400 8800
Wire Wire Line
	20400 8800 20400 9950
Wire Wire Line
	20400 9950 21650 9950
Wire Wire Line
	17750 9050 18300 9050
Wire Wire Line
	18300 9050 18300 8900
Wire Wire Line
	18300 8900 21000 8900
Wire Wire Line
	21000 8900 21000 8300
Wire Wire Line
	21000 8300 21650 8300
Wire Wire Line
	17750 9200 18400 9200
Wire Wire Line
	18400 9200 18400 9000
Wire Wire Line
	18400 9000 20300 9000
Wire Wire Line
	20300 9000 20300 10100
Wire Wire Line
	20300 10100 21650 10100
Wire Wire Line
	17750 9350 18500 9350
Wire Wire Line
	18500 9350 18500 9100
Wire Wire Line
	18500 9100 20200 9100
Wire Wire Line
	20200 9100 20200 10250
Wire Wire Line
	20200 10250 21650 10250
Wire Wire Line
	17750 9500 18600 9500
Wire Wire Line
	18600 9500 18600 9200
Wire Wire Line
	18600 9200 20100 9200
Wire Wire Line
	20100 9200 20100 10550
Wire Wire Line
	20100 10550 21650 10550
Wire Wire Line
	17750 9650 18100 9650
Wire Wire Line
	18100 9650 18100 9700
Wire Wire Line
	18100 9700 20800 9700
Wire Wire Line
	20800 9700 20800 8600
Wire Wire Line
	20800 8600 21650 8600
Wire Wire Line
	17750 9800 20000 9800
Wire Wire Line
	20000 9800 20000 9600
Wire Wire Line
	20000 9600 21100 9600
Wire Wire Line
	21100 9600 21100 8450
Wire Wire Line
	21100 8450 21650 8450
Wire Wire Line
	17750 9950 18100 9950
Wire Wire Line
	18100 9950 18100 9900
Wire Wire Line
	18100 9900 21500 9900
Wire Wire Line
	21500 9900 21500 8750
Wire Wire Line
	21500 8750 21650 8750
Wire Wire Line
	21650 8900 21200 8900
Wire Wire Line
	21200 8900 21200 10000
Wire Wire Line
	21200 10000 18200 10000
Wire Wire Line
	18200 10000 18200 10100
Wire Wire Line
	18200 10100 17750 10100
Wire Wire Line
	17750 10250 18300 10250
Wire Wire Line
	18300 10250 18300 10100
Wire Wire Line
	18300 10100 20000 10100
Wire Wire Line
	20000 10100 20000 10700
Wire Wire Line
	20000 10700 21650 10700
Wire Wire Line
	21650 9050 21300 9050
Wire Wire Line
	21300 9050 21300 10400
Wire Wire Line
	21300 10400 19900 10400
Wire Wire Line
	19900 10400 19900 10200
Wire Wire Line
	19900 10200 18400 10200
Wire Wire Line
	18400 10200 18400 10400
Wire Wire Line
	18400 10400 17750 10400
Wire Wire Line
	17750 10550 18500 10550
Wire Wire Line
	18500 10550 18500 10300
Wire Wire Line
	18500 10300 19800 10300
Wire Wire Line
	19800 10300 19800 10850
Wire Wire Line
	19800 10850 21650 10850
Text Notes 18800 7350 0    60   ~ 0
CHAINFLEX CF9 CABLES
Text Notes 19100 7550 0    60   ~ 0
CABLE 1
Text Notes 19100 8550 0    60   ~ 0
CABLE 2
Text Notes 19100 9650 0    60   ~ 0
CABLE 3
Text Notes 15100 8250 0    39   ~ 0
NOT GROUNDED
Text Notes 15100 10700 0    39   ~ 0
NOT GROUNDED
Text Notes 16650 11000 0    39   ~ 0
CHASIS GROUND
Text Notes 7950 13100 0    39   ~ 0
WIRE ASSEMBLY\n10_CONDUCTOR\nRIBBON CABLE\n28AWG 300V\n
Text Notes 22100 9250 0    60   ~ 0
TO DUAL\nEXTRUDER\nASSEMBLY\nP5
Text Notes 11300 5150 0    60   ~ 0
RED
Text Notes 11300 5250 0    60   ~ 0
WHT
Text Notes 11300 5350 0    60   ~ 0
GRN
Text Notes 11300 5450 0    60   ~ 0
BLK
$Comp
L STEPPER_MOTOR_TAZ7 M?
U 1 1 5BBE4BE4
P 21900 1900
F 0 "M?" H 21900 1400 60  0000 C CNN
F 1 "STEPPER_MOTOR_TAZ7" H 21900 2400 60  0000 C CNN
F 2 "" H 21900 1900 60  0001 C CNN
F 3 "" H 21900 1900 60  0001 C CNN
	1    21900 1900
	1    0    0    -1  
$EndComp
$Comp
L STEPPER_MOTOR_TAZ7 M?
U 1 1 5BBE4C75
P 21900 3200
F 0 "M?" H 21900 2700 60  0000 C CNN
F 1 "STEPPER_MOTOR_TAZ7" H 21900 3700 60  0000 C CNN
F 2 "" H 21900 3200 60  0001 C CNN
F 3 "" H 21900 3200 60  0001 C CNN
	1    21900 3200
	1    0    0    -1  
$EndComp
$Comp
L STEPPER_MOTOR_TAZ7 M?
U 1 1 5BBE4DB2
P 21900 4500
F 0 "M?" H 21900 4000 60  0000 C CNN
F 1 "STEPPER_MOTOR_TAZ7" H 21900 5000 60  0000 C CNN
F 2 "" H 21900 4500 60  0001 C CNN
F 3 "" H 21900 4500 60  0001 C CNN
	1    21900 4500
	1    0    0    -1  
$EndComp
$Comp
L STEPPER_MOTOR_TAZ7 M?
U 1 1 5BBE4E05
P 21900 5800
F 0 "M?" H 21900 5300 60  0000 C CNN
F 1 "STEPPER_MOTOR_TAZ7" H 21900 6300 60  0000 C CNN
F 2 "" H 21900 5800 60  0001 C CNN
F 3 "" H 21900 5800 60  0001 C CNN
	1    21900 5800
	1    0    0    -1  
$EndComp
$EndSCHEMATC
