\relax 
\providecommand*\new@tpo@label[2]{}
\@writefile{toc}{\contentsline {section}{\numberline {1}Dimension 01}{2}}
\@writefile{lof}{\contentsline {figure}{\numberline {1}{\ignorespaces Placement of the dial gauge against the measuring arm.\relax }}{2}}
\providecommand*\caption@xref[2]{\@setref\relax\@undefined{#1}}
\newlabel{fig:dim01}{{1}{2}}
\@writefile{lof}{\contentsline {figure}{\numberline {2}{\ignorespaces Set up for taking the measurement.\relax }}{2}}
\newlabel{fig:dim02}{{2}{2}}
