\relax 
\providecommand*\new@tpo@label[2]{}
\@writefile{lof}{\contentsline {figure}{\numberline {1}{\ignorespaces Schematic of PP-FP0154.\relax }}{1}}
\providecommand*\caption@xref[2]{\@setref\relax\@undefined{#1}}
\newlabel{fig:diagram}{{1}{1}}
\@writefile{toc}{\contentsline {section}{\numberline {1}Dimension 01, 02, and 03}{2}}
\@writefile{lof}{\contentsline {figure}{\numberline {2}{\ignorespaces Dimension 02\relax }}{2}}
\newlabel{fig:dim01}{{2}{2}}
