,Config,,dim29,,dim29b,ucl,lcl
Chart Title,PP-MP0232: Motor Mount ambidextrous v2.0 Dim29,29.44,23.45,29.35,23.36,23.75,23.25
X-axis,,29.41,23.42,29.35,23.36,,
Y-axis 1,dim29,29.35,23.36,29.47,23.48,,
Y-axis 2,dim29b,29.36,23.37,29.39,23.4,,
Y-axis 3,,29.41,23.42,29.4,23.41,,
Y-axis 4,,29.4,23.41,29.43,23.44,,
UCL,ucl,29.39,23.4,29.4,23.41,,
LCL,lcl,29.39,23.4,29.47,23.48,,
X label,Index,29.32,23.33,29.42,23.43,,
Y label,Dimension (mm),29.41,23.42,29.37,23.38,,
hist1,dim29,29.37,23.38,29.4,23.41,,
hist2,dim29b,29.37,23.38,29.45,23.46,,
hist3,,29.34,23.35,29.41,23.42,,
hist4,,29.36,23.37,29.41,23.42,,
change index,,29.39,23.4,29.43,23.44,,
change,,29.38,23.39,29.4,23.41,,
,,29.36,23.37,29.42,23.43,,
,,29.44,23.45,29.42,23.43,,
,,29.34,23.35,29.47,23.48,,
,,29.32,23.33,29.41,23.42,,
,,29.4,23.41,29.49,23.5,,
,,29.35,23.36,29.4,23.41,,
,,29.39,23.4,29.46,23.47,,
,,29.47,23.48,29.45,23.46,,
,,29.39,23.4,29.41,23.42,,
,,29.34,23.35,29.47,23.48,,
,,29.34,23.35,29.43,23.44,,
,,29.35,23.36,29.47,23.48,,
,,29.4,23.41,29.45,23.46,,
,,29.36,23.37,29.38,23.39,,
