\relax 
\providecommand*\new@tpo@label[2]{}
\@writefile{toc}{\contentsline {section}{\numberline {1}Dimension 01}{2}}
\@writefile{lof}{\contentsline {figure}{\numberline {1}{\ignorespaces \relax }}{2}}
\providecommand*\caption@xref[2]{\@setref\relax\@undefined{#1}}
\newlabel{fig:dim01}{{1}{2}}
