<?xml version="1.0" encoding="UTF-8" standalone="no"?>
<!-- Created with Inkscape (http://www.inkscape.org/) -->

<svg
   xmlns:dc="http://purl.org/dc/elements/1.1/"
   xmlns:cc="http://creativecommons.org/ns#"
   xmlns:rdf="http://www.w3.org/1999/02/22-rdf-syntax-ns#"
   xmlns:svg="http://www.w3.org/2000/svg"
   xmlns="http://www.w3.org/2000/svg"
   xmlns:sodipodi="http://sodipodi.sourceforge.net/DTD/sodipodi-0.dtd"
   xmlns:inkscape="http://www.inkscape.org/namespaces/inkscape"
   width="1.625in"
   height="2in"
   viewBox="0 0 41.275 50.799999"
   version="1.1"
   id="svg8"
   inkscape:version="0.92.1 r15371"
   sodipodi:docname="hotSymbol_Sized_EngFr_05.svg">
  <defs
     id="defs2" />
  <sodipodi:namedview
     id="base"
     pagecolor="#ffffff"
     bordercolor="#666666"
     borderopacity="1.0"
     inkscape:pageopacity="0.0"
     inkscape:pageshadow="2"
     inkscape:zoom="2.8284271"
     inkscape:cx="134.39115"
     inkscape:cy="95.382591"
     inkscape:document-units="in"
     inkscape:current-layer="layer1"
     showgrid="false"
     showguides="false"
     inkscape:guide-bbox="true"
     inkscape:window-width="1920"
     inkscape:window-height="971"
     inkscape:window-x="0"
     inkscape:window-y="31"
     inkscape:window-maximized="1"
     units="in">
    <sodipodi:guide
       position="20.322506,33.55903"
       orientation="0,1"
       id="guide4563"
       inkscape:locked="false" />
    <sodipodi:guide
       position="25.527936,12.703091"
       orientation="0,1"
       id="guide4565"
       inkscape:locked="false" />
    <sodipodi:guide
       position="12.703091,18.242937"
       orientation="1,0"
       id="guide4567"
       inkscape:locked="false" />
    <sodipodi:guide
       position="31.737434,11.444957"
       orientation="1,0"
       id="guide4569"
       inkscape:locked="false" />
    <sodipodi:guide
       position="15.870866,22.208463"
       orientation="1,0"
       id="guide4571"
       inkscape:locked="false" />
    <sodipodi:guide
       position="28.571808,10.755013"
       orientation="1,0"
       id="guide4573"
       inkscape:locked="false" />
    <sodipodi:guide
       position="19.971715,36.739537"
       orientation="0,1"
       id="guide4575"
       inkscape:locked="false" />
    <sodipodi:guide
       position="21.712951,15.909302"
       orientation="0,1"
       id="guide4577"
       inkscape:locked="false" />
    <sodipodi:guide
       position="22.255767,29.214851"
       orientation="1,0"
       id="guide4705"
       inkscape:locked="false" />
    <sodipodi:guide
       position="12.703091,17.405274"
       orientation="1,0"
       id="guide4537"
       inkscape:locked="false" />
    <sodipodi:guide
       position="17.820196,35.40653"
       orientation="1,0"
       id="guide5425"
       inkscape:locked="false" />
    <sodipodi:guide
       position="20.977317,35.804094"
       orientation="1,0"
       id="guide5427"
       inkscape:locked="false" />
  </sodipodi:namedview>
  <metadata
     id="metadata5">
    <rdf:RDF>
      <cc:Work
         rdf:about="">
        <dc:format>image/svg+xml</dc:format>
        <dc:type
           rdf:resource="http://purl.org/dc/dcmitype/StillImage" />
        <dc:title></dc:title>
      </cc:Work>
    </rdf:RDF>
  </metadata>
  <g
     inkscape:groupmode="layer"
     id="layer2"
     inkscape:label="Background"
     transform="translate(0,23.800002)" />
  <g
     inkscape:label="Copy"
     inkscape:groupmode="layer"
     id="layer1"
     transform="translate(0,-246.19999)"
     style="display:inline">
    <path
       style="color:#000000;font-style:normal;font-variant:normal;font-weight:normal;font-stretch:normal;font-size:medium;line-height:normal;font-family:sans-serif;font-variant-ligatures:normal;font-variant-position:normal;font-variant-caps:normal;font-variant-numeric:normal;font-variant-alternates:normal;font-feature-settings:normal;text-indent:0;text-align:start;text-decoration:none;text-decoration-line:none;text-decoration-style:solid;text-decoration-color:#000000;letter-spacing:normal;word-spacing:normal;text-transform:none;writing-mode:lr-tb;direction:ltr;text-orientation:mixed;dominant-baseline:auto;baseline-shift:baseline;text-anchor:start;white-space:normal;shape-padding:0;clip-rule:nonzero;display:inline;overflow:visible;visibility:visible;opacity:1;isolation:auto;mix-blend-mode:normal;color-interpolation:sRGB;color-interpolation-filters:linearRGB;solid-color:#000000;solid-opacity:1;vector-effect:none;fill:#000000;fill-opacity:1;fill-rule:nonzero;stroke:none;stroke-width:24;stroke-linecap:butt;stroke-linejoin:round;stroke-miterlimit:4;stroke-dasharray:none;stroke-dashoffset:0;stroke-opacity:1;paint-order:markers fill stroke;color-rendering:auto;image-rendering:auto;shape-rendering:auto;text-rendering:auto;enable-background:accumulate"
       d="m 59.984375,17.042969 c -6.62638,-4.16e-4 -11.999133,5.369714 -12.001953,11.996093 -0.04348,22.273042 0.03125,44.596518 0.03125,66.828126 -4.15e-4,6.628672 5.373285,12.002372 12.001953,12.001952 h 47.974605 c 6.62562,-0.004 11.99456,-5.37633 11.99415,-12.001952 v -10.34961 c 2e-4,-3.312811 -1.34193,-6.312326 -3.51231,-8.484125 C 114.30846,74.86843 107.4997,68.836239 96.686542,53.992423 85.873379,39.148607 83.347341,34.927262 78.970975,24.368637 78.363354,22.933239 77.48416,21.640685 76.397868,20.555277 74.225284,18.384459 71.224308,17.042221 67.910737,17.042969 Z"
       transform="matrix(0.26458333,0,0,0.26458333,0,255.72499)"
       id="rect4735"
       inkscape:connector-curvature="0"
       sodipodi:nodetypes="cccccccszcscc" />
    <path
       inkscape:connector-curvature="0"
       d="m 26.2152,277.55208 -3.774563,-6.53832 c -0.03857,-0.0665 -0.109059,-0.1064 -0.18487,-0.1064 -0.0758,0 -0.146303,0.0413 -0.184871,0.1064 l -3.774563,6.53832 c -0.03857,0.0666 -0.03857,0.14764 0,0.21281 0.03858,0.0665 0.109061,0.1064 0.18487,0.1064 h 7.549127 c 0.0758,0 0.1463,-0.0413 0.18487,-0.1064 0.03857,-0.0665 0.03857,-0.14764 0,-0.21281 z"
       id="sign_border-2"
       style="fill:#b3b3b3;fill-opacity:1;stroke-width:0.01330007" />
    <path
       id="sign_bg-3"
       d="m 22.255767,271.54843 3.40482,5.89593 h -6.809641 v 0 z"
       style="fill:#000000;fill-opacity:1;stroke-width:0.01330007"
       inkscape:connector-curvature="0" />
    <path
       id="rect2820"
       d="M 23.955277,277.08932 H 20.556256"
       style="fill:none;fill-opacity:1;stroke:#b3b3b3;stroke-width:0.25400001;stroke-linecap:butt;stroke-miterlimit:4;stroke-dasharray:none;stroke-dashoffset:0;stroke-opacity:1"
       inkscape:connector-curvature="0"
       sodipodi:nodetypes="cc" />
    <path
       style="color:#000000;font-style:normal;font-variant:normal;font-weight:normal;font-stretch:normal;font-size:medium;line-height:normal;font-family:sans-serif;text-indent:0;text-align:start;text-decoration:none;text-decoration-line:none;text-decoration-style:solid;text-decoration-color:#000000;letter-spacing:normal;word-spacing:normal;text-transform:none;writing-mode:lr-tb;direction:ltr;baseline-shift:baseline;text-anchor:start;white-space:normal;clip-rule:nonzero;display:inline;overflow:visible;visibility:visible;opacity:1;isolation:auto;mix-blend-mode:normal;color-interpolation:sRGB;color-interpolation-filters:linearRGB;solid-color:#000000;solid-opacity:1;fill:#b3b3b3;fill-opacity:1;fill-rule:nonzero;stroke:none;stroke-width:0.18850507;stroke-linecap:butt;stroke-linejoin:miter;stroke-miterlimit:4;stroke-dasharray:none;stroke-dashoffset:0;stroke-opacity:1;color-rendering:auto;image-rendering:auto;shape-rendering:auto;text-rendering:auto;enable-background:accumulate"
       d="m 22.179951,273.91133 c -0.203585,0.28375 -0.261084,0.54685 -0.235304,0.78475 0.02577,0.23791 0.128019,0.44697 0.224302,0.64676 0.09629,0.19978 0.186672,0.39035 0.209636,0.58714 0.02297,0.19677 -0.01477,0.40296 -0.193239,0.65812 l 0.154476,0.10804 c 0.199676,-0.28547 0.253815,-0.54971 0.226001,-0.78802 -0.02781,-0.23831 -0.13086,-0.44749 -0.227062,-0.64712 -0.0962,-0.19961 -0.185492,-0.38957 -0.206695,-0.58522 -0.02121,-0.19568 0.01888,-0.40068 0.201028,-0.65455 z"
       id="path4600"
       inkscape:connector-curvature="0" />
    <text
       xml:space="preserve"
       style="font-style:normal;font-weight:normal;font-size:4.30931997px;line-height:0%;font-family:sans-serif;letter-spacing:0px;word-spacing:0px;fill:#b3b3b3;fill-opacity:1;stroke:none;stroke-width:0.35911003px;stroke-linecap:butt;stroke-linejoin:miter;stroke-opacity:1"
       x="15.739833"
       y="279.69223"
       id="text4747"><tspan
         sodipodi:role="line"
         x="15.739833"
         y="279.69223"
         style="font-style:normal;font-variant:normal;font-weight:bold;font-stretch:normal;font-size:1.97600663px;line-height:1.28999996;font-family:Titillium;-inkscape-font-specification:'Titillium Bold';fill:#b3b3b3;fill-opacity:1;stroke-width:0.35911003px"
         id="tspan4525">CAUTION: HOT!</tspan></text>
    <text
       id="text4549"
       y="281.0853"
       x="15.808125"
       style="font-style:normal;font-weight:normal;font-size:3.15283823px;line-height:0%;font-family:sans-serif;letter-spacing:0px;word-spacing:0px;fill:#b3b3b3;fill-opacity:1;stroke:none;stroke-width:0.26273653px;stroke-linecap:butt;stroke-linejoin:miter;stroke-opacity:1"
       xml:space="preserve"><tspan
         id="tspan4547"
         style="font-style:normal;font-variant:normal;font-weight:bold;font-stretch:normal;font-size:1.44571066px;line-height:1.28999996;font-family:Titillium;-inkscape-font-specification:'Titillium Bold';fill:#b3b3b3;fill-opacity:1;stroke-width:0.26273653px"
         y="281.0853"
         x="15.808125"
         sodipodi:role="line">ATTENTION: CHAUD!</tspan></text>
    <g
       id="g4715"
       transform="translate(2.0014583e-6,-4.2666476)">
      <path
         style="opacity:1;vector-effect:none;fill:none;fill-opacity:1;stroke:#000000;stroke-width:0.5;stroke-linecap:butt;stroke-linejoin:miter;stroke-miterlimit:4;stroke-dasharray:none;stroke-dashoffset:0;stroke-opacity:1"
         d="m 12.703089,262.9396 2e-6,-3"
         id="path4597"
         inkscape:connector-curvature="0"
         sodipodi:nodetypes="cc" />
      <path
         sodipodi:nodetypes="cc"
         inkscape:connector-curvature="0"
         id="path4599"
         d="m 31.737434,262.9396 2e-6,-3"
         style="opacity:1;vector-effect:none;fill:none;fill-opacity:1;stroke:#000000;stroke-width:0.5;stroke-linecap:butt;stroke-linejoin:miter;stroke-miterlimit:4;stroke-dasharray:none;stroke-dashoffset:0;stroke-opacity:1" />
    </g>
    <g
       id="g4863"
       transform="translate(0,0.52915904)">
      <text
         id="text4518"
         y="287.58823"
         x="19.808201"
         style="font-style:normal;font-variant:normal;font-weight:normal;font-stretch:normal;font-size:2.14936781px;line-height:1;font-family:sans-serif;font-variant-ligatures:normal;font-variant-position:normal;font-variant-caps:normal;font-variant-numeric:normal;font-variant-alternates:normal;font-feature-settings:normal;text-indent:0;text-align:start;text-decoration:none;text-decoration-line:none;text-decoration-style:solid;text-decoration-color:#000000;letter-spacing:0px;word-spacing:0px;text-transform:none;writing-mode:lr-tb;direction:ltr;text-orientation:mixed;dominant-baseline:auto;baseline-shift:baseline;text-anchor:start;white-space:normal;shape-padding:0;opacity:1;vector-effect:none;fill:#000000;fill-opacity:1;stroke:none;stroke-width:0.05373419;stroke-linecap:butt;stroke-linejoin:miter;stroke-miterlimit:4;stroke-dasharray:none;stroke-dashoffset:0;stroke-opacity:1"
         xml:space="preserve"><tspan
           id="tspan1197"
           style="font-style:normal;font-variant:normal;font-weight:normal;font-stretch:normal;font-family:Titillium;-inkscape-font-specification:Titillium;stroke-width:0.05373419"
           y="287.58823"
           x="19.808201"
           sodipodi:role="line">0.75&quot;</tspan></text>
      <g
         id="g4757">
        <path
           style="opacity:1;vector-effect:none;fill:none;fill-opacity:1;stroke:#000000;stroke-width:0.5;stroke-linecap:butt;stroke-linejoin:miter;stroke-miterlimit:4;stroke-dasharray:none;stroke-dashoffset:0;stroke-opacity:1"
           d="m 12.703089,288.35524 2e-6,-3"
           id="path874"
           inkscape:connector-curvature="0"
           sodipodi:nodetypes="cc" />
        <path
           sodipodi:nodetypes="cc"
           inkscape:connector-curvature="0"
           id="path876"
           d="m 31.737432,288.35524 2e-6,-3"
           style="opacity:1;vector-effect:none;fill:none;fill-opacity:1;stroke:#000000;stroke-width:0.5;stroke-linecap:butt;stroke-linejoin:miter;stroke-miterlimit:4;stroke-dasharray:none;stroke-dashoffset:0;stroke-opacity:1" />
      </g>
      <path
         sodipodi:nodetypes="cc"
         inkscape:connector-curvature="0"
         id="path4603"
         d="m 12.703091,286.85527 h 6.006572"
         style="opacity:1;vector-effect:none;fill:none;fill-opacity:1;stroke:#000000;stroke-width:0.4064;stroke-linecap:butt;stroke-linejoin:miter;stroke-miterlimit:4;stroke-dasharray:none;stroke-dashoffset:0;stroke-opacity:1" />
      <path
         style="opacity:1;vector-effect:none;fill:none;fill-opacity:1;stroke:#000000;stroke-width:0.4064;stroke-linecap:butt;stroke-linejoin:miter;stroke-miterlimit:4;stroke-dasharray:none;stroke-dashoffset:0;stroke-opacity:1"
         d="m 25.730862,286.85527 h 6.006572"
         id="path4759"
         inkscape:connector-curvature="0"
         sodipodi:nodetypes="cc" />
    </g>
    <text
       xml:space="preserve"
       style="font-style:normal;font-variant:normal;font-weight:normal;font-stretch:normal;font-size:3.12616372px;line-height:1;font-family:sans-serif;font-variant-ligatures:normal;font-variant-position:normal;font-variant-caps:normal;font-variant-numeric:normal;font-variant-alternates:normal;font-feature-settings:normal;text-indent:0;text-align:start;text-decoration:none;text-decoration-line:none;text-decoration-style:solid;text-decoration-color:#000000;letter-spacing:0px;word-spacing:0px;text-transform:none;writing-mode:lr-tb;direction:ltr;text-orientation:mixed;dominant-baseline:auto;baseline-shift:baseline;text-anchor:start;white-space:normal;shape-padding:0;display:inline;opacity:1;vector-effect:none;fill:#b3b3b3;fill-opacity:1;stroke:none;stroke-width:0.07815411;stroke-linecap:butt;stroke-linejoin:miter;stroke-miterlimit:4;stroke-dasharray:none;stroke-dashoffset:0;stroke-opacity:1"
       x="263.38892"
       y="-16.212698"
       id="text4517"
       transform="rotate(90)"><tspan
         sodipodi:role="line"
         id="tspan4515"
         x="263.38892"
         y="-16.212698"
         style="font-style:normal;font-variant:normal;font-weight:600;font-stretch:normal;font-size:2.11666656px;font-family:Titillium;-inkscape-font-specification:'Titillium Semi-Bold';fill:#b3b3b3;fill-opacity:1;stroke-width:0.07815411">0.50mm</tspan></text>
    <g
       id="g4538"
       transform="translate(0.02433279)">
      <path
         style="color:#000000;font-style:normal;font-variant:normal;font-weight:normal;font-stretch:normal;font-size:medium;line-height:normal;font-family:sans-serif;text-indent:0;text-align:start;text-decoration:none;text-decoration-line:none;text-decoration-style:solid;text-decoration-color:#000000;letter-spacing:normal;word-spacing:normal;text-transform:none;writing-mode:lr-tb;direction:ltr;baseline-shift:baseline;text-anchor:start;white-space:normal;clip-rule:nonzero;display:inline;overflow:visible;visibility:visible;opacity:1;isolation:auto;mix-blend-mode:normal;color-interpolation:sRGB;color-interpolation-filters:linearRGB;solid-color:#000000;solid-opacity:1;fill:none;fill-opacity:1;fill-rule:nonzero;stroke:#b3b3b3;stroke-width:0.25400001;stroke-linecap:butt;stroke-linejoin:miter;stroke-miterlimit:4;stroke-dasharray:none;stroke-dashoffset:0;stroke-opacity:1;color-rendering:auto;image-rendering:auto;shape-rendering:auto;text-rendering:auto;enable-background:accumulate"
         d="m 22.249768,273.9671 c -0.203584,0.28375 -0.261084,0.54685 -0.235304,0.78475 0.02577,0.23791 0.128017,0.44697 0.224303,0.64676 0.09629,0.19978 0.18667,0.39035 0.209635,0.58714 0.02297,0.19677 -0.01477,0.40296 -0.193239,0.65812"
         id="path4529"
         inkscape:connector-curvature="0"
         sodipodi:nodetypes="ccccc" />
      <path
         sodipodi:nodetypes="ccccc"
         inkscape:connector-curvature="0"
         id="path4531"
         d="m 21.38753,273.9671 c -0.203584,0.28375 -0.261084,0.54685 -0.235304,0.78475 0.02577,0.23791 0.128017,0.44697 0.224303,0.64676 0.09629,0.19978 0.18667,0.39035 0.209635,0.58714 0.02297,0.19677 -0.01477,0.40296 -0.193239,0.65812"
         style="color:#000000;font-style:normal;font-variant:normal;font-weight:normal;font-stretch:normal;font-size:medium;line-height:normal;font-family:sans-serif;text-indent:0;text-align:start;text-decoration:none;text-decoration-line:none;text-decoration-style:solid;text-decoration-color:#000000;letter-spacing:normal;word-spacing:normal;text-transform:none;writing-mode:lr-tb;direction:ltr;baseline-shift:baseline;text-anchor:start;white-space:normal;clip-rule:nonzero;display:inline;overflow:visible;visibility:visible;opacity:1;isolation:auto;mix-blend-mode:normal;color-interpolation:sRGB;color-interpolation-filters:linearRGB;solid-color:#000000;solid-opacity:1;fill:none;fill-opacity:1;fill-rule:nonzero;stroke:#b3b3b3;stroke-width:0.25400001;stroke-linecap:butt;stroke-linejoin:miter;stroke-miterlimit:4;stroke-dasharray:none;stroke-dashoffset:0;stroke-opacity:1;color-rendering:auto;image-rendering:auto;shape-rendering:auto;text-rendering:auto;enable-background:accumulate" />
      <path
         sodipodi:nodetypes="ccccc"
         inkscape:connector-curvature="0"
         id="path4533"
         d="m 23.112002,273.9671 c -0.203584,0.28375 -0.261084,0.54685 -0.235304,0.78475 0.02577,0.23791 0.128017,0.44697 0.224303,0.64676 0.09629,0.19978 0.18667,0.39035 0.209635,0.58714 0.02297,0.19677 -0.01477,0.40296 -0.193239,0.65812"
         style="color:#000000;font-style:normal;font-variant:normal;font-weight:normal;font-stretch:normal;font-size:medium;line-height:normal;font-family:sans-serif;text-indent:0;text-align:start;text-decoration:none;text-decoration-line:none;text-decoration-style:solid;text-decoration-color:#000000;letter-spacing:normal;word-spacing:normal;text-transform:none;writing-mode:lr-tb;direction:ltr;baseline-shift:baseline;text-anchor:start;white-space:normal;clip-rule:nonzero;display:inline;overflow:visible;visibility:visible;opacity:1;isolation:auto;mix-blend-mode:normal;color-interpolation:sRGB;color-interpolation-filters:linearRGB;solid-color:#000000;solid-opacity:1;fill:none;fill-opacity:1;fill-rule:nonzero;stroke:#b3b3b3;stroke-width:0.25400001;stroke-linecap:butt;stroke-linejoin:miter;stroke-miterlimit:4;stroke-dasharray:none;stroke-dashoffset:0;stroke-opacity:1;color-rendering:auto;image-rendering:auto;shape-rendering:auto;text-rendering:auto;enable-background:accumulate" />
    </g>
    <circle
       style="opacity:1;fill:#000000;fill-opacity:1;stroke:none;stroke-width:31.5700264;stroke-linecap:butt;stroke-linejoin:round;stroke-miterlimit:4;stroke-dasharray:none;stroke-dashoffset:0;stroke-opacity:1;paint-order:markers fill stroke"
       id="path4741"
       cx="71.368538"
       cy="261.44"
       r="16.51" />
    <g
       id="g4794"
       transform="translate(-2.6458334)">
      <text
         transform="rotate(90)"
         xml:space="preserve"
         style="font-style:normal;font-variant:normal;font-weight:normal;font-stretch:normal;font-size:2.14936781px;line-height:1;font-family:sans-serif;font-variant-ligatures:normal;font-variant-position:normal;font-variant-caps:normal;font-variant-numeric:normal;font-variant-alternates:normal;font-feature-settings:normal;text-indent:0;text-align:start;text-decoration:none;text-decoration-line:none;text-decoration-style:solid;text-decoration-color:#000000;letter-spacing:0px;word-spacing:0px;text-transform:none;writing-mode:lr-tb;direction:ltr;text-orientation:mixed;dominant-baseline:auto;baseline-shift:baseline;text-anchor:start;white-space:normal;shape-padding:0;opacity:1;vector-effect:none;fill:#000000;fill-opacity:1;stroke:none;stroke-width:0.05373419;stroke-linecap:butt;stroke-linejoin:miter;stroke-miterlimit:4;stroke-dasharray:none;stroke-dashoffset:0;stroke-opacity:1"
         x="270.46902"
         y="-36.727085"
         id="text947"><tspan
           sodipodi:role="line"
           id="tspan945"
           x="270.46902"
           y="-36.727085"
           style="font-style:normal;font-variant:normal;font-weight:normal;font-stretch:normal;font-family:Titillium;-inkscape-font-specification:Titillium;stroke-width:0.05373419">1.0&quot;</tspan></text>
      <g
         id="g4773">
        <path
           sodipodi:nodetypes="cc"
           inkscape:connector-curvature="0"
           id="path935"
           d="m 38.970767,284.2969 h -3"
           style="opacity:1;vector-effect:none;fill:none;fill-opacity:1;stroke:#000000;stroke-width:0.5;stroke-linecap:butt;stroke-linejoin:miter;stroke-miterlimit:4;stroke-dasharray:none;stroke-dashoffset:0;stroke-opacity:1" />
        <path
           style="opacity:1;vector-effect:none;fill:none;fill-opacity:1;stroke:#000000;stroke-width:0.5;stroke-linecap:butt;stroke-linejoin:miter;stroke-miterlimit:4;stroke-dasharray:none;stroke-dashoffset:0;stroke-opacity:1"
           d="m 38.970767,260.26045 h -3"
           id="path937"
           inkscape:connector-curvature="0"
           sodipodi:nodetypes="cc" />
      </g>
      <path
         sodipodi:nodetypes="cc"
         style="opacity:1;vector-effect:none;fill:none;fill-opacity:1;stroke:#000000;stroke-width:0.4064;stroke-linecap:butt;stroke-linejoin:miter;stroke-miterlimit:4;stroke-dasharray:none;stroke-dashoffset:0;stroke-opacity:1"
         d="m 37.470767,274.42716 v 9.86974"
         id="path4586"
         inkscape:connector-curvature="0" />
      <path
         inkscape:connector-curvature="0"
         id="path4775"
         d="m 37.470767,260.26045 v 9.86974"
         style="opacity:1;vector-effect:none;fill:none;fill-opacity:1;stroke:#000000;stroke-width:0.4064;stroke-linecap:butt;stroke-linejoin:miter;stroke-miterlimit:4;stroke-dasharray:none;stroke-dashoffset:0;stroke-opacity:1"
         sodipodi:nodetypes="cc" />
    </g>
    <g
       id="g4785"
       transform="translate(-27.855177)">
      <path
         sodipodi:nodetypes="cc"
         inkscape:connector-curvature="0"
         id="path4781"
         d="m 38.970767,284.2969 h -3"
         style="opacity:1;vector-effect:none;fill:none;fill-opacity:1;stroke:#000000;stroke-width:0.5;stroke-linecap:butt;stroke-linejoin:miter;stroke-miterlimit:4;stroke-dasharray:none;stroke-dashoffset:0;stroke-opacity:1" />
      <path
         style="opacity:1;vector-effect:none;fill:none;fill-opacity:1;stroke:#000000;stroke-width:0.5;stroke-linecap:butt;stroke-linejoin:miter;stroke-miterlimit:4;stroke-dasharray:none;stroke-dashoffset:0;stroke-opacity:1"
         d="m 38.970767,260.26045 h -3"
         id="path4783"
         inkscape:connector-curvature="0"
         sodipodi:nodetypes="cc" />
    </g>
  </g>
</svg>
