<?xml version="1.0" encoding="UTF-8" standalone="no"?>
<!-- Created with Inkscape (http://www.inkscape.org/) -->

<svg
   xmlns:dc="http://purl.org/dc/elements/1.1/"
   xmlns:cc="http://creativecommons.org/ns#"
   xmlns:rdf="http://www.w3.org/1999/02/22-rdf-syntax-ns#"
   xmlns:svg="http://www.w3.org/2000/svg"
   xmlns="http://www.w3.org/2000/svg"
   xmlns:sodipodi="http://sodipodi.sourceforge.net/DTD/sodipodi-0.dtd"
   xmlns:inkscape="http://www.inkscape.org/namespaces/inkscape"
   width="1.625in"
   height="2in"
   viewBox="0 0 41.275 50.799999"
   version="1.1"
   id="svg8"
   inkscape:version="0.92.1 r15371"
   sodipodi:docname="hotSymbol_Sized_EngFr_04_Bleed.svg">
  <defs
     id="defs2" />
  <sodipodi:namedview
     id="base"
     pagecolor="#ffffff"
     bordercolor="#666666"
     borderopacity="1.0"
     inkscape:pageopacity="0.0"
     inkscape:pageshadow="2"
     inkscape:zoom="2.3049018"
     inkscape:cx="154.37638"
     inkscape:cy="82.019841"
     inkscape:document-units="in"
     inkscape:current-layer="layer1"
     showgrid="false"
     showguides="true"
     inkscape:guide-bbox="true"
     inkscape:window-width="1920"
     inkscape:window-height="971"
     inkscape:window-x="0"
     inkscape:window-y="31"
     inkscape:window-maximized="1"
     units="in">
    <sodipodi:guide
       position="22.255767,30.3552"
       orientation="0,1"
       id="guide4563"
       inkscape:locked="false" />
    <sodipodi:guide
       position="25.527936,12.703091"
       orientation="0,1"
       id="guide4565"
       inkscape:locked="false" />
    <sodipodi:guide
       position="12.703091,18.242937"
       orientation="1,0"
       id="guide4567"
       inkscape:locked="false" />
    <sodipodi:guide
       position="31.737434,11.444957"
       orientation="1,0"
       id="guide4569"
       inkscape:locked="false" />
    <sodipodi:guide
       position="15.828132,24.472727"
       orientation="1,0"
       id="guide4571"
       inkscape:locked="false" />
    <sodipodi:guide
       position="28.571808,10.755013"
       orientation="1,0"
       id="guide4573"
       inkscape:locked="false" />
    <sodipodi:guide
       position="22.255767,26.932976"
       orientation="0,1"
       id="guide4575"
       inkscape:locked="false" />
    <sodipodi:guide
       position="21.712951,15.909302"
       orientation="0,1"
       id="guide4577"
       inkscape:locked="false" />
    <sodipodi:guide
       position="22.255767,29.214851"
       orientation="1,0"
       id="guide4705"
       inkscape:locked="false" />
    <sodipodi:guide
       position="22.255767,19.485872"
       orientation="0,1"
       id="guide4707"
       inkscape:locked="false" />
    <sodipodi:guide
       position="12.703091,17.405274"
       orientation="1,0"
       id="guide4537"
       inkscape:locked="false" />
    <sodipodi:guide
       position="18.395352,36.934192"
       orientation="0,1"
       id="guide4529"
       inkscape:locked="false" />
    <sodipodi:guide
       position="15.41077,40.105309"
       orientation="0,1"
       id="guide4538"
       inkscape:locked="false" />
  </sodipodi:namedview>
  <metadata
     id="metadata5">
    <rdf:RDF>
      <cc:Work
         rdf:about="">
        <dc:format>image/svg+xml</dc:format>
        <dc:type
           rdf:resource="http://purl.org/dc/dcmitype/StillImage" />
        <dc:title></dc:title>
      </cc:Work>
    </rdf:RDF>
  </metadata>
  <g
     inkscape:groupmode="layer"
     id="layer2"
     inkscape:label="Background"
     transform="translate(0,23.800002)" />
  <g
     inkscape:label="Copy"
     inkscape:groupmode="layer"
     id="layer1"
     transform="translate(0,-246.19999)"
     style="display:inline">
    <path
       id="path4615"
       transform="matrix(0.26458333,0,0,0.26458333,0,246.19999)"
       d="M 59.822266 40.40625 A 12.0012 12.0012 0 0 0 47.820312 52.408203 L 47.820312 118.35156 A 12.0012 12.0012 0 0 0 47.925781 119.85938 C 47.863781 120.35339 47.820263 120.85355 47.820312 121.36328 L 47.820312 131.86719 C 47.819899 138.49586 53.193599 143.86956 59.822266 143.86914 L 107.99023 143.86914 C 114.61585 143.86514 119.98479 138.49281 119.98438 131.86719 L 119.98438 121.36328 C 119.97838 115.37923 115.56552 110.31374 109.63867 109.48828 L 94.509766 83.279297 C 92.465676 79.739749 88.760655 77.47024 84.677734 77.279297 L 79.03125 77.279297 L 79.03125 52.408203 A 12.0012 12.0012 0 0 0 67.027344 40.40625 L 59.822266 40.40625 z "
       style="color:#000000;font-style:normal;font-variant:normal;font-weight:normal;font-stretch:normal;font-size:medium;line-height:normal;font-family:sans-serif;font-variant-ligatures:normal;font-variant-position:normal;font-variant-caps:normal;font-variant-numeric:normal;font-variant-alternates:normal;font-feature-settings:normal;text-indent:0;text-align:start;text-decoration:none;text-decoration-line:none;text-decoration-style:solid;text-decoration-color:#000000;letter-spacing:normal;word-spacing:normal;text-transform:none;writing-mode:lr-tb;direction:ltr;text-orientation:mixed;dominant-baseline:auto;baseline-shift:baseline;text-anchor:start;white-space:normal;shape-padding:0;clip-rule:nonzero;display:inline;overflow:visible;visibility:visible;opacity:1;isolation:auto;mix-blend-mode:normal;color-interpolation:sRGB;color-interpolation-filters:linearRGB;solid-color:#000000;solid-opacity:1;vector-effect:none;fill:none;fill-opacity:1;fill-rule:nonzero;stroke:#000000;stroke-width:24;stroke-linecap:butt;stroke-linejoin:round;stroke-miterlimit:4;stroke-dasharray:none;stroke-dashoffset:0;stroke-opacity:1;paint-order:markers fill stroke;color-rendering:auto;image-rendering:auto;shape-rendering:auto;text-rendering:auto;enable-background:accumulate" />
    <path
       style="color:#000000;font-style:normal;font-variant:normal;font-weight:normal;font-stretch:normal;font-size:medium;line-height:normal;font-family:sans-serif;font-variant-ligatures:normal;font-variant-position:normal;font-variant-caps:normal;font-variant-numeric:normal;font-variant-alternates:normal;font-feature-settings:normal;text-indent:0;text-align:start;text-decoration:none;text-decoration-line:none;text-decoration-style:solid;text-decoration-color:#000000;letter-spacing:normal;word-spacing:normal;text-transform:none;writing-mode:lr-tb;direction:ltr;text-orientation:mixed;dominant-baseline:auto;baseline-shift:baseline;text-anchor:start;white-space:normal;shape-padding:0;clip-rule:nonzero;display:inline;overflow:visible;visibility:visible;opacity:1;isolation:auto;mix-blend-mode:normal;color-interpolation:sRGB;color-interpolation-filters:linearRGB;solid-color:#000000;solid-opacity:1;vector-effect:none;fill:#000000;fill-opacity:1;fill-rule:nonzero;stroke:none;stroke-width:24;stroke-linecap:butt;stroke-linejoin:round;stroke-miterlimit:4;stroke-dasharray:none;stroke-dashoffset:0;stroke-opacity:1;paint-order:markers fill stroke;color-rendering:auto;image-rendering:auto;shape-rendering:auto;text-rendering:auto;enable-background:accumulate"
       d="M 59.822266 40.40625 A 12.0012 12.0012 0 0 0 47.820312 52.408203 L 47.820312 118.35156 A 12.0012 12.0012 0 0 0 47.925781 119.85938 C 47.863781 120.35339 47.820263 120.85355 47.820312 121.36328 L 47.820312 131.86719 C 47.819899 138.49586 53.193599 143.86956 59.822266 143.86914 L 107.99023 143.86914 C 114.61585 143.86514 119.98479 138.49281 119.98438 131.86719 L 119.98438 121.36328 C 119.97838 115.37923 115.56552 110.31374 109.63867 109.48828 L 94.509766 83.279297 C 92.465676 79.739749 88.760655 77.47024 84.677734 77.279297 L 79.03125 77.279297 L 79.03125 52.408203 A 12.0012 12.0012 0 0 0 67.027344 40.40625 L 59.822266 40.40625 z "
       transform="matrix(0.26458333,0,0,0.26458333,0,246.19999)"
       id="rect4531" />
    <path
       inkscape:connector-curvature="0"
       d="m 26.686111,277.51412 -4.223487,-7.31595 c -0.04316,-0.0744 -0.12203,-0.11906 -0.206857,-0.11906 -0.08482,0 -0.163703,0.0462 -0.206858,0.11906 l -4.223487,7.31595 c -0.04316,0.0745 -0.04316,0.16519 0,0.23811 0.04317,0.0744 0.122032,0.11906 0.206858,0.11906 h 8.446974 c 0.08482,0 0.1637,-0.0462 0.206857,-0.11906 0.04316,-0.0744 0.04316,-0.16519 0,-0.23811 z"
       id="sign_border-2"
       style="fill:#b3b3b3;fill-opacity:1;stroke-width:0.0148819" />
    <path
       id="sign_bg-3"
       d="m 22.255767,270.79643 3.809769,6.59715 h -7.619539 v 0 z"
       style="fill:#000000;fill-opacity:1;stroke-width:0.0148819"
       inkscape:connector-curvature="0" />
    <path
       id="rect2820"
       d="m 20.354128,276.82945 h 3.803279 v 0.23501 h -3.803279 z"
       style="fill:#b3b3b3;fill-opacity:1;stroke:#000000;stroke-width:0.00949161;stroke-linecap:square;stroke-miterlimit:4;stroke-dasharray:none;stroke-dashoffset:0;stroke-opacity:1"
       inkscape:connector-curvature="0" />
    <path
       style="color:#000000;font-style:normal;font-variant:normal;font-weight:normal;font-stretch:normal;font-size:medium;line-height:normal;font-family:sans-serif;text-indent:0;text-align:start;text-decoration:none;text-decoration-line:none;text-decoration-style:solid;text-decoration-color:#000000;letter-spacing:normal;word-spacing:normal;text-transform:none;writing-mode:lr-tb;direction:ltr;baseline-shift:baseline;text-anchor:start;white-space:normal;clip-rule:nonzero;display:inline;overflow:visible;visibility:visible;opacity:1;isolation:auto;mix-blend-mode:normal;color-interpolation:sRGB;color-interpolation-filters:linearRGB;solid-color:#000000;solid-opacity:1;fill:#b3b3b3;fill-opacity:1;fill-rule:nonzero;stroke:none;stroke-width:0.21092471;stroke-linecap:butt;stroke-linejoin:miter;stroke-miterlimit:4;stroke-dasharray:none;stroke-dashoffset:0;stroke-opacity:1;color-rendering:auto;image-rendering:auto;shape-rendering:auto;text-rendering:auto;enable-background:accumulate"
       d="m 21.21598,273.44036 c -0.227797,0.31749 -0.292136,0.61188 -0.26329,0.87808 0.02884,0.2662 0.143243,0.50013 0.25098,0.72368 0.107739,0.22354 0.208872,0.43678 0.234568,0.65697 0.0257,0.22017 -0.01653,0.45089 -0.216221,0.73639 l 0.172847,0.1209 c 0.223424,-0.31943 0.284003,-0.61509 0.252881,-0.88175 -0.03113,-0.26665 -0.146425,-0.50071 -0.254067,-0.72408 -0.107639,-0.22335 -0.207554,-0.4359 -0.231278,-0.65483 -0.02373,-0.21895 0.02112,-0.44833 0.224937,-0.73239 z"
       id="path3713"
       inkscape:connector-curvature="0" />
    <path
       style="color:#000000;font-style:normal;font-variant:normal;font-weight:normal;font-stretch:normal;font-size:medium;line-height:normal;font-family:sans-serif;text-indent:0;text-align:start;text-decoration:none;text-decoration-line:none;text-decoration-style:solid;text-decoration-color:#000000;letter-spacing:normal;word-spacing:normal;text-transform:none;writing-mode:lr-tb;direction:ltr;baseline-shift:baseline;text-anchor:start;white-space:normal;clip-rule:nonzero;display:inline;overflow:visible;visibility:visible;opacity:1;isolation:auto;mix-blend-mode:normal;color-interpolation:sRGB;color-interpolation-filters:linearRGB;solid-color:#000000;solid-opacity:1;fill:#b3b3b3;fill-opacity:1;fill-rule:nonzero;stroke:none;stroke-width:0.21092471;stroke-linecap:butt;stroke-linejoin:miter;stroke-miterlimit:4;stroke-dasharray:none;stroke-dashoffset:0;stroke-opacity:1;color-rendering:auto;image-rendering:auto;shape-rendering:auto;text-rendering:auto;enable-background:accumulate"
       d="m 22.170934,273.44036 c -0.227798,0.31749 -0.292136,0.61188 -0.26329,0.87808 0.02884,0.2662 0.143245,0.50013 0.25098,0.72368 0.10774,0.22354 0.208873,0.43678 0.234568,0.65697 0.0257,0.22017 -0.01653,0.45089 -0.216221,0.73639 l 0.172848,0.1209 c 0.223424,-0.31943 0.284002,-0.61509 0.25288,-0.88175 -0.03112,-0.26665 -0.146424,-0.50071 -0.254067,-0.72408 -0.107639,-0.22335 -0.207553,-0.4359 -0.231278,-0.65483 -0.02373,-0.21895 0.02112,-0.44833 0.224937,-0.73239 z"
       id="path4600"
       inkscape:connector-curvature="0" />
    <path
       style="color:#000000;font-style:normal;font-variant:normal;font-weight:normal;font-stretch:normal;font-size:medium;line-height:normal;font-family:sans-serif;text-indent:0;text-align:start;text-decoration:none;text-decoration-line:none;text-decoration-style:solid;text-decoration-color:#000000;letter-spacing:normal;word-spacing:normal;text-transform:none;writing-mode:lr-tb;direction:ltr;baseline-shift:baseline;text-anchor:start;white-space:normal;clip-rule:nonzero;display:inline;overflow:visible;visibility:visible;opacity:1;isolation:auto;mix-blend-mode:normal;color-interpolation:sRGB;color-interpolation-filters:linearRGB;solid-color:#000000;solid-opacity:1;fill:#b3b3b3;fill-opacity:1;fill-rule:nonzero;stroke:none;stroke-width:0.21092471;stroke-linecap:butt;stroke-linejoin:miter;stroke-miterlimit:4;stroke-dasharray:none;stroke-dashoffset:0;stroke-opacity:1;color-rendering:auto;image-rendering:auto;shape-rendering:auto;text-rendering:auto;enable-background:accumulate"
       d="m 23.12589,273.44036 c -0.227799,0.31749 -0.292137,0.61188 -0.263291,0.87808 0.02884,0.2662 0.143244,0.50013 0.250981,0.72368 0.107737,0.22354 0.208871,0.43678 0.234567,0.65697 0.0257,0.22017 -0.01652,0.45089 -0.216222,0.73639 l 0.17285,0.1209 c 0.223423,-0.31943 0.284,-0.61509 0.252879,-0.88175 -0.03113,-0.26665 -0.146425,-0.50071 -0.254067,-0.72408 -0.10764,-0.22335 -0.207554,-0.4359 -0.231278,-0.65483 -0.02373,-0.21895 0.02112,-0.44833 0.224937,-0.73239 z"
       id="path4602"
       inkscape:connector-curvature="0" />
    <text
       xml:space="preserve"
       style="font-style:normal;font-weight:normal;font-size:4.30931997px;line-height:0%;font-family:sans-serif;letter-spacing:0px;word-spacing:0px;fill:#b3b3b3;fill-opacity:1;stroke:none;stroke-width:0.35911003px;stroke-linecap:butt;stroke-linejoin:miter;stroke-opacity:1"
       x="15.739833"
       y="279.69223"
       id="text4747"><tspan
         sodipodi:role="line"
         x="15.739833"
         y="279.69223"
         style="font-style:normal;font-variant:normal;font-weight:bold;font-stretch:normal;font-size:1.97600663px;line-height:1.28999996;font-family:Titillium;-inkscape-font-specification:'Titillium Bold';fill:#b3b3b3;fill-opacity:1;stroke-width:0.35911003px"
         id="tspan4525">CAUTION: HOT!</tspan></text>
    <text
       id="text4549"
       y="281.0853"
       x="15.808125"
       style="font-style:normal;font-weight:normal;font-size:3.15283823px;line-height:0%;font-family:sans-serif;letter-spacing:0px;word-spacing:0px;fill:#b3b3b3;fill-opacity:1;stroke:none;stroke-width:0.26273653px;stroke-linecap:butt;stroke-linejoin:miter;stroke-opacity:1"
       xml:space="preserve"><tspan
         id="tspan4547"
         style="font-style:normal;font-variant:normal;font-weight:bold;font-stretch:normal;font-size:1.44571066px;line-height:1.28999996;font-family:Titillium;-inkscape-font-specification:'Titillium Bold';fill:#b3b3b3;fill-opacity:1;stroke-width:0.26273653px"
         y="281.0853"
         x="15.808125"
         sodipodi:role="line">ATTENTION: CHAUD!</tspan></text>
    <g
       id="g4575"
       transform="translate(-3.1750001)">
      <path
         sodipodi:nodetypes="cc"
         inkscape:connector-curvature="0"
         id="path4591"
         d="M 11.644758,284.2969 H 8.6447577"
         style="opacity:1;vector-effect:none;fill:none;fill-opacity:1;stroke:#000000;stroke-width:0.5;stroke-linecap:butt;stroke-linejoin:miter;stroke-miterlimit:4;stroke-dasharray:none;stroke-dashoffset:0;stroke-opacity:1" />
      <path
         style="opacity:1;vector-effect:none;fill:none;fill-opacity:1;stroke:#000000;stroke-width:0.5;stroke-linecap:butt;stroke-linejoin:miter;stroke-miterlimit:4;stroke-dasharray:none;stroke-dashoffset:0;stroke-opacity:1"
         d="M 11.644758,256.89468 H 8.6447577"
         id="path4593"
         inkscape:connector-curvature="0"
         sodipodi:nodetypes="cc" />
    </g>
    <g
       id="g4715"
       transform="translate(2.0000001e-6,-10.278253)">
      <path
         style="opacity:1;vector-effect:none;fill:none;fill-opacity:1;stroke:#000000;stroke-width:0.5;stroke-linecap:butt;stroke-linejoin:miter;stroke-miterlimit:4;stroke-dasharray:none;stroke-dashoffset:0;stroke-opacity:1"
         d="m 12.703089,262.9396 2e-6,-3"
         id="path4597"
         inkscape:connector-curvature="0"
         sodipodi:nodetypes="cc" />
      <path
         sodipodi:nodetypes="cc"
         inkscape:connector-curvature="0"
         id="path4599"
         d="m 31.737434,262.9396 2e-6,-3"
         style="opacity:1;vector-effect:none;fill:none;fill-opacity:1;stroke:#000000;stroke-width:0.5;stroke-linecap:butt;stroke-linejoin:miter;stroke-miterlimit:4;stroke-dasharray:none;stroke-dashoffset:0;stroke-opacity:1" />
    </g>
    <g
       id="g4863"
       transform="translate(0,3.1749925)">
      <text
         id="text4518"
         y="287.58817"
         x="19.808201"
         style="font-style:normal;font-variant:normal;font-weight:normal;font-stretch:normal;font-size:2.14936781px;line-height:1;font-family:sans-serif;font-variant-ligatures:normal;font-variant-position:normal;font-variant-caps:normal;font-variant-numeric:normal;font-variant-alternates:normal;font-feature-settings:normal;text-indent:0;text-align:start;text-decoration:none;text-decoration-line:none;text-decoration-style:solid;text-decoration-color:#000000;letter-spacing:0px;word-spacing:0px;text-transform:none;writing-mode:lr-tb;direction:ltr;text-orientation:mixed;dominant-baseline:auto;baseline-shift:baseline;text-anchor:start;white-space:normal;shape-padding:0;opacity:1;vector-effect:none;fill:#000000;fill-opacity:1;stroke:none;stroke-width:0.05373419;stroke-linecap:butt;stroke-linejoin:miter;stroke-miterlimit:4;stroke-dasharray:none;stroke-dashoffset:0;stroke-opacity:1"
         xml:space="preserve"><tspan
           id="tspan1197"
           style="font-style:normal;font-variant:normal;font-weight:normal;font-stretch:normal;font-family:Titillium;-inkscape-font-specification:Titillium;stroke-width:0.05373419"
           y="287.58817"
           x="19.808201"
           sodipodi:role="line">0.75&quot;</tspan></text>
      <g
         id="g4757">
        <path
           style="opacity:1;vector-effect:none;fill:none;fill-opacity:1;stroke:#000000;stroke-width:0.5;stroke-linecap:butt;stroke-linejoin:miter;stroke-miterlimit:4;stroke-dasharray:none;stroke-dashoffset:0;stroke-opacity:1"
           d="m 12.703089,288.35524 2e-6,-3"
           id="path874"
           inkscape:connector-curvature="0"
           sodipodi:nodetypes="cc" />
        <path
           sodipodi:nodetypes="cc"
           inkscape:connector-curvature="0"
           id="path876"
           d="m 31.737432,288.35524 2e-6,-3"
           style="opacity:1;vector-effect:none;fill:none;fill-opacity:1;stroke:#000000;stroke-width:0.5;stroke-linecap:butt;stroke-linejoin:miter;stroke-miterlimit:4;stroke-dasharray:none;stroke-dashoffset:0;stroke-opacity:1" />
      </g>
      <path
         sodipodi:nodetypes="cc"
         inkscape:connector-curvature="0"
         id="path4603"
         d="m 12.703091,286.85524 h 6.006572"
         style="opacity:1;vector-effect:none;fill:none;fill-opacity:1;stroke:#000000;stroke-width:0.4064;stroke-linecap:butt;stroke-linejoin:miter;stroke-miterlimit:4;stroke-dasharray:none;stroke-dashoffset:0;stroke-opacity:1" />
      <path
         style="opacity:1;vector-effect:none;fill:none;fill-opacity:1;stroke:#000000;stroke-width:0.4064;stroke-linecap:butt;stroke-linejoin:miter;stroke-miterlimit:4;stroke-dasharray:none;stroke-dashoffset:0;stroke-opacity:1"
         d="m 25.730862,286.85524 h 6.006572"
         id="path4759"
         inkscape:connector-curvature="0"
         sodipodi:nodetypes="cc" />
    </g>
    <text
       xml:space="preserve"
       style="font-style:normal;font-variant:normal;font-weight:normal;font-stretch:normal;font-size:3.12616372px;line-height:1;font-family:sans-serif;font-variant-ligatures:normal;font-variant-position:normal;font-variant-caps:normal;font-variant-numeric:normal;font-variant-alternates:normal;font-feature-settings:normal;text-indent:0;text-align:start;text-decoration:none;text-decoration-line:none;text-decoration-style:solid;text-decoration-color:#000000;letter-spacing:0px;word-spacing:0px;text-transform:none;writing-mode:lr-tb;direction:ltr;text-orientation:mixed;dominant-baseline:auto;baseline-shift:baseline;text-anchor:start;white-space:normal;shape-padding:0;display:inline;opacity:1;vector-effect:none;fill:#b3b3b3;fill-opacity:1;stroke:none;stroke-width:0.07815411;stroke-linecap:butt;stroke-linejoin:miter;stroke-miterlimit:4;stroke-dasharray:none;stroke-dashoffset:0;stroke-opacity:1"
       x="260.00455"
       y="-15.864108"
       id="text4517"
       transform="rotate(90)"><tspan
         sodipodi:role="line"
         id="tspan4515"
         x="260.00455"
         y="-15.864108"
         style="font-style:normal;font-variant:normal;font-weight:600;font-stretch:normal;font-size:2.82222223px;font-family:Titillium;-inkscape-font-specification:'Titillium Semi-Bold';fill:#b3b3b3;fill-opacity:1;stroke-width:0.07815411">0.50mm</tspan></text>
    <g
       id="g4573">
      <g
         id="g4569">
        <text
           id="text947"
           y="-36.727085"
           x="268.78613"
           style="font-style:normal;font-variant:normal;font-weight:normal;font-stretch:normal;font-size:2.14936781px;line-height:1;font-family:sans-serif;font-variant-ligatures:normal;font-variant-position:normal;font-variant-caps:normal;font-variant-numeric:normal;font-variant-alternates:normal;font-feature-settings:normal;text-indent:0;text-align:start;text-decoration:none;text-decoration-line:none;text-decoration-style:solid;text-decoration-color:#000000;letter-spacing:0px;word-spacing:0px;text-transform:none;writing-mode:lr-tb;direction:ltr;text-orientation:mixed;dominant-baseline:auto;baseline-shift:baseline;text-anchor:start;white-space:normal;shape-padding:0;opacity:1;vector-effect:none;fill:#000000;fill-opacity:1;stroke:none;stroke-width:0.05373419;stroke-linecap:butt;stroke-linejoin:miter;stroke-miterlimit:4;stroke-dasharray:none;stroke-dashoffset:0;stroke-opacity:1"
           xml:space="preserve"
           transform="rotate(90)"><tspan
             style="font-style:normal;font-variant:normal;font-weight:normal;font-stretch:normal;font-family:Titillium;-inkscape-font-specification:Titillium;stroke-width:0.05373419"
             y="-36.727085"
             x="268.78613"
             id="tspan945"
             sodipodi:role="line">1.1&quot;</tspan></text>
        <g
           id="g4544">
          <path
             style="opacity:1;vector-effect:none;fill:none;fill-opacity:1;stroke:#000000;stroke-width:0.5;stroke-linecap:butt;stroke-linejoin:miter;stroke-miterlimit:4;stroke-dasharray:none;stroke-dashoffset:0;stroke-opacity:1"
             d="m 38.970767,284.2969 h -3"
             id="path935"
             inkscape:connector-curvature="0"
             sodipodi:nodetypes="cc" />
          <path
             sodipodi:nodetypes="cc"
             inkscape:connector-curvature="0"
             id="path937"
             d="m 38.970767,256.89468 h -3"
             style="opacity:1;vector-effect:none;fill:none;fill-opacity:1;stroke:#000000;stroke-width:0.5;stroke-linecap:butt;stroke-linejoin:miter;stroke-miterlimit:4;stroke-dasharray:none;stroke-dashoffset:0;stroke-opacity:1" />
        </g>
        <path
           inkscape:connector-curvature="0"
           id="path4586"
           d="M 37.470767,272.88744 V 284.2969"
           style="opacity:1;vector-effect:none;fill:none;fill-opacity:1;stroke:#000000;stroke-width:0.4064;stroke-linecap:butt;stroke-linejoin:miter;stroke-miterlimit:4;stroke-dasharray:none;stroke-dashoffset:0;stroke-opacity:1"
           sodipodi:nodetypes="cc" />
        <path
           sodipodi:nodetypes="cc"
           style="opacity:1;vector-effect:none;fill:none;fill-opacity:1;stroke:#000000;stroke-width:0.4064;stroke-linecap:butt;stroke-linejoin:miter;stroke-miterlimit:4;stroke-dasharray:none;stroke-dashoffset:0;stroke-opacity:1"
           d="m 37.470767,256.89468 v 11.40946"
           id="path4546"
           inkscape:connector-curvature="0" />
      </g>
    </g>
    <path
       style="color:#000000;font-style:normal;font-variant:normal;font-weight:normal;font-stretch:normal;font-size:medium;line-height:normal;font-family:sans-serif;font-variant-ligatures:normal;font-variant-position:normal;font-variant-caps:normal;font-variant-numeric:normal;font-variant-alternates:normal;font-feature-settings:normal;text-indent:0;text-align:start;text-decoration:none;text-decoration-line:none;text-decoration-style:solid;text-decoration-color:#000000;letter-spacing:normal;word-spacing:normal;text-transform:none;writing-mode:lr-tb;direction:ltr;text-orientation:mixed;dominant-baseline:auto;baseline-shift:baseline;text-anchor:start;white-space:normal;shape-padding:0;clip-rule:nonzero;display:inline;overflow:visible;visibility:visible;opacity:1;isolation:auto;mix-blend-mode:normal;color-interpolation:sRGB;color-interpolation-filters:linearRGB;solid-color:#000000;solid-opacity:1;vector-effect:none;fill:none;fill-opacity:1;fill-rule:nonzero;stroke:#ff00ff;stroke-width:0.66666667;stroke-linecap:butt;stroke-linejoin:round;stroke-miterlimit:4;stroke-dasharray:none;stroke-dashoffset:0;stroke-opacity:1;paint-order:markers fill stroke;color-rendering:auto;image-rendering:auto;shape-rendering:auto;text-rendering:auto;enable-background:accumulate"
       d="M 59.822266 40.40625 A 12.0012 12.0012 0 0 0 47.820312 52.408203 L 47.820312 118.35156 A 12.0012 12.0012 0 0 0 47.925781 119.85938 C 47.863781 120.35339 47.820263 120.85355 47.820312 121.36328 L 47.820312 131.86719 C 47.819899 138.49586 53.193599 143.86956 59.822266 143.86914 L 107.99023 143.86914 C 114.61585 143.86514 119.98479 138.49281 119.98438 131.86719 L 119.98438 121.36328 C 119.97838 115.37923 115.56552 110.31374 109.63867 109.48828 L 94.509766 83.279297 C 92.465676 79.739749 88.760655 77.47024 84.677734 77.279297 L 79.03125 77.279297 L 79.03125 52.408203 A 12.0012 12.0012 0 0 0 67.027344 40.40625 L 59.822266 40.40625 z "
       transform="matrix(0.26458333,0,0,0.26458333,0,246.19999)"
       id="path4617" />
  </g>
</svg>
