ISO-10303-21;
HEADER;
FILE_DESCRIPTION(('STEP AP214'),'1');
FILE_NAME('0_64m_06_20_028_0___060_20_12_A1_2.stp','2018-02-06T19:37:07',('igus GmbH'),(''),'Spatial InterOp 3D',' ',' ');
FILE_SCHEMA(('AUTOMOTIVE_DESIGN'));
ENDSEC;
DATA;
#1=MECHANICAL_DESIGN_GEOMETRIC_PRESENTATION_REPRESENTATION(' ',(#10,#11,#12,#13,#14,#15,#16,#17,#18,#19,#20,#21,#22,#23,#24,#25,#26,#27,#28,#29,#30,#31,#32,#33,#34,#35,#36,#37,#38,#39,#40,#41,#42,#43,#44,#45,#46,#47,#48,#49,#50,#51,#52,#53,#54),#6);
#2=PRODUCT_DEFINITION_CONTEXT('',#55,'design');
#3=APPLICATION_PROTOCOL_DEFINITION('INTERNATIONAL STANDARD','automotive_design',1994,#55);
#4=PRODUCT_CATEGORY_RELATIONSHIP('NONE','NONE',#56,#57);
#5=SHAPE_DEFINITION_REPRESENTATION(#58,#59);
#6= (GEOMETRIC_REPRESENTATION_CONTEXT(3)GLOBAL_UNCERTAINTY_ASSIGNED_CONTEXT((#62))GLOBAL_UNIT_ASSIGNED_CONTEXT((#64,#65,#66))REPRESENTATION_CONTEXT('NONE','WORKSPACE'));
#10=STYLED_ITEM('',(#68),#69);
#11=STYLED_ITEM('',(#70),#71);
#12=STYLED_ITEM('',(#72),#73);
#13=STYLED_ITEM('',(#74),#75);
#14=STYLED_ITEM('',(#76),#77);
#15=STYLED_ITEM('',(#78),#79);
#16=STYLED_ITEM('',(#80),#81);
#17=STYLED_ITEM('',(#82),#83);
#18=STYLED_ITEM('',(#84),#85);
#19=STYLED_ITEM('',(#86),#87);
#20=STYLED_ITEM('',(#88),#89);
#21=STYLED_ITEM('',(#90),#91);
#22=STYLED_ITEM('',(#92),#93);
#23=STYLED_ITEM('',(#94),#95);
#24=STYLED_ITEM('',(#96),#97);
#25=STYLED_ITEM('',(#98),#99);
#26=STYLED_ITEM('',(#100),#101);
#27=STYLED_ITEM('',(#102),#103);
#28=STYLED_ITEM('',(#104),#105);
#29=STYLED_ITEM('',(#106),#107);
#30=STYLED_ITEM('',(#108),#109);
#31=STYLED_ITEM('',(#110),#111);
#32=STYLED_ITEM('',(#112),#113);
#33=STYLED_ITEM('',(#114),#115);
#34=STYLED_ITEM('',(#116),#117);
#35=STYLED_ITEM('',(#118),#119);
#36=STYLED_ITEM('',(#120),#121);
#37=STYLED_ITEM('',(#122),#123);
#38=STYLED_ITEM('',(#124),#125);
#39=STYLED_ITEM('',(#126),#127);
#40=STYLED_ITEM('',(#128),#129);
#41=STYLED_ITEM('',(#130),#131);
#42=STYLED_ITEM('',(#132),#133);
#43=STYLED_ITEM('',(#134),#135);
#44=STYLED_ITEM('',(#136),#137);
#45=STYLED_ITEM('',(#138),#139);
#46=STYLED_ITEM('',(#140),#141);
#47=STYLED_ITEM('',(#142),#143);
#48=STYLED_ITEM('',(#144),#145);
#49=STYLED_ITEM('',(#146),#147);
#50=STYLED_ITEM('',(#148),#149);
#51=STYLED_ITEM('',(#150),#151);
#52=STYLED_ITEM('',(#152),#153);
#53=STYLED_ITEM('',(#154),#155);
#54=STYLED_ITEM('',(#156),#157);
#55=APPLICATION_CONTEXT(' ');
#56=PRODUCT_CATEGORY('part','NONE');
#57=PRODUCT_RELATED_PRODUCT_CATEGORY('detail',' ',(#158));
#58=PRODUCT_DEFINITION_SHAPE('NONE','NONE',#159);
#59=ADVANCED_BREP_SHAPE_REPRESENTATION('2018_02_06__20-37-07-711',(#157,#160),#6);
#62=UNCERTAINTY_MEASURE_WITH_UNIT(LENGTH_MEASURE(1.0E-006),#64,'','');
#64= (CONVERSION_BASED_UNIT('MILLIMETRE',#163)LENGTH_UNIT()NAMED_UNIT(#166));
#65= (NAMED_UNIT(#168)PLANE_ANGLE_UNIT()SI_UNIT($,.RADIAN.));
#66= (NAMED_UNIT(#168)SOLID_ANGLE_UNIT()SI_UNIT($,.STERADIAN.));
#68=PRESENTATION_STYLE_ASSIGNMENT((#174));
#69=ADVANCED_FACE('',(#175),#176,.T.);
#70=PRESENTATION_STYLE_ASSIGNMENT((#177));
#71=ADVANCED_FACE('',(#178),#179,.T.);
#72=PRESENTATION_STYLE_ASSIGNMENT((#180));
#73=ADVANCED_FACE('',(#181),#182,.F.);
#74=PRESENTATION_STYLE_ASSIGNMENT((#183));
#75=ADVANCED_FACE('',(#184),#185,.F.);
#76=PRESENTATION_STYLE_ASSIGNMENT((#186));
#77=ADVANCED_FACE('',(#187),#188,.F.);
#78=PRESENTATION_STYLE_ASSIGNMENT((#189));
#79=ADVANCED_FACE('',(#190),#191,.F.);
#80=PRESENTATION_STYLE_ASSIGNMENT((#192));
#81=ADVANCED_FACE('',(#193),#194,.F.);
#82=PRESENTATION_STYLE_ASSIGNMENT((#195));
#83=ADVANCED_FACE('',(#196),#197,.F.);
#84=PRESENTATION_STYLE_ASSIGNMENT((#198));
#85=ADVANCED_FACE('',(#199),#200,.F.);
#86=PRESENTATION_STYLE_ASSIGNMENT((#201));
#87=ADVANCED_FACE('',(#202),#203,.T.);
#88=PRESENTATION_STYLE_ASSIGNMENT((#204));
#89=ADVANCED_FACE('',(#205,#206),#207,.F.);
#90=PRESENTATION_STYLE_ASSIGNMENT((#208));
#91=ADVANCED_FACE('',(#209),#210,.F.);
#92=PRESENTATION_STYLE_ASSIGNMENT((#211));
#93=ADVANCED_FACE('',(#212),#213,.F.);
#94=PRESENTATION_STYLE_ASSIGNMENT((#214));
#95=ADVANCED_FACE('',(#215),#216,.F.);
#96=PRESENTATION_STYLE_ASSIGNMENT((#217));
#97=ADVANCED_FACE('',(#218),#219,.F.);
#98=PRESENTATION_STYLE_ASSIGNMENT((#220));
#99=ADVANCED_FACE('',(#221),#222,.F.);
#100=PRESENTATION_STYLE_ASSIGNMENT((#223));
#101=ADVANCED_FACE('',(#224),#225,.T.);
#102=PRESENTATION_STYLE_ASSIGNMENT((#226));
#103=ADVANCED_FACE('',(#227),#228,.F.);
#104=PRESENTATION_STYLE_ASSIGNMENT((#229));
#105=ADVANCED_FACE('',(#230),#231,.T.);
#106=PRESENTATION_STYLE_ASSIGNMENT((#232));
#107=ADVANCED_FACE('',(#233),#234,.T.);
#108=PRESENTATION_STYLE_ASSIGNMENT((#235));
#109=ADVANCED_FACE('',(#236),#237,.T.);
#110=PRESENTATION_STYLE_ASSIGNMENT((#238));
#111=ADVANCED_FACE('',(#239),#240,.T.);
#112=PRESENTATION_STYLE_ASSIGNMENT((#241));
#113=ADVANCED_FACE('',(#242),#243,.T.);
#114=PRESENTATION_STYLE_ASSIGNMENT((#244));
#115=ADVANCED_FACE('',(#245,#246),#247,.T.);
#116=PRESENTATION_STYLE_ASSIGNMENT((#248));
#117=ADVANCED_FACE('',(#249),#250,.T.);
#118=PRESENTATION_STYLE_ASSIGNMENT((#251));
#119=ADVANCED_FACE('',(#252),#253,.T.);
#120=PRESENTATION_STYLE_ASSIGNMENT((#254));
#121=ADVANCED_FACE('',(#255,#256),#257,.T.);
#122=PRESENTATION_STYLE_ASSIGNMENT((#258));
#123=ADVANCED_FACE('',(#259),#260,.T.);
#124=PRESENTATION_STYLE_ASSIGNMENT((#261));
#125=ADVANCED_FACE('',(#262,#263),#264,.T.);
#126=PRESENTATION_STYLE_ASSIGNMENT((#265));
#127=ADVANCED_FACE('',(#266),#267,.T.);
#128=PRESENTATION_STYLE_ASSIGNMENT((#268));
#129=ADVANCED_FACE('',(#269),#270,.T.);
#130=PRESENTATION_STYLE_ASSIGNMENT((#271));
#131=ADVANCED_FACE('',(#272),#273,.T.);
#132=PRESENTATION_STYLE_ASSIGNMENT((#274));
#133=ADVANCED_FACE('',(#275,#276),#277,.T.);
#134=PRESENTATION_STYLE_ASSIGNMENT((#278));
#135=ADVANCED_FACE('',(#279),#280,.T.);
#136=PRESENTATION_STYLE_ASSIGNMENT((#281));
#137=ADVANCED_FACE('',(#282),#283,.T.);
#138=PRESENTATION_STYLE_ASSIGNMENT((#284));
#139=ADVANCED_FACE('',(#285),#286,.T.);
#140=PRESENTATION_STYLE_ASSIGNMENT((#287));
#141=ADVANCED_FACE('',(#288),#289,.T.);
#142=PRESENTATION_STYLE_ASSIGNMENT((#290));
#143=ADVANCED_FACE('',(#291),#292,.T.);
#144=PRESENTATION_STYLE_ASSIGNMENT((#293));
#145=ADVANCED_FACE('',(#294),#295,.T.);
#146=PRESENTATION_STYLE_ASSIGNMENT((#296));
#147=ADVANCED_FACE('',(#297),#298,.T.);
#148=PRESENTATION_STYLE_ASSIGNMENT((#299));
#149=ADVANCED_FACE('',(#300),#301,.T.);
#150=PRESENTATION_STYLE_ASSIGNMENT((#302));
#151=ADVANCED_FACE('',(#303),#304,.T.);
#152=PRESENTATION_STYLE_ASSIGNMENT((#305));
#153=ADVANCED_FACE('',(#306),#307,.T.);
#154=PRESENTATION_STYLE_ASSIGNMENT((#308));
#155=ADVANCED_FACE('',(#309,#310),#311,.F.);
#156=PRESENTATION_STYLE_ASSIGNMENT((#312));
#157=MANIFOLD_SOLID_BREP('2018_02_06__20-37-07-711',#313);
#158=PRODUCT('2018_02_06__20-37-07-711','2018_02_06__20-37-07-711','PART-2018_02_06__20-37-07-711-DESC',(#314));
#159=PRODUCT_DEFINITION('NONE','NONE',#315,#2);
#160=AXIS2_PLACEMENT_3D('',#316,#317,#318);
#163=LENGTH_MEASURE_WITH_UNIT(LENGTH_MEASURE(1.0),#319);
#166=DIMENSIONAL_EXPONENTS(1.0,0.0,0.0,0.0,0.0,0.0,0.0);
#168=DIMENSIONAL_EXPONENTS(0.0,0.0,0.0,0.0,0.0,0.0,0.0);
#174=SURFACE_STYLE_USAGE(.BOTH.,#320);
#175=FACE_OUTER_BOUND('',#321,.T.);
#176=CYLINDRICAL_SURFACE('',#322,3.0);
#177=SURFACE_STYLE_USAGE(.BOTH.,#323);
#178=FACE_OUTER_BOUND('',#324,.T.);
#179=CYLINDRICAL_SURFACE('',#325,3.0);
#180=SURFACE_STYLE_USAGE(.BOTH.,#326);
#181=FACE_OUTER_BOUND('',#327,.T.);
#182=CYLINDRICAL_SURFACE('',#328,3.05);
#183=SURFACE_STYLE_USAGE(.BOTH.,#329);
#184=FACE_OUTER_BOUND('',#330,.T.);
#185=CYLINDRICAL_SURFACE('',#331,3.05);
#186=SURFACE_STYLE_USAGE(.BOTH.,#332);
#187=FACE_OUTER_BOUND('',#333,.T.);
#188=CYLINDRICAL_SURFACE('',#334,7.7);
#189=SURFACE_STYLE_USAGE(.BOTH.,#335);
#190=FACE_OUTER_BOUND('',#336,.T.);
#191=CYLINDRICAL_SURFACE('',#337,7.7);
#192=SURFACE_STYLE_USAGE(.BOTH.,#338);
#193=FACE_OUTER_BOUND('',#339,.T.);
#194=CYLINDRICAL_SURFACE('',#340,7.7);
#195=SURFACE_STYLE_USAGE(.BOTH.,#341);
#196=FACE_OUTER_BOUND('',#342,.T.);
#197=PLANE('',#343);
#198=SURFACE_STYLE_USAGE(.BOTH.,#344);
#199=FACE_OUTER_BOUND('',#345,.T.);
#200=PLANE('',#346);
#201=SURFACE_STYLE_USAGE(.BOTH.,#347);
#202=FACE_OUTER_BOUND('',#348,.T.);
#203=PLANE('',#349);
#204=SURFACE_STYLE_USAGE(.BOTH.,#350);
#205=FACE_OUTER_BOUND('',#351,.T.);
#206=FACE_BOUND('',#352,.T.);
#207=PLANE('',#353);
#208=SURFACE_STYLE_USAGE(.BOTH.,#354);
#209=FACE_OUTER_BOUND('',#355,.T.);
#210=PLANE('',#356);
#211=SURFACE_STYLE_USAGE(.BOTH.,#357);
#212=FACE_OUTER_BOUND('',#358,.T.);
#213=PLANE('',#359);
#214=SURFACE_STYLE_USAGE(.BOTH.,#360);
#215=FACE_OUTER_BOUND('',#361,.T.);
#216=CYLINDRICAL_SURFACE('',#362,7.7);
#217=SURFACE_STYLE_USAGE(.BOTH.,#363);
#218=FACE_OUTER_BOUND('',#364,.T.);
#219=PLANE('',#365);
#220=SURFACE_STYLE_USAGE(.BOTH.,#366);
#221=FACE_OUTER_BOUND('',#367,.T.);
#222=CYLINDRICAL_SURFACE('',#368,3.05);
#223=SURFACE_STYLE_USAGE(.BOTH.,#369);
#224=FACE_OUTER_BOUND('',#370,.T.);
#225=PLANE('',#371);
#226=SURFACE_STYLE_USAGE(.BOTH.,#372);
#227=FACE_OUTER_BOUND('',#373,.T.);
#228=CYLINDRICAL_SURFACE('',#374,3.05);
#229=SURFACE_STYLE_USAGE(.BOTH.,#375);
#230=FACE_OUTER_BOUND('',#376,.T.);
#231=PLANE('',#377);
#232=SURFACE_STYLE_USAGE(.BOTH.,#378);
#233=FACE_OUTER_BOUND('',#379,.T.);
#234=CYLINDRICAL_SURFACE('',#380,3.0);
#235=SURFACE_STYLE_USAGE(.BOTH.,#381);
#236=FACE_OUTER_BOUND('',#382,.T.);
#237=PLANE('',#383);
#238=SURFACE_STYLE_USAGE(.BOTH.,#384);
#239=FACE_OUTER_BOUND('',#385,.T.);
#240=CYLINDRICAL_SURFACE('',#386,3.0);
#241=SURFACE_STYLE_USAGE(.BOTH.,#387);
#242=FACE_OUTER_BOUND('',#388,.T.);
#243=PLANE('',#389);
#244=SURFACE_STYLE_USAGE(.BOTH.,#390);
#245=FACE_BOUND('',#391,.T.);
#246=FACE_OUTER_BOUND('',#392,.T.);
#247=PLANE('',#393);
#248=SURFACE_STYLE_USAGE(.BOTH.,#394);
#249=FACE_OUTER_BOUND('',#395,.T.);
#250=PLANE('',#396);
#251=SURFACE_STYLE_USAGE(.BOTH.,#397);
#252=FACE_OUTER_BOUND('',#398,.T.);
#253=PLANE('',#399);
#254=SURFACE_STYLE_USAGE(.BOTH.,#400);
#255=FACE_BOUND('',#401,.T.);
#256=FACE_OUTER_BOUND('',#402,.T.);
#257=PLANE('',#403);
#258=SURFACE_STYLE_USAGE(.BOTH.,#404);
#259=FACE_OUTER_BOUND('',#405,.T.);
#260=PLANE('',#406);
#261=SURFACE_STYLE_USAGE(.BOTH.,#407);
#262=FACE_BOUND('',#408,.T.);
#263=FACE_OUTER_BOUND('',#409,.T.);
#264=PLANE('',#410);
#265=SURFACE_STYLE_USAGE(.BOTH.,#411);
#266=FACE_OUTER_BOUND('',#412,.T.);
#267=PLANE('',#413);
#268=SURFACE_STYLE_USAGE(.BOTH.,#414);
#269=FACE_OUTER_BOUND('',#415,.T.);
#270=CYLINDRICAL_SURFACE('',#416,7.5);
#271=SURFACE_STYLE_USAGE(.BOTH.,#417);
#272=FACE_OUTER_BOUND('',#418,.T.);
#273=CYLINDRICAL_SURFACE('',#419,7.5);
#274=SURFACE_STYLE_USAGE(.BOTH.,#420);
#275=FACE_BOUND('',#421,.T.);
#276=FACE_OUTER_BOUND('',#422,.T.);
#277=PLANE('',#423);
#278=SURFACE_STYLE_USAGE(.BOTH.,#424);
#279=FACE_OUTER_BOUND('',#425,.T.);
#280=CYLINDRICAL_SURFACE('',#426,7.5);
#281=SURFACE_STYLE_USAGE(.BOTH.,#427);
#282=FACE_OUTER_BOUND('',#428,.T.);
#283=CYLINDRICAL_SURFACE('',#429,7.5);
#284=SURFACE_STYLE_USAGE(.BOTH.,#430);
#285=FACE_OUTER_BOUND('',#431,.T.);
#286=CYLINDRICAL_SURFACE('',#432,7.50000000000001);
#287=SURFACE_STYLE_USAGE(.BOTH.,#433);
#288=FACE_OUTER_BOUND('',#434,.T.);
#289=CYLINDRICAL_SURFACE('',#435,7.50000000000001);
#290=SURFACE_STYLE_USAGE(.BOTH.,#436);
#291=FACE_OUTER_BOUND('',#437,.T.);
#292=PLANE('',#438);
#293=SURFACE_STYLE_USAGE(.BOTH.,#439);
#294=FACE_OUTER_BOUND('',#440,.T.);
#295=PLANE('',#441);
#296=SURFACE_STYLE_USAGE(.BOTH.,#442);
#297=FACE_OUTER_BOUND('',#443,.T.);
#298=PLANE('',#444);
#299=SURFACE_STYLE_USAGE(.BOTH.,#445);
#300=FACE_OUTER_BOUND('',#446,.T.);
#301=PLANE('',#447);
#302=SURFACE_STYLE_USAGE(.BOTH.,#448);
#303=FACE_OUTER_BOUND('',#449,.T.);
#304=CYLINDRICAL_SURFACE('',#450,7.5);
#305=SURFACE_STYLE_USAGE(.BOTH.,#451);
#306=FACE_OUTER_BOUND('',#452,.T.);
#307=CYLINDRICAL_SURFACE('',#453,7.5);
#308=SURFACE_STYLE_USAGE(.BOTH.,#454);
#309=FACE_BOUND('',#455,.T.);
#310=FACE_OUTER_BOUND('',#456,.T.);
#311=PLANE('',#457);
#312=SURFACE_STYLE_USAGE(.BOTH.,#458);
#313=CLOSED_SHELL('',(#69,#71,#73,#75,#77,#79,#81,#83,#85,#87,#89,#91,#93,#95,#97,#99,#101,#103,#105,#107,#109,#111,#113,#115,#117,#119,#121,#123,#125,#127,#129,#131,#133,#135,#137,#139,#141,#143,#145,#147,#149,#151,#153,#155));
#314=PRODUCT_CONTEXT('',#55,'mechanical');
#315=PRODUCT_DEFINITION_FORMATION_WITH_SPECIFIED_SOURCE(' ','NONE',#158,.NOT_KNOWN.);
#316=CARTESIAN_POINT('',(0.0,0.0,0.0));
#317=DIRECTION('',(0.0,0.0,1.0));
#318=DIRECTION('',(1.0,0.0,0.0));
#319= (NAMED_UNIT(#166)LENGTH_UNIT()SI_UNIT(.MILLI.,.METRE.));
#320=SURFACE_SIDE_STYLE('',(#460));
#321=EDGE_LOOP('',(#461,#462,#463,#464));
#322=AXIS2_PLACEMENT_3D('',#465,#466,#467);
#323=SURFACE_SIDE_STYLE('',(#468));
#324=EDGE_LOOP('',(#469,#470,#471,#472));
#325=AXIS2_PLACEMENT_3D('',#473,#474,#475);
#326=SURFACE_SIDE_STYLE('',(#476));
#327=EDGE_LOOP('',(#477,#478,#479,#480));
#328=AXIS2_PLACEMENT_3D('',#481,#482,#483);
#329=SURFACE_SIDE_STYLE('',(#484));
#330=EDGE_LOOP('',(#485,#486,#487,#488));
#331=AXIS2_PLACEMENT_3D('',#489,#490,#491);
#332=SURFACE_SIDE_STYLE('',(#492));
#333=EDGE_LOOP('',(#493,#494,#495,#496,#497));
#334=AXIS2_PLACEMENT_3D('',#498,#499,#500);
#335=SURFACE_SIDE_STYLE('',(#501));
#336=EDGE_LOOP('',(#502,#503,#504,#505,#506));
#337=AXIS2_PLACEMENT_3D('',#507,#508,#509);
#338=SURFACE_SIDE_STYLE('',(#510));
#339=EDGE_LOOP('',(#511,#512,#513,#514,#515));
#340=AXIS2_PLACEMENT_3D('',#516,#517,#518);
#341=SURFACE_SIDE_STYLE('',(#519));
#342=EDGE_LOOP('',(#520,#521,#522));
#343=AXIS2_PLACEMENT_3D('',#523,#524,#525);
#344=SURFACE_SIDE_STYLE('',(#526));
#345=EDGE_LOOP('',(#527,#528,#529));
#346=AXIS2_PLACEMENT_3D('',#530,#531,#532);
#347=SURFACE_SIDE_STYLE('',(#533));
#348=EDGE_LOOP('',(#534,#535,#536,#537,#538,#539,#540,#541));
#349=AXIS2_PLACEMENT_3D('',#542,#543,#544);
#350=SURFACE_SIDE_STYLE('',(#545));
#351=EDGE_LOOP('',(#546,#547,#548,#549,#550,#551,#552,#553));
#352=EDGE_LOOP('',(#554,#555,#556));
#353=AXIS2_PLACEMENT_3D('',#557,#558,#559);
#354=SURFACE_SIDE_STYLE('',(#560));
#355=EDGE_LOOP('',(#561,#562,#563,#564,#565,#566,#567,#568,#569,#570));
#356=AXIS2_PLACEMENT_3D('',#571,#572,#573);
#357=SURFACE_SIDE_STYLE('',(#574));
#358=EDGE_LOOP('',(#575,#576,#577));
#359=AXIS2_PLACEMENT_3D('',#578,#579,#580);
#360=SURFACE_SIDE_STYLE('',(#581));
#361=EDGE_LOOP('',(#582,#583,#584,#585,#586));
#362=AXIS2_PLACEMENT_3D('',#587,#588,#589);
#363=SURFACE_SIDE_STYLE('',(#590));
#364=EDGE_LOOP('',(#591,#592,#593));
#365=AXIS2_PLACEMENT_3D('',#594,#595,#596);
#366=SURFACE_SIDE_STYLE('',(#597));
#367=EDGE_LOOP('',(#598,#599,#600,#601,#602));
#368=AXIS2_PLACEMENT_3D('',#603,#604,#605);
#369=SURFACE_SIDE_STYLE('',(#606));
#370=EDGE_LOOP('',(#607,#608,#609,#610,#611,#612,#613,#614));
#371=AXIS2_PLACEMENT_3D('',#615,#616,#617);
#372=SURFACE_SIDE_STYLE('',(#618));
#373=EDGE_LOOP('',(#619,#620,#621,#622,#623));
#374=AXIS2_PLACEMENT_3D('',#624,#625,#626);
#375=SURFACE_SIDE_STYLE('',(#627));
#376=EDGE_LOOP('',(#628,#629,#630,#631,#632,#633,#634,#635,#636,#637));
#377=AXIS2_PLACEMENT_3D('',#638,#639,#640);
#378=SURFACE_SIDE_STYLE('',(#641));
#379=EDGE_LOOP('',(#642,#643,#644,#645));
#380=AXIS2_PLACEMENT_3D('',#646,#647,#648);
#381=SURFACE_SIDE_STYLE('',(#649));
#382=EDGE_LOOP('',(#650,#651));
#383=AXIS2_PLACEMENT_3D('',#652,#653,#654);
#384=SURFACE_SIDE_STYLE('',(#655));
#385=EDGE_LOOP('',(#656,#657,#658,#659));
#386=AXIS2_PLACEMENT_3D('',#660,#661,#662);
#387=SURFACE_SIDE_STYLE('',(#663));
#388=EDGE_LOOP('',(#664,#665));
#389=AXIS2_PLACEMENT_3D('',#666,#667,#668);
#390=SURFACE_SIDE_STYLE('',(#669));
#391=EDGE_LOOP('',(#670,#671));
#392=EDGE_LOOP('',(#672,#673,#674,#675,#676));
#393=AXIS2_PLACEMENT_3D('',#677,#678,#679);
#394=SURFACE_SIDE_STYLE('',(#680));
#395=EDGE_LOOP('',(#681,#682,#683,#684));
#396=AXIS2_PLACEMENT_3D('',#685,#686,#687);
#397=SURFACE_SIDE_STYLE('',(#688));
#398=EDGE_LOOP('',(#689,#690,#691,#692,#693,#694,#695,#696,#697,#698,#699,#700,#701,#702,#703,#704));
#399=AXIS2_PLACEMENT_3D('',#705,#706,#707);
#400=SURFACE_SIDE_STYLE('',(#708));
#401=EDGE_LOOP('',(#709,#710));
#402=EDGE_LOOP('',(#711,#712,#713,#714,#715));
#403=AXIS2_PLACEMENT_3D('',#716,#717,#718);
#404=SURFACE_SIDE_STYLE('',(#719));
#405=EDGE_LOOP('',(#720,#721,#722,#723,#724,#725,#726,#727,#728,#729,#730,#731,#732,#733,#734,#735));
#406=AXIS2_PLACEMENT_3D('',#736,#737,#738);
#407=SURFACE_SIDE_STYLE('',(#739));
#408=EDGE_LOOP('',(#740,#741));
#409=EDGE_LOOP('',(#742,#743,#744,#745,#746));
#410=AXIS2_PLACEMENT_3D('',#747,#748,#749);
#411=SURFACE_SIDE_STYLE('',(#750));
#412=EDGE_LOOP('',(#751,#752,#753,#754));
#413=AXIS2_PLACEMENT_3D('',#755,#756,#757);
#414=SURFACE_SIDE_STYLE('',(#758));
#415=EDGE_LOOP('',(#759,#760,#761,#762));
#416=AXIS2_PLACEMENT_3D('',#763,#764,#765);
#417=SURFACE_SIDE_STYLE('',(#766));
#418=EDGE_LOOP('',(#767,#768,#769,#770));
#419=AXIS2_PLACEMENT_3D('',#771,#772,#773);
#420=SURFACE_SIDE_STYLE('',(#774));
#421=EDGE_LOOP('',(#775,#776,#777));
#422=EDGE_LOOP('',(#778,#779,#780,#781,#782,#783,#784,#785));
#423=AXIS2_PLACEMENT_3D('',#786,#787,#788);
#424=SURFACE_SIDE_STYLE('',(#789));
#425=EDGE_LOOP('',(#790,#791,#792,#793));
#426=AXIS2_PLACEMENT_3D('',#794,#795,#796);
#427=SURFACE_SIDE_STYLE('',(#797));
#428=EDGE_LOOP('',(#798,#799,#800,#801));
#429=AXIS2_PLACEMENT_3D('',#802,#803,#804);
#430=SURFACE_SIDE_STYLE('',(#805));
#431=EDGE_LOOP('',(#806,#807,#808,#809));
#432=AXIS2_PLACEMENT_3D('',#810,#811,#812);
#433=SURFACE_SIDE_STYLE('',(#813));
#434=EDGE_LOOP('',(#814,#815,#816,#817));
#435=AXIS2_PLACEMENT_3D('',#818,#819,#820);
#436=SURFACE_SIDE_STYLE('',(#821));
#437=EDGE_LOOP('',(#822,#823,#824,#825,#826,#827));
#438=AXIS2_PLACEMENT_3D('',#828,#829,#830);
#439=SURFACE_SIDE_STYLE('',(#831));
#440=EDGE_LOOP('',(#832,#833,#834,#835));
#441=AXIS2_PLACEMENT_3D('',#836,#837,#838);
#442=SURFACE_SIDE_STYLE('',(#839));
#443=EDGE_LOOP('',(#840,#841,#842,#843));
#444=AXIS2_PLACEMENT_3D('',#844,#845,#846);
#445=SURFACE_SIDE_STYLE('',(#847));
#446=EDGE_LOOP('',(#848,#849,#850,#851,#852,#853));
#447=AXIS2_PLACEMENT_3D('',#854,#855,#856);
#448=SURFACE_SIDE_STYLE('',(#857));
#449=EDGE_LOOP('',(#858,#859,#860,#861));
#450=AXIS2_PLACEMENT_3D('',#862,#863,#864);
#451=SURFACE_SIDE_STYLE('',(#865));
#452=EDGE_LOOP('',(#866,#867,#868,#869));
#453=AXIS2_PLACEMENT_3D('',#870,#871,#872);
#454=SURFACE_SIDE_STYLE('',(#873));
#455=EDGE_LOOP('',(#874,#875));
#456=EDGE_LOOP('',(#876,#877,#878,#879,#880));
#457=AXIS2_PLACEMENT_3D('',#881,#882,#883);
#458=SURFACE_SIDE_STYLE('',(#884));
#460=SURFACE_STYLE_FILL_AREA(#885);
#461=ORIENTED_EDGE('',*,*,#886,.F.);
#462=ORIENTED_EDGE('',*,*,#887,.F.);
#463=ORIENTED_EDGE('',*,*,#888,.F.);
#464=ORIENTED_EDGE('',*,*,#889,.F.);
#465=CARTESIAN_POINT('',(-20.0,22.625,0.0));
#466=DIRECTION('',(0.0,1.0,0.0));
#467=DIRECTION('',(-1.0,0.0,0.0));
#468=SURFACE_STYLE_FILL_AREA(#890);
#469=ORIENTED_EDGE('',*,*,#891,.F.);
#470=ORIENTED_EDGE('',*,*,#892,.F.);
#471=ORIENTED_EDGE('',*,*,#893,.F.);
#472=ORIENTED_EDGE('',*,*,#894,.F.);
#473=CARTESIAN_POINT('',(-20.0,-2.625,0.0));
#474=DIRECTION('',(0.0,1.0,0.0));
#475=DIRECTION('',(-1.0,0.0,0.0));
#476=SURFACE_STYLE_FILL_AREA(#895);
#477=ORIENTED_EDGE('',*,*,#896,.F.);
#478=ORIENTED_EDGE('',*,*,#897,.F.);
#479=ORIENTED_EDGE('',*,*,#898,.F.);
#480=ORIENTED_EDGE('',*,*,#899,.T.);
#481=CARTESIAN_POINT('',(0.0,10.0,0.0));
#482=DIRECTION('',(0.0,1.0,0.0));
#483=DIRECTION('',(-1.0,0.0,0.0));
#484=SURFACE_STYLE_FILL_AREA(#900);
#485=ORIENTED_EDGE('',*,*,#901,.F.);
#486=ORIENTED_EDGE('',*,*,#902,.F.);
#487=ORIENTED_EDGE('',*,*,#903,.F.);
#488=ORIENTED_EDGE('',*,*,#904,.F.);
#489=CARTESIAN_POINT('',(0.0,10.0,0.0));
#490=DIRECTION('',(0.0,1.0,0.0));
#491=DIRECTION('',(-1.0,0.0,0.0));
#492=SURFACE_STYLE_FILL_AREA(#905);
#493=ORIENTED_EDGE('',*,*,#906,.F.);
#494=ORIENTED_EDGE('',*,*,#907,.F.);
#495=ORIENTED_EDGE('',*,*,#908,.T.);
#496=ORIENTED_EDGE('',*,*,#909,.F.);
#497=ORIENTED_EDGE('',*,*,#910,.T.);
#498=CARTESIAN_POINT('',(0.0,-0.875,0.0));
#499=DIRECTION('',(0.0,1.0,0.0));
#500=DIRECTION('',(-1.0,0.0,0.0));
#501=SURFACE_STYLE_FILL_AREA(#911);
#502=ORIENTED_EDGE('',*,*,#912,.F.);
#503=ORIENTED_EDGE('',*,*,#913,.T.);
#504=ORIENTED_EDGE('',*,*,#914,.F.);
#505=ORIENTED_EDGE('',*,*,#915,.T.);
#506=ORIENTED_EDGE('',*,*,#916,.F.);
#507=CARTESIAN_POINT('',(0.0,20.875,0.0));
#508=DIRECTION('',(0.0,1.0,0.0));
#509=DIRECTION('',(-1.0,0.0,0.0));
#510=SURFACE_STYLE_FILL_AREA(#917);
#511=ORIENTED_EDGE('',*,*,#912,.T.);
#512=ORIENTED_EDGE('',*,*,#918,.F.);
#513=ORIENTED_EDGE('',*,*,#919,.T.);
#514=ORIENTED_EDGE('',*,*,#920,.F.);
#515=ORIENTED_EDGE('',*,*,#921,.T.);
#516=CARTESIAN_POINT('',(0.0,20.875,0.0));
#517=DIRECTION('',(0.0,1.0,0.0));
#518=DIRECTION('',(-1.0,0.0,0.0));
#519=SURFACE_STYLE_FILL_AREA(#922);
#520=ORIENTED_EDGE('',*,*,#923,.F.);
#521=ORIENTED_EDGE('',*,*,#924,.F.);
#522=ORIENTED_EDGE('',*,*,#915,.F.);
#523=CARTESIAN_POINT('',(0.0,20.0,0.0));
#524=DIRECTION('',(0.0,-1.0,0.0));
#525=DIRECTION('',(1.0,0.0,0.0));
#526=SURFACE_STYLE_FILL_AREA(#925);
#527=ORIENTED_EDGE('',*,*,#926,.F.);
#528=ORIENTED_EDGE('',*,*,#919,.F.);
#529=ORIENTED_EDGE('',*,*,#927,.F.);
#530=CARTESIAN_POINT('',(0.0,20.0,0.0));
#531=DIRECTION('',(0.0,-1.0,0.0));
#532=DIRECTION('',(1.0,0.0,0.0));
#533=SURFACE_STYLE_FILL_AREA(#928);
#534=ORIENTED_EDGE('',*,*,#920,.T.);
#535=ORIENTED_EDGE('',*,*,#926,.T.);
#536=ORIENTED_EDGE('',*,*,#929,.F.);
#537=ORIENTED_EDGE('',*,*,#930,.T.);
#538=ORIENTED_EDGE('',*,*,#931,.T.);
#539=ORIENTED_EDGE('',*,*,#932,.T.);
#540=ORIENTED_EDGE('',*,*,#933,.F.);
#541=ORIENTED_EDGE('',*,*,#934,.T.);
#542=CARTESIAN_POINT('',(-2.5,10.0,0.0));
#543=DIRECTION('',(1.0,0.0,0.0));
#544=DIRECTION('',(0.0,1.0,0.0));
#545=SURFACE_STYLE_FILL_AREA(#935);
#546=ORIENTED_EDGE('',*,*,#921,.F.);
#547=ORIENTED_EDGE('',*,*,#934,.F.);
#548=ORIENTED_EDGE('',*,*,#936,.F.);
#549=ORIENTED_EDGE('',*,*,#937,.F.);
#550=ORIENTED_EDGE('',*,*,#938,.F.);
#551=ORIENTED_EDGE('',*,*,#939,.F.);
#552=ORIENTED_EDGE('',*,*,#940,.F.);
#553=ORIENTED_EDGE('',*,*,#913,.F.);
#554=ORIENTED_EDGE('',*,*,#941,.F.);
#555=ORIENTED_EDGE('',*,*,#942,.F.);
#556=ORIENTED_EDGE('',*,*,#899,.F.);
#557=CARTESIAN_POINT('',(14.65,21.75,0.0));
#558=DIRECTION('',(0.0,1.0,0.0));
#559=DIRECTION('',(-1.0,0.0,0.0));
#560=SURFACE_STYLE_FILL_AREA(#943);
#561=ORIENTED_EDGE('',*,*,#918,.T.);
#562=ORIENTED_EDGE('',*,*,#916,.T.);
#563=ORIENTED_EDGE('',*,*,#944,.F.);
#564=ORIENTED_EDGE('',*,*,#945,.F.);
#565=ORIENTED_EDGE('',*,*,#946,.F.);
#566=ORIENTED_EDGE('',*,*,#947,.F.);
#567=ORIENTED_EDGE('',*,*,#948,.F.);
#568=ORIENTED_EDGE('',*,*,#949,.F.);
#569=ORIENTED_EDGE('',*,*,#950,.F.);
#570=ORIENTED_EDGE('',*,*,#951,.F.);
#571=CARTESIAN_POINT('',(-12.5,20.0,0.0));
#572=DIRECTION('',(0.0,1.0,0.0));
#573=DIRECTION('',(-1.0,0.0,0.0));
#574=SURFACE_STYLE_FILL_AREA(#952);
#575=ORIENTED_EDGE('',*,*,#953,.F.);
#576=ORIENTED_EDGE('',*,*,#908,.F.);
#577=ORIENTED_EDGE('',*,*,#954,.F.);
#578=CARTESIAN_POINT('',(0.0,0.0,0.0));
#579=DIRECTION('',(0.0,1.0,0.0));
#580=DIRECTION('',(-1.0,0.0,0.0));
#581=SURFACE_STYLE_FILL_AREA(#955);
#582=ORIENTED_EDGE('',*,*,#906,.T.);
#583=ORIENTED_EDGE('',*,*,#956,.T.);
#584=ORIENTED_EDGE('',*,*,#931,.F.);
#585=ORIENTED_EDGE('',*,*,#957,.T.);
#586=ORIENTED_EDGE('',*,*,#958,.F.);
#587=CARTESIAN_POINT('',(0.0,-0.875,0.0));
#588=DIRECTION('',(0.0,1.0,0.0));
#589=DIRECTION('',(-1.0,0.0,0.0));
#590=SURFACE_STYLE_FILL_AREA(#959);
#591=ORIENTED_EDGE('',*,*,#930,.F.);
#592=ORIENTED_EDGE('',*,*,#960,.F.);
#593=ORIENTED_EDGE('',*,*,#957,.F.);
#594=CARTESIAN_POINT('',(0.0,0.0,0.0));
#595=DIRECTION('',(0.0,1.0,0.0));
#596=DIRECTION('',(-1.0,0.0,0.0));
#597=SURFACE_STYLE_FILL_AREA(#961);
#598=ORIENTED_EDGE('',*,*,#901,.T.);
#599=ORIENTED_EDGE('',*,*,#962,.F.);
#600=ORIENTED_EDGE('',*,*,#903,.T.);
#601=ORIENTED_EDGE('',*,*,#963,.F.);
#602=ORIENTED_EDGE('',*,*,#964,.F.);
#603=CARTESIAN_POINT('',(0.0,10.0,0.0));
#604=DIRECTION('',(0.0,1.0,0.0));
#605=DIRECTION('',(-1.0,0.0,0.0));
#606=SURFACE_STYLE_FILL_AREA(#965);
#607=ORIENTED_EDGE('',*,*,#914,.T.);
#608=ORIENTED_EDGE('',*,*,#940,.T.);
#609=ORIENTED_EDGE('',*,*,#966,.F.);
#610=ORIENTED_EDGE('',*,*,#967,.T.);
#611=ORIENTED_EDGE('',*,*,#909,.T.);
#612=ORIENTED_EDGE('',*,*,#953,.T.);
#613=ORIENTED_EDGE('',*,*,#968,.F.);
#614=ORIENTED_EDGE('',*,*,#923,.T.);
#615=CARTESIAN_POINT('',(-2.5,10.0,0.0));
#616=DIRECTION('',(1.0,0.0,0.0));
#617=DIRECTION('',(0.0,1.0,0.0));
#618=SURFACE_STYLE_FILL_AREA(#969);
#619=ORIENTED_EDGE('',*,*,#896,.T.);
#620=ORIENTED_EDGE('',*,*,#942,.T.);
#621=ORIENTED_EDGE('',*,*,#941,.T.);
#622=ORIENTED_EDGE('',*,*,#898,.T.);
#623=ORIENTED_EDGE('',*,*,#970,.F.);
#624=CARTESIAN_POINT('',(0.0,10.0,0.0));
#625=DIRECTION('',(0.0,1.0,0.0));
#626=DIRECTION('',(-1.0,0.0,0.0));
#627=SURFACE_STYLE_FILL_AREA(#971);
#628=ORIENTED_EDGE('',*,*,#907,.T.);
#629=ORIENTED_EDGE('',*,*,#958,.T.);
#630=ORIENTED_EDGE('',*,*,#972,.F.);
#631=ORIENTED_EDGE('',*,*,#973,.F.);
#632=ORIENTED_EDGE('',*,*,#974,.F.);
#633=ORIENTED_EDGE('',*,*,#975,.F.);
#634=ORIENTED_EDGE('',*,*,#976,.F.);
#635=ORIENTED_EDGE('',*,*,#977,.F.);
#636=ORIENTED_EDGE('',*,*,#978,.F.);
#637=ORIENTED_EDGE('',*,*,#979,.F.);
#638=CARTESIAN_POINT('',(-12.5,0.0,0.0));
#639=DIRECTION('',(0.0,1.0,0.0));
#640=DIRECTION('',(-1.0,0.0,0.0));
#641=SURFACE_STYLE_FILL_AREA(#980);
#642=ORIENTED_EDGE('',*,*,#891,.T.);
#643=ORIENTED_EDGE('',*,*,#981,.F.);
#644=ORIENTED_EDGE('',*,*,#893,.T.);
#645=ORIENTED_EDGE('',*,*,#982,.F.);
#646=CARTESIAN_POINT('',(-20.0,-2.625,0.0));
#647=DIRECTION('',(0.0,1.0,0.0));
#648=DIRECTION('',(-1.0,0.0,0.0));
#649=SURFACE_STYLE_FILL_AREA(#983);
#650=ORIENTED_EDGE('',*,*,#982,.T.);
#651=ORIENTED_EDGE('',*,*,#892,.T.);
#652=CARTESIAN_POINT('',(-20.0,-3.5,0.0));
#653=DIRECTION('',(0.0,-1.0,0.0));
#654=DIRECTION('',(1.0,0.0,0.0));
#655=SURFACE_STYLE_FILL_AREA(#984);
#656=ORIENTED_EDGE('',*,*,#886,.T.);
#657=ORIENTED_EDGE('',*,*,#985,.F.);
#658=ORIENTED_EDGE('',*,*,#888,.T.);
#659=ORIENTED_EDGE('',*,*,#986,.F.);
#660=CARTESIAN_POINT('',(-20.0,22.625,0.0));
#661=DIRECTION('',(0.0,1.0,0.0));
#662=DIRECTION('',(-1.0,0.0,0.0));
#663=SURFACE_STYLE_FILL_AREA(#987);
#664=ORIENTED_EDGE('',*,*,#889,.T.);
#665=ORIENTED_EDGE('',*,*,#985,.T.);
#666=CARTESIAN_POINT('',(-20.0,23.5,0.0));
#667=DIRECTION('',(0.0,1.0,0.0));
#668=DIRECTION('',(-1.0,0.0,0.0));
#669=SURFACE_STYLE_FILL_AREA(#988);
#670=ORIENTED_EDGE('',*,*,#986,.T.);
#671=ORIENTED_EDGE('',*,*,#887,.T.);
#672=ORIENTED_EDGE('',*,*,#989,.F.);
#673=ORIENTED_EDGE('',*,*,#990,.F.);
#674=ORIENTED_EDGE('',*,*,#991,.F.);
#675=ORIENTED_EDGE('',*,*,#992,.F.);
#676=ORIENTED_EDGE('',*,*,#993,.F.);
#677=CARTESIAN_POINT('',(-28.65,21.75,0.0));
#678=DIRECTION('',(0.0,1.0,0.0));
#679=DIRECTION('',(0.0,0.0,-1.0));
#680=SURFACE_STYLE_FILL_AREA(#994);
#681=ORIENTED_EDGE('',*,*,#995,.F.);
#682=ORIENTED_EDGE('',*,*,#996,.F.);
#683=ORIENTED_EDGE('',*,*,#992,.T.);
#684=ORIENTED_EDGE('',*,*,#997,.F.);
#685=CARTESIAN_POINT('',(-11.5,22.625,0.0));
#686=DIRECTION('',(-1.0,0.0,0.0));
#687=DIRECTION('',(0.0,0.0,1.0));
#688=SURFACE_STYLE_FILL_AREA(#998);
#689=ORIENTED_EDGE('',*,*,#993,.T.);
#690=ORIENTED_EDGE('',*,*,#996,.T.);
#691=ORIENTED_EDGE('',*,*,#999,.T.);
#692=ORIENTED_EDGE('',*,*,#1000,.F.);
#693=ORIENTED_EDGE('',*,*,#936,.T.);
#694=ORIENTED_EDGE('',*,*,#933,.T.);
#695=ORIENTED_EDGE('',*,*,#1001,.T.);
#696=ORIENTED_EDGE('',*,*,#1002,.F.);
#697=ORIENTED_EDGE('',*,*,#1003,.T.);
#698=ORIENTED_EDGE('',*,*,#1004,.T.);
#699=ORIENTED_EDGE('',*,*,#1005,.T.);
#700=ORIENTED_EDGE('',*,*,#1006,.T.);
#701=ORIENTED_EDGE('',*,*,#974,.T.);
#702=ORIENTED_EDGE('',*,*,#1007,.T.);
#703=ORIENTED_EDGE('',*,*,#949,.T.);
#704=ORIENTED_EDGE('',*,*,#1008,.T.);
#705=CARTESIAN_POINT('',(-10.0,-3.5,-7.5));
#706=DIRECTION('',(0.0,0.0,-1.0));
#707=DIRECTION('',(-1.0,0.0,0.0));
#708=SURFACE_STYLE_FILL_AREA(#1009);
#709=ORIENTED_EDGE('',*,*,#970,.T.);
#710=ORIENTED_EDGE('',*,*,#897,.T.);
#711=ORIENTED_EDGE('',*,*,#995,.T.);
#712=ORIENTED_EDGE('',*,*,#1010,.F.);
#713=ORIENTED_EDGE('',*,*,#1011,.F.);
#714=ORIENTED_EDGE('',*,*,#1012,.F.);
#715=ORIENTED_EDGE('',*,*,#999,.F.);
#716=CARTESIAN_POINT('',(-10.0,23.5,-1.99840144432528E-014));
#717=DIRECTION('',(0.0,1.0,0.0));
#718=DIRECTION('',(-1.0,0.0,0.0));
#719=SURFACE_STYLE_FILL_AREA(#1013);
#720=ORIENTED_EDGE('',*,*,#997,.T.);
#721=ORIENTED_EDGE('',*,*,#991,.T.);
#722=ORIENTED_EDGE('',*,*,#1014,.F.);
#723=ORIENTED_EDGE('',*,*,#946,.T.);
#724=ORIENTED_EDGE('',*,*,#1015,.T.);
#725=ORIENTED_EDGE('',*,*,#977,.T.);
#726=ORIENTED_EDGE('',*,*,#1016,.F.);
#727=ORIENTED_EDGE('',*,*,#1017,.T.);
#728=ORIENTED_EDGE('',*,*,#1018,.T.);
#729=ORIENTED_EDGE('',*,*,#1019,.T.);
#730=ORIENTED_EDGE('',*,*,#1020,.T.);
#731=ORIENTED_EDGE('',*,*,#1021,.T.);
#732=ORIENTED_EDGE('',*,*,#966,.T.);
#733=ORIENTED_EDGE('',*,*,#939,.T.);
#734=ORIENTED_EDGE('',*,*,#1022,.T.);
#735=ORIENTED_EDGE('',*,*,#1010,.T.);
#736=CARTESIAN_POINT('',(-10.0000000000024,-3.5,7.5));
#737=DIRECTION('',(0.0,0.0,1.0));
#738=DIRECTION('',(1.0,0.0,0.0));
#739=SURFACE_STYLE_FILL_AREA(#1023);
#740=ORIENTED_EDGE('',*,*,#894,.T.);
#741=ORIENTED_EDGE('',*,*,#981,.T.);
#742=ORIENTED_EDGE('',*,*,#1024,.F.);
#743=ORIENTED_EDGE('',*,*,#1005,.F.);
#744=ORIENTED_EDGE('',*,*,#1025,.T.);
#745=ORIENTED_EDGE('',*,*,#1017,.F.);
#746=ORIENTED_EDGE('',*,*,#1026,.F.);
#747=CARTESIAN_POINT('',(-28.65,-1.75,0.0));
#748=DIRECTION('',(0.0,-1.0,0.0));
#749=DIRECTION('',(0.0,0.0,1.0));
#750=SURFACE_STYLE_FILL_AREA(#1027);
#751=ORIENTED_EDGE('',*,*,#1025,.F.);
#752=ORIENTED_EDGE('',*,*,#1004,.F.);
#753=ORIENTED_EDGE('',*,*,#1028,.F.);
#754=ORIENTED_EDGE('',*,*,#1018,.F.);
#755=CARTESIAN_POINT('',(-11.5,-2.625,0.0));
#756=DIRECTION('',(-1.0,0.0,0.0));
#757=DIRECTION('',(0.0,0.0,1.0));
#758=SURFACE_STYLE_FILL_AREA(#1029);
#759=ORIENTED_EDGE('',*,*,#1024,.T.);
#760=ORIENTED_EDGE('',*,*,#1030,.T.);
#761=ORIENTED_EDGE('',*,*,#975,.T.);
#762=ORIENTED_EDGE('',*,*,#1006,.F.);
#763=CARTESIAN_POINT('',(-19.6499999999,-3.5,9.99991200956174E-011));
#764=DIRECTION('',(0.0,1.0,0.0));
#765=DIRECTION('',(-1.39628901033954E-011,0.0,-1.0));
#766=SURFACE_STYLE_FILL_AREA(#1031);
#767=ORIENTED_EDGE('',*,*,#1026,.T.);
#768=ORIENTED_EDGE('',*,*,#1016,.T.);
#769=ORIENTED_EDGE('',*,*,#976,.T.);
#770=ORIENTED_EDGE('',*,*,#1030,.F.);
#771=CARTESIAN_POINT('',(-19.6499999999,-3.5,-9.99977369804511E-011));
#772=DIRECTION('',(0.0,1.0,0.0));
#773=DIRECTION('',(-1.0,0.0,1.39623322800148E-011));
#774=SURFACE_STYLE_FILL_AREA(#1032);
#775=ORIENTED_EDGE('',*,*,#963,.T.);
#776=ORIENTED_EDGE('',*,*,#902,.T.);
#777=ORIENTED_EDGE('',*,*,#964,.T.);
#778=ORIENTED_EDGE('',*,*,#932,.F.);
#779=ORIENTED_EDGE('',*,*,#956,.F.);
#780=ORIENTED_EDGE('',*,*,#910,.F.);
#781=ORIENTED_EDGE('',*,*,#967,.F.);
#782=ORIENTED_EDGE('',*,*,#1021,.F.);
#783=ORIENTED_EDGE('',*,*,#1033,.F.);
#784=ORIENTED_EDGE('',*,*,#1034,.F.);
#785=ORIENTED_EDGE('',*,*,#1001,.F.);
#786=CARTESIAN_POINT('',(14.65,-1.75,0.0));
#787=DIRECTION('',(0.0,1.0,0.0));
#788=DIRECTION('',(-1.0,0.0,0.0));
#789=SURFACE_STYLE_FILL_AREA(#1035);
#790=ORIENTED_EDGE('',*,*,#1033,.T.);
#791=ORIENTED_EDGE('',*,*,#1020,.F.);
#792=ORIENTED_EDGE('',*,*,#1036,.T.);
#793=ORIENTED_EDGE('',*,*,#1037,.T.);
#794=CARTESIAN_POINT('',(-0.350000000099996,-3.5,-9.99982319171977E-011));
#795=DIRECTION('',(-0.0,1.0,0.0));
#796=DIRECTION('',(1.3962164757686E-011,0.0,1.0));
#797=SURFACE_STYLE_FILL_AREA(#1038);
#798=ORIENTED_EDGE('',*,*,#938,.T.);
#799=ORIENTED_EDGE('',*,*,#1039,.T.);
#800=ORIENTED_EDGE('',*,*,#1011,.T.);
#801=ORIENTED_EDGE('',*,*,#1022,.F.);
#802=CARTESIAN_POINT('',(-0.350000000099996,-3.5,-9.99982319171977E-011));
#803=DIRECTION('',(-0.0,1.0,0.0));
#804=DIRECTION('',(1.3962164757686E-011,0.0,1.0));
#805=SURFACE_STYLE_FILL_AREA(#1040);
#806=ORIENTED_EDGE('',*,*,#1034,.T.);
#807=ORIENTED_EDGE('',*,*,#1037,.F.);
#808=ORIENTED_EDGE('',*,*,#1041,.T.);
#809=ORIENTED_EDGE('',*,*,#1002,.T.);
#810=CARTESIAN_POINT('',(-0.35000000010001,-3.5,1.00007717636794E-010));
#811=DIRECTION('',(0.0,1.0,0.0));
#812=DIRECTION('',(1.0,0.0,-1.39630713112453E-011));
#813=SURFACE_STYLE_FILL_AREA(#1042);
#814=ORIENTED_EDGE('',*,*,#937,.T.);
#815=ORIENTED_EDGE('',*,*,#1000,.T.);
#816=ORIENTED_EDGE('',*,*,#1012,.T.);
#817=ORIENTED_EDGE('',*,*,#1039,.F.);
#818=CARTESIAN_POINT('',(-0.35000000010001,-3.5,1.00007717636794E-010));
#819=DIRECTION('',(0.0,1.0,0.0));
#820=DIRECTION('',(1.0,0.0,-1.39630713112453E-011));
#821=SURFACE_STYLE_FILL_AREA(#1043);
#822=ORIENTED_EDGE('',*,*,#929,.T.);
#823=ORIENTED_EDGE('',*,*,#927,.T.);
#824=ORIENTED_EDGE('',*,*,#951,.T.);
#825=ORIENTED_EDGE('',*,*,#1044,.T.);
#826=ORIENTED_EDGE('',*,*,#972,.T.);
#827=ORIENTED_EDGE('',*,*,#960,.T.);
#828=CARTESIAN_POINT('',(-12.5,10.0,-5.35));
#829=DIRECTION('',(0.0,-0.0,1.0));
#830=DIRECTION('',(0.0,1.0,0.0));
#831=SURFACE_STYLE_FILL_AREA(#1045);
#832=ORIENTED_EDGE('',*,*,#1044,.F.);
#833=ORIENTED_EDGE('',*,*,#950,.T.);
#834=ORIENTED_EDGE('',*,*,#1007,.F.);
#835=ORIENTED_EDGE('',*,*,#973,.T.);
#836=CARTESIAN_POINT('',(-17.5,10.0,0.0));
#837=DIRECTION('',(-1.0,0.0,0.0));
#838=DIRECTION('',(0.0,-1.0,0.0));
#839=SURFACE_STYLE_FILL_AREA(#1046);
#840=ORIENTED_EDGE('',*,*,#1047,.F.);
#841=ORIENTED_EDGE('',*,*,#978,.T.);
#842=ORIENTED_EDGE('',*,*,#1015,.F.);
#843=ORIENTED_EDGE('',*,*,#945,.T.);
#844=CARTESIAN_POINT('',(-17.5,10.0,0.0));
#845=DIRECTION('',(-1.0,0.0,0.0));
#846=DIRECTION('',(0.0,-1.0,0.0));
#847=SURFACE_STYLE_FILL_AREA(#1048);
#848=ORIENTED_EDGE('',*,*,#968,.T.);
#849=ORIENTED_EDGE('',*,*,#954,.T.);
#850=ORIENTED_EDGE('',*,*,#979,.T.);
#851=ORIENTED_EDGE('',*,*,#1047,.T.);
#852=ORIENTED_EDGE('',*,*,#944,.T.);
#853=ORIENTED_EDGE('',*,*,#924,.T.);
#854=CARTESIAN_POINT('',(-12.5,10.0,5.35));
#855=DIRECTION('',(0.0,0.0,-1.0));
#856=DIRECTION('',(0.0,-1.0,0.0));
#857=SURFACE_STYLE_FILL_AREA(#1049);
#858=ORIENTED_EDGE('',*,*,#990,.T.);
#859=ORIENTED_EDGE('',*,*,#1050,.F.);
#860=ORIENTED_EDGE('',*,*,#947,.T.);
#861=ORIENTED_EDGE('',*,*,#1014,.T.);
#862=CARTESIAN_POINT('',(-19.6499999999,-3.5,-9.99977369804511E-011));
#863=DIRECTION('',(0.0,1.0,0.0));
#864=DIRECTION('',(-1.0,0.0,1.39623322800148E-011));
#865=SURFACE_STYLE_FILL_AREA(#1051);
#866=ORIENTED_EDGE('',*,*,#989,.T.);
#867=ORIENTED_EDGE('',*,*,#1008,.F.);
#868=ORIENTED_EDGE('',*,*,#948,.T.);
#869=ORIENTED_EDGE('',*,*,#1050,.T.);
#870=CARTESIAN_POINT('',(-19.6499999999,-3.5,9.99991200956174E-011));
#871=DIRECTION('',(0.0,1.0,0.0));
#872=DIRECTION('',(-1.39628901033954E-011,0.0,-1.0));
#873=SURFACE_STYLE_FILL_AREA(#1052);
#874=ORIENTED_EDGE('',*,*,#904,.T.);
#875=ORIENTED_EDGE('',*,*,#962,.T.);
#876=ORIENTED_EDGE('',*,*,#1028,.T.);
#877=ORIENTED_EDGE('',*,*,#1003,.F.);
#878=ORIENTED_EDGE('',*,*,#1041,.F.);
#879=ORIENTED_EDGE('',*,*,#1036,.F.);
#880=ORIENTED_EDGE('',*,*,#1019,.F.);
#881=CARTESIAN_POINT('',(-10.0,-3.5,-2.04281036531029E-014));
#882=DIRECTION('',(0.0,1.0,0.0));
#883=DIRECTION('',(-1.0,0.0,0.0));
#884=SURFACE_STYLE_FILL_AREA(#1053);
#885=FILL_AREA_STYLE('',(#1054));
#886=EDGE_CURVE('',#1055,#1056,#1057,.T.);
#887=EDGE_CURVE('',#1058,#1055,#1059,.T.);
#888=EDGE_CURVE('',#1060,#1058,#1061,.T.);
#889=EDGE_CURVE('',#1056,#1060,#1062,.T.);
#890=FILL_AREA_STYLE('',(#1063));
#891=EDGE_CURVE('',#1064,#1065,#1066,.T.);
#892=EDGE_CURVE('',#1067,#1064,#1068,.T.);
#893=EDGE_CURVE('',#1069,#1067,#1070,.T.);
#894=EDGE_CURVE('',#1065,#1069,#1071,.T.);
#895=FILL_AREA_STYLE('',(#1072));
#896=EDGE_CURVE('',#1073,#1074,#1075,.T.);
#897=EDGE_CURVE('',#1076,#1073,#1077,.T.);
#898=EDGE_CURVE('',#1078,#1076,#1079,.T.);
#899=EDGE_CURVE('',#1078,#1074,#1080,.T.);
#900=FILL_AREA_STYLE('',(#1081));
#901=EDGE_CURVE('',#1082,#1083,#1084,.T.);
#902=EDGE_CURVE('',#1085,#1082,#1086,.T.);
#903=EDGE_CURVE('',#1087,#1085,#1088,.T.);
#904=EDGE_CURVE('',#1083,#1087,#1089,.T.);
#905=FILL_AREA_STYLE('',(#1090));
#906=EDGE_CURVE('',#1091,#1092,#1093,.T.);
#907=EDGE_CURVE('',#1094,#1091,#1095,.T.);
#908=EDGE_CURVE('',#1094,#1096,#1097,.T.);
#909=EDGE_CURVE('',#1098,#1096,#1099,.T.);
#910=EDGE_CURVE('',#1098,#1092,#1100,.T.);
#911=FILL_AREA_STYLE('',(#1101));
#912=EDGE_CURVE('',#1102,#1103,#1104,.T.);
#913=EDGE_CURVE('',#1102,#1105,#1106,.T.);
#914=EDGE_CURVE('',#1107,#1105,#1108,.T.);
#915=EDGE_CURVE('',#1107,#1109,#1110,.T.);
#916=EDGE_CURVE('',#1103,#1109,#1111,.T.);
#917=FILL_AREA_STYLE('',(#1112));
#918=EDGE_CURVE('',#1113,#1103,#1114,.T.);
#919=EDGE_CURVE('',#1113,#1115,#1116,.T.);
#920=EDGE_CURVE('',#1117,#1115,#1118,.T.);
#921=EDGE_CURVE('',#1117,#1102,#1119,.T.);
#922=FILL_AREA_STYLE('',(#1120));
#923=EDGE_CURVE('',#1121,#1107,#1122,.T.);
#924=EDGE_CURVE('',#1109,#1121,#1123,.T.);
#925=FILL_AREA_STYLE('',(#1124));
#926=EDGE_CURVE('',#1115,#1125,#1126,.T.);
#927=EDGE_CURVE('',#1125,#1113,#1127,.T.);
#928=FILL_AREA_STYLE('',(#1128));
#929=EDGE_CURVE('',#1129,#1125,#1130,.T.);
#930=EDGE_CURVE('',#1129,#1131,#1132,.T.);
#931=EDGE_CURVE('',#1131,#1133,#1134,.T.);
#932=EDGE_CURVE('',#1133,#1135,#1136,.T.);
#933=EDGE_CURVE('',#1137,#1135,#1138,.T.);
#934=EDGE_CURVE('',#1137,#1117,#1139,.T.);
#935=FILL_AREA_STYLE('',(#1140));
#936=EDGE_CURVE('',#1141,#1137,#1142,.T.);
#937=EDGE_CURVE('',#1143,#1141,#1144,.T.);
#938=EDGE_CURVE('',#1145,#1143,#1146,.T.);
#939=EDGE_CURVE('',#1147,#1145,#1148,.T.);
#940=EDGE_CURVE('',#1105,#1147,#1149,.T.);
#941=EDGE_CURVE('',#1150,#1078,#1151,.T.);
#942=EDGE_CURVE('',#1074,#1150,#1152,.T.);
#943=FILL_AREA_STYLE('',(#1153));
#944=EDGE_CURVE('',#1154,#1109,#1155,.T.);
#945=EDGE_CURVE('',#1156,#1154,#1157,.T.);
#946=EDGE_CURVE('',#1158,#1156,#1159,.T.);
#947=EDGE_CURVE('',#1160,#1158,#1161,.T.);
#948=EDGE_CURVE('',#1162,#1160,#1163,.T.);
#949=EDGE_CURVE('',#1164,#1162,#1165,.T.);
#950=EDGE_CURVE('',#1166,#1164,#1167,.T.);
#951=EDGE_CURVE('',#1113,#1166,#1168,.T.);
#952=FILL_AREA_STYLE('',(#1169));
#953=EDGE_CURVE('',#1096,#1170,#1171,.T.);
#954=EDGE_CURVE('',#1170,#1094,#1172,.T.);
#955=FILL_AREA_STYLE('',(#1173));
#956=EDGE_CURVE('',#1092,#1133,#1174,.T.);
#957=EDGE_CURVE('',#1131,#1175,#1176,.T.);
#958=EDGE_CURVE('',#1091,#1175,#1177,.T.);
#959=FILL_AREA_STYLE('',(#1178));
#960=EDGE_CURVE('',#1175,#1129,#1179,.T.);
#961=FILL_AREA_STYLE('',(#1180));
#962=EDGE_CURVE('',#1087,#1083,#1181,.T.);
#963=EDGE_CURVE('',#1182,#1085,#1183,.T.);
#964=EDGE_CURVE('',#1082,#1182,#1184,.T.);
#965=FILL_AREA_STYLE('',(#1185));
#966=EDGE_CURVE('',#1186,#1147,#1187,.T.);
#967=EDGE_CURVE('',#1186,#1098,#1188,.T.);
#968=EDGE_CURVE('',#1121,#1170,#1189,.T.);
#969=FILL_AREA_STYLE('',(#1190));
#970=EDGE_CURVE('',#1073,#1076,#1191,.T.);
#971=FILL_AREA_STYLE('',(#1192));
#972=EDGE_CURVE('',#1193,#1175,#1194,.T.);
#973=EDGE_CURVE('',#1195,#1193,#1196,.T.);
#974=EDGE_CURVE('',#1197,#1195,#1198,.T.);
#975=EDGE_CURVE('',#1199,#1197,#1200,.T.);
#976=EDGE_CURVE('',#1201,#1199,#1202,.T.);
#977=EDGE_CURVE('',#1203,#1201,#1204,.T.);
#978=EDGE_CURVE('',#1205,#1203,#1206,.T.);
#979=EDGE_CURVE('',#1094,#1205,#1207,.T.);
#980=FILL_AREA_STYLE('',(#1208));
#981=EDGE_CURVE('',#1069,#1065,#1209,.T.);
#982=EDGE_CURVE('',#1064,#1067,#1210,.T.);
#983=FILL_AREA_STYLE('',(#1211));
#984=FILL_AREA_STYLE('',(#1212));
#985=EDGE_CURVE('',#1060,#1056,#1213,.T.);
#986=EDGE_CURVE('',#1055,#1058,#1214,.T.);
#987=FILL_AREA_STYLE('',(#1215));
#988=FILL_AREA_STYLE('',(#1216));
#989=EDGE_CURVE('',#1217,#1218,#1219,.T.);
#990=EDGE_CURVE('',#1220,#1217,#1221,.T.);
#991=EDGE_CURVE('',#1222,#1220,#1223,.T.);
#992=EDGE_CURVE('',#1224,#1222,#1225,.T.);
#993=EDGE_CURVE('',#1218,#1224,#1226,.T.);
#994=FILL_AREA_STYLE('',(#1227));
#995=EDGE_CURVE('',#1228,#1229,#1230,.T.);
#996=EDGE_CURVE('',#1224,#1228,#1231,.T.);
#997=EDGE_CURVE('',#1229,#1222,#1232,.T.);
#998=FILL_AREA_STYLE('',(#1233));
#999=EDGE_CURVE('',#1228,#1234,#1235,.T.);
#1000=EDGE_CURVE('',#1141,#1234,#1236,.T.);
#1001=EDGE_CURVE('',#1135,#1237,#1238,.T.);
#1002=EDGE_CURVE('',#1239,#1237,#1240,.T.);
#1003=EDGE_CURVE('',#1239,#1241,#1242,.T.);
#1004=EDGE_CURVE('',#1241,#1243,#1244,.T.);
#1005=EDGE_CURVE('',#1243,#1245,#1246,.T.);
#1006=EDGE_CURVE('',#1245,#1197,#1247,.T.);
#1007=EDGE_CURVE('',#1195,#1164,#1248,.T.);
#1008=EDGE_CURVE('',#1162,#1218,#1249,.T.);
#1009=FILL_AREA_STYLE('',(#1250));
#1010=EDGE_CURVE('',#1251,#1229,#1252,.T.);
#1011=EDGE_CURVE('',#1253,#1251,#1254,.T.);
#1012=EDGE_CURVE('',#1234,#1253,#1255,.T.);
#1013=FILL_AREA_STYLE('',(#1256));
#1014=EDGE_CURVE('',#1158,#1220,#1257,.T.);
#1015=EDGE_CURVE('',#1156,#1203,#1258,.T.);
#1016=EDGE_CURVE('',#1259,#1201,#1260,.T.);
#1017=EDGE_CURVE('',#1259,#1261,#1262,.T.);
#1018=EDGE_CURVE('',#1261,#1263,#1264,.T.);
#1019=EDGE_CURVE('',#1263,#1265,#1266,.T.);
#1020=EDGE_CURVE('',#1265,#1267,#1268,.T.);
#1021=EDGE_CURVE('',#1267,#1186,#1269,.T.);
#1022=EDGE_CURVE('',#1145,#1251,#1270,.T.);
#1023=FILL_AREA_STYLE('',(#1271));
#1024=EDGE_CURVE('',#1245,#1272,#1273,.T.);
#1025=EDGE_CURVE('',#1243,#1261,#1274,.T.);
#1026=EDGE_CURVE('',#1272,#1259,#1275,.T.);
#1027=FILL_AREA_STYLE('',(#1276));
#1028=EDGE_CURVE('',#1263,#1241,#1277,.T.);
#1029=FILL_AREA_STYLE('',(#1278));
#1030=EDGE_CURVE('',#1272,#1199,#1279,.T.);
#1031=FILL_AREA_STYLE('',(#1280));
#1032=FILL_AREA_STYLE('',(#1281));
#1033=EDGE_CURVE('',#1282,#1267,#1283,.T.);
#1034=EDGE_CURVE('',#1237,#1282,#1284,.T.);
#1035=FILL_AREA_STYLE('',(#1285));
#1036=EDGE_CURVE('',#1265,#1286,#1287,.T.);
#1037=EDGE_CURVE('',#1286,#1282,#1288,.T.);
#1038=FILL_AREA_STYLE('',(#1289));
#1039=EDGE_CURVE('',#1143,#1253,#1290,.T.);
#1040=FILL_AREA_STYLE('',(#1291));
#1041=EDGE_CURVE('',#1286,#1239,#1292,.T.);
#1042=FILL_AREA_STYLE('',(#1293));
#1043=FILL_AREA_STYLE('',(#1294));
#1044=EDGE_CURVE('',#1166,#1193,#1295,.T.);
#1045=FILL_AREA_STYLE('',(#1296));
#1046=FILL_AREA_STYLE('',(#1297));
#1047=EDGE_CURVE('',#1205,#1154,#1298,.T.);
#1048=FILL_AREA_STYLE('',(#1299));
#1049=FILL_AREA_STYLE('',(#1300));
#1050=EDGE_CURVE('',#1160,#1217,#1301,.T.);
#1051=FILL_AREA_STYLE('',(#1302));
#1052=FILL_AREA_STYLE('',(#1303));
#1053=FILL_AREA_STYLE('',(#1304));
#1054=FILL_AREA_STYLE_COLOUR('',#1305);
#1055=VERTEX_POINT('',#1306);
#1056=VERTEX_POINT('',#1307);
#1057=LINE('',#1308,#1309);
#1058=VERTEX_POINT('',#1310);
#1059=CIRCLE('',#1311,3.0);
#1060=VERTEX_POINT('',#1312);
#1061=LINE('',#1313,#1314);
#1062=CIRCLE('',#1315,3.0);
#1063=FILL_AREA_STYLE_COLOUR('',#1316);
#1064=VERTEX_POINT('',#1317);
#1065=VERTEX_POINT('',#1318);
#1066=LINE('',#1319,#1320);
#1067=VERTEX_POINT('',#1321);
#1068=CIRCLE('',#1322,3.0);
#1069=VERTEX_POINT('',#1323);
#1070=LINE('',#1324,#1325);
#1071=CIRCLE('',#1326,3.0);
#1072=FILL_AREA_STYLE_COLOUR('',#1327);
#1073=VERTEX_POINT('',#1328);
#1074=VERTEX_POINT('',#1329);
#1075=LINE('',#1330,#1331);
#1076=VERTEX_POINT('',#1332);
#1077=CIRCLE('',#1333,3.05);
#1078=VERTEX_POINT('',#1334);
#1079=LINE('',#1335,#1336);
#1080=CIRCLE('',#1337,3.05);
#1081=FILL_AREA_STYLE_COLOUR('',#1338);
#1082=VERTEX_POINT('',#1339);
#1083=VERTEX_POINT('',#1340);
#1084=LINE('',#1341,#1342);
#1085=VERTEX_POINT('',#1343);
#1086=CIRCLE('',#1344,3.05);
#1087=VERTEX_POINT('',#1345);
#1088=LINE('',#1346,#1347);
#1089=CIRCLE('',#1348,3.05);
#1090=FILL_AREA_STYLE_COLOUR('',#1349);
#1091=VERTEX_POINT('',#1350);
#1092=VERTEX_POINT('',#1351);
#1093=LINE('',#1352,#1353);
#1094=VERTEX_POINT('',#1354);
#1095=CIRCLE('',#1355,7.7);
#1096=VERTEX_POINT('',#1356);
#1097=CIRCLE('',#1357,7.7);
#1098=VERTEX_POINT('',#1358);
#1099=LINE('',#1359,#1360);
#1100=CIRCLE('',#1361,7.7);
#1101=FILL_AREA_STYLE_COLOUR('',#1362);
#1102=VERTEX_POINT('',#1363);
#1103=VERTEX_POINT('',#1364);
#1104=LINE('',#1365,#1366);
#1105=VERTEX_POINT('',#1367);
#1106=CIRCLE('',#1368,7.7);
#1107=VERTEX_POINT('',#1369);
#1108=LINE('',#1370,#1371);
#1109=VERTEX_POINT('',#1372);
#1110=CIRCLE('',#1373,7.7);
#1111=CIRCLE('',#1374,7.7);
#1112=FILL_AREA_STYLE_COLOUR('',#1375);
#1113=VERTEX_POINT('',#1376);
#1114=CIRCLE('',#1377,7.7);
#1115=VERTEX_POINT('',#1378);
#1116=CIRCLE('',#1379,7.7);
#1117=VERTEX_POINT('',#1380);
#1118=LINE('',#1381,#1382);
#1119=CIRCLE('',#1383,7.7);
#1120=FILL_AREA_STYLE_COLOUR('',#1384);
#1121=VERTEX_POINT('',#1385);
#1122=LINE('',#1386,#1387);
#1123=LINE('',#1388,#1389);
#1124=FILL_AREA_STYLE_COLOUR('',#1390);
#1125=VERTEX_POINT('',#1391);
#1126=LINE('',#1392,#1393);
#1127=LINE('',#1394,#1395);
#1128=FILL_AREA_STYLE_COLOUR('',#1396);
#1129=VERTEX_POINT('',#1397);
#1130=LINE('',#1398,#1399);
#1131=VERTEX_POINT('',#1400);
#1132=LINE('',#1401,#1402);
#1133=VERTEX_POINT('',#1403);
#1134=LINE('',#1404,#1405);
#1135=VERTEX_POINT('',#1406);
#1136=LINE('',#1407,#1408);
#1137=VERTEX_POINT('',#1409);
#1138=LINE('',#1410,#1411);
#1139=LINE('',#1412,#1413);
#1140=FILL_AREA_STYLE_COLOUR('',#1414);
#1141=VERTEX_POINT('',#1415);
#1142=LINE('',#1416,#1417);
#1143=VERTEX_POINT('',#1418);
#1144=CIRCLE('',#1419,7.50000000000001);
#1145=VERTEX_POINT('',#1420);
#1146=CIRCLE('',#1421,7.5);
#1147=VERTEX_POINT('',#1422);
#1148=LINE('',#1423,#1424);
#1149=LINE('',#1425,#1426);
#1150=VERTEX_POINT('',#1427);
#1151=CIRCLE('',#1428,3.05);
#1152=CIRCLE('',#1429,3.05);
#1153=FILL_AREA_STYLE_COLOUR('',#1430);
#1154=VERTEX_POINT('',#1431);
#1155=LINE('',#1432,#1433);
#1156=VERTEX_POINT('',#1434);
#1157=LINE('',#1435,#1436);
#1158=VERTEX_POINT('',#1437);
#1159=LINE('',#1438,#1439);
#1160=VERTEX_POINT('',#1440);
#1161=CIRCLE('',#1441,7.5);
#1162=VERTEX_POINT('',#1442);
#1163=CIRCLE('',#1443,7.5);
#1164=VERTEX_POINT('',#1444);
#1165=LINE('',#1445,#1446);
#1166=VERTEX_POINT('',#1447);
#1167=LINE('',#1448,#1449);
#1168=LINE('',#1450,#1451);
#1169=FILL_AREA_STYLE_COLOUR('',#1452);
#1170=VERTEX_POINT('',#1453);
#1171=LINE('',#1454,#1455);
#1172=LINE('',#1456,#1457);
#1173=FILL_AREA_STYLE_COLOUR('',#1458);
#1174=CIRCLE('',#1459,7.7);
#1175=VERTEX_POINT('',#1460);
#1176=CIRCLE('',#1461,7.7);
#1177=CIRCLE('',#1462,7.7);
#1178=FILL_AREA_STYLE_COLOUR('',#1463);
#1179=LINE('',#1464,#1465);
#1180=FILL_AREA_STYLE_COLOUR('',#1466);
#1181=CIRCLE('',#1467,3.05);
#1182=VERTEX_POINT('',#1468);
#1183=CIRCLE('',#1469,3.05);
#1184=CIRCLE('',#1470,3.05);
#1185=FILL_AREA_STYLE_COLOUR('',#1471);
#1186=VERTEX_POINT('',#1472);
#1187=LINE('',#1473,#1474);
#1188=LINE('',#1475,#1476);
#1189=LINE('',#1477,#1478);
#1190=FILL_AREA_STYLE_COLOUR('',#1479);
#1191=CIRCLE('',#1480,3.05);
#1192=FILL_AREA_STYLE_COLOUR('',#1481);
#1193=VERTEX_POINT('',#1482);
#1194=LINE('',#1483,#1484);
#1195=VERTEX_POINT('',#1485);
#1196=LINE('',#1486,#1487);
#1197=VERTEX_POINT('',#1488);
#1198=LINE('',#1489,#1490);
#1199=VERTEX_POINT('',#1491);
#1200=CIRCLE('',#1492,7.5);
#1201=VERTEX_POINT('',#1493);
#1202=CIRCLE('',#1494,7.5);
#1203=VERTEX_POINT('',#1495);
#1204=LINE('',#1496,#1497);
#1205=VERTEX_POINT('',#1498);
#1206=LINE('',#1499,#1500);
#1207=LINE('',#1501,#1502);
#1208=FILL_AREA_STYLE_COLOUR('',#1503);
#1209=CIRCLE('',#1504,3.0);
#1210=CIRCLE('',#1505,3.0);
#1211=FILL_AREA_STYLE_COLOUR('',#1506);
#1212=FILL_AREA_STYLE_COLOUR('',#1507);
#1213=CIRCLE('',#1508,3.0);
#1214=CIRCLE('',#1509,3.0);
#1215=FILL_AREA_STYLE_COLOUR('',#1510);
#1216=FILL_AREA_STYLE_COLOUR('',#1511);
#1217=VERTEX_POINT('',#1512);
#1218=VERTEX_POINT('',#1513);
#1219=CIRCLE('',#1514,7.5);
#1220=VERTEX_POINT('',#1515);
#1221=CIRCLE('',#1516,7.5);
#1222=VERTEX_POINT('',#1517);
#1223=LINE('',#1518,#1519);
#1224=VERTEX_POINT('',#1520);
#1225=LINE('',#1521,#1522);
#1226=LINE('',#1523,#1524);
#1227=FILL_AREA_STYLE_COLOUR('',#1525);
#1228=VERTEX_POINT('',#1526);
#1229=VERTEX_POINT('',#1527);
#1230=LINE('',#1528,#1529);
#1231=LINE('',#1530,#1531);
#1232=LINE('',#1532,#1533);
#1233=FILL_AREA_STYLE_COLOUR('',#1534);
#1234=VERTEX_POINT('',#1535);
#1235=LINE('',#1536,#1537);
#1236=LINE('',#1538,#1539);
#1237=VERTEX_POINT('',#1540);
#1238=LINE('',#1541,#1542);
#1239=VERTEX_POINT('',#1543);
#1240=LINE('',#1544,#1545);
#1241=VERTEX_POINT('',#1546);
#1242=LINE('',#1547,#1548);
#1243=VERTEX_POINT('',#1549);
#1244=LINE('',#1550,#1551);
#1245=VERTEX_POINT('',#1552);
#1246=LINE('',#1553,#1554);
#1247=LINE('',#1555,#1556);
#1248=LINE('',#1557,#1558);
#1249=LINE('',#1559,#1560);
#1250=FILL_AREA_STYLE_COLOUR('',#1561);
#1251=VERTEX_POINT('',#1562);
#1252=LINE('',#1563,#1564);
#1253=VERTEX_POINT('',#1565);
#1254=CIRCLE('',#1566,7.5);
#1255=CIRCLE('',#1567,7.50000000000001);
#1256=FILL_AREA_STYLE_COLOUR('',#1568);
#1257=LINE('',#1569,#1570);
#1258=LINE('',#1571,#1572);
#1259=VERTEX_POINT('',#1573);
#1260=LINE('',#1574,#1575);
#1261=VERTEX_POINT('',#1576);
#1262=LINE('',#1577,#1578);
#1263=VERTEX_POINT('',#1579);
#1264=LINE('',#1580,#1581);
#1265=VERTEX_POINT('',#1582);
#1266=LINE('',#1583,#1584);
#1267=VERTEX_POINT('',#1585);
#1268=LINE('',#1586,#1587);
#1269=LINE('',#1588,#1589);
#1270=LINE('',#1590,#1591);
#1271=FILL_AREA_STYLE_COLOUR('',#1592);
#1272=VERTEX_POINT('',#1593);
#1273=CIRCLE('',#1594,7.5);
#1274=LINE('',#1595,#1596);
#1275=CIRCLE('',#1597,7.5);
#1276=FILL_AREA_STYLE_COLOUR('',#1598);
#1277=LINE('',#1599,#1600);
#1278=FILL_AREA_STYLE_COLOUR('',#1601);
#1279=LINE('',#1602,#1603);
#1280=FILL_AREA_STYLE_COLOUR('',#1604);
#1281=FILL_AREA_STYLE_COLOUR('',#1605);
#1282=VERTEX_POINT('',#1606);
#1283=CIRCLE('',#1607,7.5);
#1284=CIRCLE('',#1608,7.50000000000001);
#1285=FILL_AREA_STYLE_COLOUR('',#1609);
#1286=VERTEX_POINT('',#1610);
#1287=CIRCLE('',#1611,7.5);
#1288=LINE('',#1612,#1613);
#1289=FILL_AREA_STYLE_COLOUR('',#1614);
#1290=LINE('',#1615,#1616);
#1291=FILL_AREA_STYLE_COLOUR('',#1617);
#1292=CIRCLE('',#1618,7.50000000000001);
#1293=FILL_AREA_STYLE_COLOUR('',#1619);
#1294=FILL_AREA_STYLE_COLOUR('',#1620);
#1295=LINE('',#1621,#1622);
#1296=FILL_AREA_STYLE_COLOUR('',#1623);
#1297=FILL_AREA_STYLE_COLOUR('',#1624);
#1298=LINE('',#1625,#1626);
#1299=FILL_AREA_STYLE_COLOUR('',#1627);
#1300=FILL_AREA_STYLE_COLOUR('',#1628);
#1301=LINE('',#1629,#1630);
#1302=FILL_AREA_STYLE_COLOUR('',#1631);
#1303=FILL_AREA_STYLE_COLOUR('',#1632);
#1304=FILL_AREA_STYLE_COLOUR('',#1633);
#1305=COLOUR_RGB('',0.501960813999176,0.501960813999176,0.501960813999176);
#1306=CARTESIAN_POINT('',(-23.0,21.75,0.0));
#1307=CARTESIAN_POINT('',(-23.0,23.5,0.0));
#1308=CARTESIAN_POINT('',(-23.0,22.625,-3.67381906146713E-016));
#1309=VECTOR('',#1634,1.0);
#1310=CARTESIAN_POINT('',(-17.0,21.75,3.67381906146713E-016));
#1311=AXIS2_PLACEMENT_3D('',#1635,#1636,#1637);
#1312=CARTESIAN_POINT('',(-17.0,23.5,3.67381906146713E-016));
#1313=CARTESIAN_POINT('',(-17.0,22.625,3.67381906146713E-016));
#1314=VECTOR('',#1638,1.0);
#1315=AXIS2_PLACEMENT_3D('',#1639,#1640,#1641);
#1316=COLOUR_RGB('',0.501960813999176,0.501960813999176,0.501960813999176);
#1317=CARTESIAN_POINT('',(-23.0,-3.5,0.0));
#1318=CARTESIAN_POINT('',(-23.0,-1.75,0.0));
#1319=CARTESIAN_POINT('',(-23.0,-2.625,-3.67381906146713E-016));
#1320=VECTOR('',#1642,1.0);
#1321=CARTESIAN_POINT('',(-17.0,-3.5,3.67381906146713E-016));
#1322=AXIS2_PLACEMENT_3D('',#1643,#1644,#1645);
#1323=CARTESIAN_POINT('',(-17.0,-1.75,3.67381906146713E-016));
#1324=CARTESIAN_POINT('',(-17.0,-2.625,3.67381906146713E-016));
#1325=VECTOR('',#1646,1.0);
#1326=AXIS2_PLACEMENT_3D('',#1647,#1648,#1649);
#1327=COLOUR_RGB('',0.501960813999176,0.501960813999176,0.501960813999176);
#1328=CARTESIAN_POINT('',(-3.05,23.5,0.0));
#1329=CARTESIAN_POINT('',(-3.05,21.75,-3.73504937915825E-016));
#1330=CARTESIAN_POINT('',(-3.05,22.625,-3.73504937915825E-016));
#1331=VECTOR('',#1650,1.0);
#1332=CARTESIAN_POINT('',(3.05,23.5,3.73504937915825E-016));
#1333=AXIS2_PLACEMENT_3D('',#1651,#1652,#1653);
#1334=CARTESIAN_POINT('',(3.05,21.75,3.73504937915825E-016));
#1335=CARTESIAN_POINT('',(3.05,22.625,3.73504937915825E-016));
#1336=VECTOR('',#1654,1.0);
#1337=AXIS2_PLACEMENT_3D('',#1655,#1656,#1657);
#1338=COLOUR_RGB('',0.501960813999176,0.501960813999176,0.501960813999176);
#1339=CARTESIAN_POINT('',(-3.05,-1.75,-3.73504937915825E-016));
#1340=CARTESIAN_POINT('',(-3.05,-3.5,0.0));
#1341=CARTESIAN_POINT('',(-3.05,-2.625,-3.73504937915825E-016));
#1342=VECTOR('',#1658,1.0);
#1343=CARTESIAN_POINT('',(3.05,-1.75,3.73504937915825E-016));
#1344=AXIS2_PLACEMENT_3D('',#1659,#1660,#1661);
#1345=CARTESIAN_POINT('',(3.05,-3.5,3.73504937915825E-016));
#1346=CARTESIAN_POINT('',(3.05,-2.625,3.73504937915825E-016));
#1347=VECTOR('',#1662,1.0);
#1348=AXIS2_PLACEMENT_3D('',#1663,#1664,#1665);
#1349=COLOUR_RGB('',0.501960813999176,0.501960813999176,0.501960813999176);
#1350=CARTESIAN_POINT('',(-7.7,0.0,-9.4294689244323E-016));
#1351=CARTESIAN_POINT('',(-7.7,-1.75,-9.4294689244323E-016));
#1352=CARTESIAN_POINT('',(-7.7,-0.875,-9.4294689244323E-016));
#1353=VECTOR('',#1666,1.0);
#1354=CARTESIAN_POINT('',(-5.53782448259242,0.0,5.35));
#1355=AXIS2_PLACEMENT_3D('',#1667,#1668,#1669);
#1356=CARTESIAN_POINT('',(-2.5,0.0,7.28285658241325));
#1357=AXIS2_PLACEMENT_3D('',#1670,#1671,#1672);
#1358=CARTESIAN_POINT('',(-2.5,-1.75,7.28285658241325));
#1359=CARTESIAN_POINT('',(-2.5,-0.875,7.28285658241325));
#1360=VECTOR('',#1673,1.0);
#1361=AXIS2_PLACEMENT_3D('',#1674,#1675,#1676);
#1362=COLOUR_RGB('',0.501960813999176,0.501960813999176,0.501960813999176);
#1363=CARTESIAN_POINT('',(-7.7,21.75,-9.42946892443231E-016));
#1364=CARTESIAN_POINT('',(-7.7,20.0,-9.42946892443231E-016));
#1365=CARTESIAN_POINT('',(-7.7,20.875,-9.42946892443231E-016));
#1366=VECTOR('',#1677,1.0);
#1367=CARTESIAN_POINT('',(-2.5,21.75,7.28285658241325));
#1368=AXIS2_PLACEMENT_3D('',#1678,#1679,#1680);
#1369=CARTESIAN_POINT('',(-2.5,20.0,7.28285658241325));
#1370=CARTESIAN_POINT('',(-2.5,20.875,7.28285658241325));
#1371=VECTOR('',#1681,1.0);
#1372=CARTESIAN_POINT('',(-5.53782448259242,20.0,5.35));
#1373=AXIS2_PLACEMENT_3D('',#1682,#1683,#1684);
#1374=AXIS2_PLACEMENT_3D('',#1685,#1686,#1687);
#1375=COLOUR_RGB('',0.501960813999176,0.501960813999176,0.501960813999176);
#1376=CARTESIAN_POINT('',(-5.53782448259242,20.0,-5.35));
#1377=AXIS2_PLACEMENT_3D('',#1688,#1689,#1690);
#1378=CARTESIAN_POINT('',(-2.5,20.0,-7.28285658241325));
#1379=AXIS2_PLACEMENT_3D('',#1691,#1692,#1693);
#1380=CARTESIAN_POINT('',(-2.5,21.75,-7.28285658241325));
#1381=CARTESIAN_POINT('',(-2.5,20.875,-7.28285658241325));
#1382=VECTOR('',#1694,1.0);
#1383=AXIS2_PLACEMENT_3D('',#1695,#1696,#1697);
#1384=COLOUR_RGB('',0.501960813999176,0.501960813999176,0.501960813999176);
#1385=CARTESIAN_POINT('',(-2.5,20.0,5.35));
#1386=CARTESIAN_POINT('',(-2.5,20.0,0.0));
#1387=VECTOR('',#1698,1.0);
#1388=CARTESIAN_POINT('',(-12.5,20.0,5.35));
#1389=VECTOR('',#1699,1.0);
#1390=COLOUR_RGB('',0.501960813999176,0.501960813999176,0.501960813999176);
#1391=CARTESIAN_POINT('',(-2.5,20.0,-5.35));
#1392=CARTESIAN_POINT('',(-2.5,20.0,0.0));
#1393=VECTOR('',#1700,1.0);
#1394=CARTESIAN_POINT('',(-12.5,20.0,-5.35));
#1395=VECTOR('',#1701,1.0);
#1396=COLOUR_RGB('',0.501960813999176,0.501960813999176,0.501960813999176);
#1397=CARTESIAN_POINT('',(-2.5,0.0,-5.35));
#1398=CARTESIAN_POINT('',(-2.5,10.0,-5.35));
#1399=VECTOR('',#1702,1.0);
#1400=CARTESIAN_POINT('',(-2.5,0.0,-7.28285658241325));
#1401=CARTESIAN_POINT('',(-2.5,0.0,0.0));
#1402=VECTOR('',#1703,1.0);
#1403=CARTESIAN_POINT('',(-2.5,-1.75,-7.28285658241325));
#1404=CARTESIAN_POINT('',(-2.5,-0.875,-7.28285658241325));
#1405=VECTOR('',#1704,1.0);
#1406=CARTESIAN_POINT('',(-2.5,-1.75,-7.5));
#1407=CARTESIAN_POINT('',(-2.5,-1.75,0.0));
#1408=VECTOR('',#1705,1.0);
#1409=CARTESIAN_POINT('',(-2.5,21.75,-7.5));
#1410=CARTESIAN_POINT('',(-2.5,3.25,-7.5));
#1411=VECTOR('',#1706,1.0);
#1412=CARTESIAN_POINT('',(-2.5,21.75,0.0));
#1413=VECTOR('',#1707,1.0);
#1414=COLOUR_RGB('',0.501960813999176,0.501960813999176,0.501960813999176);
#1415=CARTESIAN_POINT('',(-0.349999999995276,21.75,-7.4999999999));
#1416=CARTESIAN_POINT('',(2.325,21.75,-7.5));
#1417=VECTOR('',#1708,1.0);
#1418=CARTESIAN_POINT('',(7.1499999999,21.75,4.72179366190357E-012));
#1419=AXIS2_PLACEMENT_3D('',#1709,#1710,#1711);
#1420=CARTESIAN_POINT('',(-0.350000000000001,21.75,7.5));
#1421=AXIS2_PLACEMENT_3D('',#1712,#1713,#1714);
#1422=CARTESIAN_POINT('',(-2.5,21.75,7.5));
#1423=CARTESIAN_POINT('',(2.32499999999882,21.75,7.5));
#1424=VECTOR('',#1715,1.0);
#1425=CARTESIAN_POINT('',(-2.5,21.75,0.0));
#1426=VECTOR('',#1716,1.0);
#1427=CARTESIAN_POINT('',(-2.5,21.75,-1.74714052096562));
#1428=AXIS2_PLACEMENT_3D('',#1717,#1718,#1719);
#1429=AXIS2_PLACEMENT_3D('',#1720,#1721,#1722);
#1430=COLOUR_RGB('',0.501960813999176,0.501960813999176,0.501960813999176);
#1431=CARTESIAN_POINT('',(-17.5,20.0,5.35));
#1432=CARTESIAN_POINT('',(-12.5,20.0,5.35));
#1433=VECTOR('',#1723,1.0);
#1434=CARTESIAN_POINT('',(-17.5,20.0,7.5));
#1435=CARTESIAN_POINT('',(-17.5,20.0,0.0));
#1436=VECTOR('',#1724,1.0);
#1437=CARTESIAN_POINT('',(-19.6499999999,20.0,7.5));
#1438=CARTESIAN_POINT('',(-22.3250000000012,20.0,7.5));
#1439=VECTOR('',#1725,1.0);
#1440=CARTESIAN_POINT('',(-27.1499999999,20.0,-4.72545739788486E-012));
#1441=AXIS2_PLACEMENT_3D('',#1726,#1727,#1728);
#1442=CARTESIAN_POINT('',(-19.6500000000047,20.0,-7.4999999999));
#1443=AXIS2_PLACEMENT_3D('',#1729,#1730,#1731);
#1444=CARTESIAN_POINT('',(-17.5,20.0,-7.5));
#1445=CARTESIAN_POINT('',(-22.325,20.0,-7.5));
#1446=VECTOR('',#1732,1.0);
#1447=CARTESIAN_POINT('',(-17.5,20.0,-5.35));
#1448=CARTESIAN_POINT('',(-17.5,20.0,0.0));
#1449=VECTOR('',#1733,1.0);
#1450=CARTESIAN_POINT('',(-12.5,20.0,-5.35));
#1451=VECTOR('',#1734,1.0);
#1452=COLOUR_RGB('',0.501960813999176,0.501960813999176,0.501960813999176);
#1453=CARTESIAN_POINT('',(-2.5,0.0,5.35));
#1454=CARTESIAN_POINT('',(-2.5,0.0,0.0));
#1455=VECTOR('',#1735,1.0);
#1456=CARTESIAN_POINT('',(-12.5,0.0,5.35));
#1457=VECTOR('',#1736,1.0);
#1458=COLOUR_RGB('',0.501960813999176,0.501960813999176,0.501960813999176);
#1459=AXIS2_PLACEMENT_3D('',#1737,#1738,#1739);
#1460=CARTESIAN_POINT('',(-5.53782448259242,0.0,-5.35));
#1461=AXIS2_PLACEMENT_3D('',#1740,#1741,#1742);
#1462=AXIS2_PLACEMENT_3D('',#1743,#1744,#1745);
#1463=COLOUR_RGB('',0.501960813999176,0.501960813999176,0.501960813999176);
#1464=CARTESIAN_POINT('',(-12.5,0.0,-5.35));
#1465=VECTOR('',#1746,1.0);
#1466=COLOUR_RGB('',0.501960813999176,0.501960813999176,0.501960813999176);
#1467=AXIS2_PLACEMENT_3D('',#1747,#1748,#1749);
#1468=CARTESIAN_POINT('',(-2.5,-1.75,-1.74714052096562));
#1469=AXIS2_PLACEMENT_3D('',#1750,#1751,#1752);
#1470=AXIS2_PLACEMENT_3D('',#1753,#1754,#1755);
#1471=COLOUR_RGB('',0.501960813999176,0.501960813999176,0.501960813999176);
#1472=CARTESIAN_POINT('',(-2.5,-1.75,7.5));
#1473=CARTESIAN_POINT('',(-2.5,3.25,7.5));
#1474=VECTOR('',#1756,1.0);
#1475=CARTESIAN_POINT('',(-2.5,-1.75,0.0));
#1476=VECTOR('',#1757,1.0);
#1477=CARTESIAN_POINT('',(-2.5,10.0,5.35));
#1478=VECTOR('',#1758,1.0);
#1479=COLOUR_RGB('',0.501960813999176,0.501960813999176,0.501960813999176);
#1480=AXIS2_PLACEMENT_3D('',#1759,#1760,#1761);
#1481=COLOUR_RGB('',0.501960813999176,0.501960813999176,0.501960813999176);
#1482=CARTESIAN_POINT('',(-17.5,0.0,-5.35));
#1483=CARTESIAN_POINT('',(-12.5,0.0,-5.35));
#1484=VECTOR('',#1762,1.0);
#1485=CARTESIAN_POINT('',(-17.5,0.0,-7.5));
#1486=CARTESIAN_POINT('',(-17.5,0.0,0.0));
#1487=VECTOR('',#1763,1.0);
#1488=CARTESIAN_POINT('',(-19.6500000000047,0.0,-7.4999999999));
#1489=CARTESIAN_POINT('',(-22.325,0.0,-7.5));
#1490=VECTOR('',#1764,1.0);
#1491=CARTESIAN_POINT('',(-27.1499999999,0.0,-4.72545739788486E-012));
#1492=AXIS2_PLACEMENT_3D('',#1765,#1766,#1767);
#1493=CARTESIAN_POINT('',(-19.6499999999,0.0,7.5));
#1494=AXIS2_PLACEMENT_3D('',#1768,#1769,#1770);
#1495=CARTESIAN_POINT('',(-17.5,0.0,7.5));
#1496=CARTESIAN_POINT('',(-22.3250000000012,0.0,7.5));
#1497=VECTOR('',#1771,1.0);
#1498=CARTESIAN_POINT('',(-17.5,0.0,5.35));
#1499=CARTESIAN_POINT('',(-17.5,0.0,0.0));
#1500=VECTOR('',#1772,1.0);
#1501=CARTESIAN_POINT('',(-12.5,0.0,5.35));
#1502=VECTOR('',#1773,1.0);
#1503=COLOUR_RGB('',0.501960813999176,0.501960813999176,0.501960813999176);
#1504=AXIS2_PLACEMENT_3D('',#1774,#1775,#1776);
#1505=AXIS2_PLACEMENT_3D('',#1777,#1778,#1779);
#1506=COLOUR_RGB('',0.501960813999176,0.501960813999176,0.501960813999176);
#1507=COLOUR_RGB('',0.501960813999176,0.501960813999176,0.501960813999176);
#1508=AXIS2_PLACEMENT_3D('',#1780,#1781,#1782);
#1509=AXIS2_PLACEMENT_3D('',#1783,#1784,#1785);
#1510=COLOUR_RGB('',0.501960813999176,0.501960813999176,0.501960813999176);
#1511=COLOUR_RGB('',0.501960813999176,0.501960813999176,0.501960813999176);
#1512=CARTESIAN_POINT('',(-27.1499999999,21.75,-4.72545739788486E-012));
#1513=CARTESIAN_POINT('',(-19.6499999999,21.75,-7.5));
#1514=AXIS2_PLACEMENT_3D('',#1786,#1787,#1788);
#1515=CARTESIAN_POINT('',(-19.6499999999,21.75,7.5));
#1516=AXIS2_PLACEMENT_3D('',#1789,#1790,#1791);
#1517=CARTESIAN_POINT('',(-11.5,21.75,7.5));
#1518=CARTESIAN_POINT('',(-19.3250000000012,21.75,7.5));
#1519=VECTOR('',#1792,1.0);
#1520=CARTESIAN_POINT('',(-11.5,21.75,-7.5));
#1521=CARTESIAN_POINT('',(-11.5,21.75,0.0));
#1522=VECTOR('',#1793,1.0);
#1523=CARTESIAN_POINT('',(-19.325,21.75,-7.5));
#1524=VECTOR('',#1794,1.0);
#1525=COLOUR_RGB('',0.501960813999176,0.501960813999176,0.501960813999176);
#1526=CARTESIAN_POINT('',(-11.5,23.5,-7.5));
#1527=CARTESIAN_POINT('',(-11.5,23.5,7.5));
#1528=CARTESIAN_POINT('',(-11.5,23.5,-9.99200722162641E-015));
#1529=VECTOR('',#1795,1.0);
#1530=CARTESIAN_POINT('',(-11.5,9.5625,-7.5));
#1531=VECTOR('',#1796,1.0);
#1532=CARTESIAN_POINT('',(-11.5,9.5625,7.5));
#1533=VECTOR('',#1797,1.0);
#1534=COLOUR_RGB('',0.501960813999176,0.501960813999176,0.501960813999176);
#1535=CARTESIAN_POINT('',(-0.349999999995276,23.5,-7.4999999999));
#1536=CARTESIAN_POINT('',(-0.350000000000001,23.5,-7.5));
#1537=VECTOR('',#1798,1.0);
#1538=CARTESIAN_POINT('',(-0.349999999995276,-3.5,-7.4999999999));
#1539=VECTOR('',#1799,1.0);
#1540=CARTESIAN_POINT('',(-0.349999999995276,-1.75,-7.4999999999));
#1541=CARTESIAN_POINT('',(2.325,-1.75,-7.5));
#1542=VECTOR('',#1800,1.0);
#1543=CARTESIAN_POINT('',(-0.349999999995276,-3.5,-7.4999999999));
#1544=CARTESIAN_POINT('',(-0.349999999995276,-3.5,-7.4999999999));
#1545=VECTOR('',#1801,1.0);
#1546=CARTESIAN_POINT('',(-11.5,-3.5,-7.5));
#1547=CARTESIAN_POINT('',(-0.350000000000001,-3.5,-7.5));
#1548=VECTOR('',#1802,1.0);
#1549=CARTESIAN_POINT('',(-11.5,-1.75,-7.5));
#1550=CARTESIAN_POINT('',(-11.5,-3.0625,-7.5));
#1551=VECTOR('',#1803,1.0);
#1552=CARTESIAN_POINT('',(-19.6499999999,-1.75,-7.5));
#1553=CARTESIAN_POINT('',(-19.325,-1.75,-7.5));
#1554=VECTOR('',#1804,1.0);
#1555=CARTESIAN_POINT('',(-19.6500000000047,-3.5,-7.4999999999));
#1556=VECTOR('',#1805,1.0);
#1557=CARTESIAN_POINT('',(-17.5,3.25,-7.5));
#1558=VECTOR('',#1806,1.0);
#1559=CARTESIAN_POINT('',(-19.6500000000047,-3.5,-7.4999999999));
#1560=VECTOR('',#1807,1.0);
#1561=COLOUR_RGB('',0.501960813999176,0.501960813999176,0.501960813999176);
#1562=CARTESIAN_POINT('',(-0.350000000000001,23.5,7.5));
#1563=CARTESIAN_POINT('',(-19.65,23.5,7.5));
#1564=VECTOR('',#1808,1.0);
#1565=CARTESIAN_POINT('',(7.1499999999,23.5,4.72179366190357E-012));
#1566=AXIS2_PLACEMENT_3D('',#1809,#1810,#1811);
#1567=AXIS2_PLACEMENT_3D('',#1812,#1813,#1814);
#1568=COLOUR_RGB('',0.501960813999176,0.501960813999176,0.501960813999176);
#1569=CARTESIAN_POINT('',(-19.6500000000047,-3.5,7.4999999999));
#1570=VECTOR('',#1815,1.0);
#1571=CARTESIAN_POINT('',(-17.5,3.25,7.5));
#1572=VECTOR('',#1816,1.0);
#1573=CARTESIAN_POINT('',(-19.6499999999,-1.75,7.5));
#1574=CARTESIAN_POINT('',(-19.6500000000047,-3.5,7.4999999999));
#1575=VECTOR('',#1817,1.0);
#1576=CARTESIAN_POINT('',(-11.5,-1.75,7.5));
#1577=CARTESIAN_POINT('',(-19.3250000000012,-1.75,7.5));
#1578=VECTOR('',#1818,1.0);
#1579=CARTESIAN_POINT('',(-11.5,-3.5,7.5));
#1580=CARTESIAN_POINT('',(-11.5,-3.0625,7.5));
#1581=VECTOR('',#1819,1.0);
#1582=CARTESIAN_POINT('',(-0.350000000000001,-3.5,7.5));
#1583=CARTESIAN_POINT('',(-19.65,-3.5,7.5));
#1584=VECTOR('',#1820,1.0);
#1585=CARTESIAN_POINT('',(-0.350000000000001,-1.75,7.5));
#1586=CARTESIAN_POINT('',(-0.350000000000001,-3.5,7.5));
#1587=VECTOR('',#1821,1.0);
#1588=CARTESIAN_POINT('',(2.32499999999882,-1.75,7.5));
#1589=VECTOR('',#1822,1.0);
#1590=CARTESIAN_POINT('',(-0.350000000000001,-3.5,7.5));
#1591=VECTOR('',#1823,1.0);
#1592=COLOUR_RGB('',0.501960813999176,0.501960813999176,0.501960813999176);
#1593=CARTESIAN_POINT('',(-27.1499999999,-1.75,-4.72545739788486E-012));
#1594=AXIS2_PLACEMENT_3D('',#1824,#1825,#1826);
#1595=CARTESIAN_POINT('',(-11.5,-1.75,0.0));
#1596=VECTOR('',#1827,1.0);
#1597=AXIS2_PLACEMENT_3D('',#1828,#1829,#1830);
#1598=COLOUR_RGB('',0.501960813999176,0.501960813999176,0.501960813999176);
#1599=CARTESIAN_POINT('',(-11.5,-3.5,-1.02140518265514E-014));
#1600=VECTOR('',#1831,1.0);
#1601=COLOUR_RGB('',0.501960813999176,0.501960813999176,0.501960813999176);
#1602=CARTESIAN_POINT('',(-27.1499999999,-3.5,-4.72545739788486E-012));
#1603=VECTOR('',#1832,1.0);
#1604=COLOUR_RGB('',0.501960813999176,0.501960813999176,0.501960813999176);
#1605=COLOUR_RGB('',0.501960813999176,0.501960813999176,0.501960813999176);
#1606=CARTESIAN_POINT('',(7.1499999999,-1.75,4.72179366190357E-012));
#1607=AXIS2_PLACEMENT_3D('',#1833,#1834,#1835);
#1608=AXIS2_PLACEMENT_3D('',#1836,#1837,#1838);
#1609=COLOUR_RGB('',0.501960813999176,0.501960813999176,0.501960813999176);
#1610=CARTESIAN_POINT('',(7.1499999999,-3.5,4.72179366190357E-012));
#1611=AXIS2_PLACEMENT_3D('',#1839,#1840,#1841);
#1612=CARTESIAN_POINT('',(7.1499999999,-3.5,4.72179366190357E-012));
#1613=VECTOR('',#1842,1.0);
#1614=COLOUR_RGB('',0.501960813999176,0.501960813999176,0.501960813999176);
#1615=CARTESIAN_POINT('',(7.1499999999,-3.5,4.72179366190357E-012));
#1616=VECTOR('',#1843,1.0);
#1617=COLOUR_RGB('',0.501960813999176,0.501960813999176,0.501960813999176);
#1618=AXIS2_PLACEMENT_3D('',#1844,#1845,#1846);
#1619=COLOUR_RGB('',0.501960813999176,0.501960813999176,0.501960813999176);
#1620=COLOUR_RGB('',0.501960813999176,0.501960813999176,0.501960813999176);
#1621=CARTESIAN_POINT('',(-17.5,10.0,-5.35));
#1622=VECTOR('',#1847,1.0);
#1623=COLOUR_RGB('',0.501960813999176,0.501960813999176,0.501960813999176);
#1624=COLOUR_RGB('',0.501960813999176,0.501960813999176,0.501960813999176);
#1625=CARTESIAN_POINT('',(-17.5,10.0,5.35));
#1626=VECTOR('',#1848,1.0);
#1627=COLOUR_RGB('',0.501960813999176,0.501960813999176,0.501960813999176);
#1628=COLOUR_RGB('',0.501960813999176,0.501960813999176,0.501960813999176);
#1629=CARTESIAN_POINT('',(-27.1499999999,-3.5,-4.72545739788486E-012));
#1630=VECTOR('',#1849,1.0);
#1631=COLOUR_RGB('',0.501960813999176,0.501960813999176,0.501960813999176);
#1632=COLOUR_RGB('',0.501960813999176,0.501960813999176,0.501960813999176);
#1633=COLOUR_RGB('',0.501960813999176,0.501960813999176,0.501960813999176);
#1634=DIRECTION('',(0.0,1.0,0.0));
#1635=CARTESIAN_POINT('',(-20.0,21.75,0.0));
#1636=DIRECTION('',(-0.0,-1.0,-0.0));
#1637=DIRECTION('',(-1.0,0.0,0.0));
#1638=DIRECTION('',(-0.0,-1.0,-0.0));
#1639=CARTESIAN_POINT('',(-20.0,23.5,0.0));
#1640=DIRECTION('',(0.0,1.0,0.0));
#1641=DIRECTION('',(-1.0,0.0,0.0));
#1642=DIRECTION('',(0.0,1.0,0.0));
#1643=CARTESIAN_POINT('',(-20.0,-3.5,0.0));
#1644=DIRECTION('',(0.0,-1.0,0.0));
#1645=DIRECTION('',(-1.0,0.0,0.0));
#1646=DIRECTION('',(-0.0,-1.0,-0.0));
#1647=CARTESIAN_POINT('',(-20.0,-1.75,0.0));
#1648=DIRECTION('',(0.0,1.0,-0.0));
#1649=DIRECTION('',(-1.0,0.0,0.0));
#1650=DIRECTION('',(0.0,-1.0,0.0));
#1651=CARTESIAN_POINT('',(0.0,23.5,0.0));
#1652=DIRECTION('',(-0.0,-1.0,-0.0));
#1653=DIRECTION('',(-1.0,0.0,0.0));
#1654=DIRECTION('',(0.0,1.0,0.0));
#1655=CARTESIAN_POINT('',(0.0,21.75,0.0));
#1656=DIRECTION('',(-0.0,-1.0,-0.0));
#1657=DIRECTION('',(-1.0,0.0,0.0));
#1658=DIRECTION('',(0.0,-1.0,0.0));
#1659=CARTESIAN_POINT('',(0.0,-1.75,0.0));
#1660=DIRECTION('',(-0.0,-1.0,-0.0));
#1661=DIRECTION('',(-1.0,0.0,0.0));
#1662=DIRECTION('',(0.0,1.0,0.0));
#1663=CARTESIAN_POINT('',(0.0,-3.5,0.0));
#1664=DIRECTION('',(0.0,1.0,0.0));
#1665=DIRECTION('',(-1.0,0.0,0.0));
#1666=DIRECTION('',(0.0,-1.0,0.0));
#1667=CARTESIAN_POINT('',(0.0,0.0,0.0));
#1668=DIRECTION('',(-0.0,-1.0,-0.0));
#1669=DIRECTION('',(-1.0,0.0,0.0));
#1670=CARTESIAN_POINT('',(0.0,0.0,0.0));
#1671=DIRECTION('',(0.0,1.0,0.0));
#1672=DIRECTION('',(-1.0,0.0,0.0));
#1673=DIRECTION('',(0.0,1.0,0.0));
#1674=CARTESIAN_POINT('',(0.0,-1.75,0.0));
#1675=DIRECTION('',(0.0,-1.0,0.0));
#1676=DIRECTION('',(-1.0,0.0,0.0));
#1677=DIRECTION('',(0.0,-1.0,0.0));
#1678=CARTESIAN_POINT('',(0.0,21.75,0.0));
#1679=DIRECTION('',(0.0,1.0,0.0));
#1680=DIRECTION('',(-1.0,0.0,0.0));
#1681=DIRECTION('',(0.0,1.0,0.0));
#1682=CARTESIAN_POINT('',(0.0,20.0,0.0));
#1683=DIRECTION('',(0.0,-1.0,0.0));
#1684=DIRECTION('',(-1.0,0.0,0.0));
#1685=CARTESIAN_POINT('',(0.0,20.0,0.0));
#1686=DIRECTION('',(0.0,1.0,0.0));
#1687=DIRECTION('',(-1.0,0.0,0.0));
#1688=CARTESIAN_POINT('',(0.0,20.0,0.0));
#1689=DIRECTION('',(0.0,1.0,0.0));
#1690=DIRECTION('',(-1.0,0.0,0.0));
#1691=CARTESIAN_POINT('',(0.0,20.0,0.0));
#1692=DIRECTION('',(0.0,-1.0,0.0));
#1693=DIRECTION('',(-1.0,0.0,0.0));
#1694=DIRECTION('',(-0.0,-1.0,-0.0));
#1695=CARTESIAN_POINT('',(0.0,21.75,0.0));
#1696=DIRECTION('',(0.0,1.0,0.0));
#1697=DIRECTION('',(-1.0,0.0,0.0));
#1698=DIRECTION('',(-0.0,0.0,1.0));
#1699=DIRECTION('',(1.0,0.0,0.0));
#1700=DIRECTION('',(-0.0,0.0,1.0));
#1701=DIRECTION('',(-1.0,0.0,0.0));
#1702=DIRECTION('',(0.0,1.0,0.0));
#1703=DIRECTION('',(0.0,0.0,-1.0));
#1704=DIRECTION('',(-0.0,-1.0,-0.0));
#1705=DIRECTION('',(0.0,0.0,-1.0));
#1706=DIRECTION('',(0.0,-1.0,0.0));
#1707=DIRECTION('',(0.0,0.0,1.0));
#1708=DIRECTION('',(-1.0,0.0,0.0));
#1709=CARTESIAN_POINT('',(-0.35000000010001,21.75,1.00007717636794E-010));
#1710=DIRECTION('',(0.0,1.0,0.0));
#1711=DIRECTION('',(1.0,0.0,-1.39630713112453E-011));
#1712=CARTESIAN_POINT('',(-0.350000000099996,21.75,-9.99982319171977E-011));
#1713=DIRECTION('',(-0.0,1.0,0.0));
#1714=DIRECTION('',(1.3962164757686E-011,0.0,1.0));
#1715=DIRECTION('',(1.0,0.0,0.0));
#1716=DIRECTION('',(0.0,0.0,1.0));
#1717=CARTESIAN_POINT('',(0.0,21.75,0.0));
#1718=DIRECTION('',(-0.0,-1.0,-0.0));
#1719=DIRECTION('',(-1.0,0.0,0.0));
#1720=CARTESIAN_POINT('',(0.0,21.75,0.0));
#1721=DIRECTION('',(-0.0,-1.0,-0.0));
#1722=DIRECTION('',(-1.0,0.0,0.0));
#1723=DIRECTION('',(1.0,0.0,0.0));
#1724=DIRECTION('',(0.0,0.0,-1.0));
#1725=DIRECTION('',(1.0,0.0,0.0));
#1726=CARTESIAN_POINT('',(-19.6499999999,20.0,-9.99977369804511E-011));
#1727=DIRECTION('',(0.0,1.0,0.0));
#1728=DIRECTION('',(-1.0,0.0,1.39623322800148E-011));
#1729=CARTESIAN_POINT('',(-19.6499999999,20.0,9.99991200956174E-011));
#1730=DIRECTION('',(0.0,1.0,0.0));
#1731=DIRECTION('',(-1.39628901033954E-011,0.0,-1.0));
#1732=DIRECTION('',(-1.0,0.0,0.0));
#1733=DIRECTION('',(0.0,0.0,-1.0));
#1734=DIRECTION('',(-1.0,0.0,0.0));
#1735=DIRECTION('',(0.0,0.0,-1.0));
#1736=DIRECTION('',(-1.0,0.0,0.0));
#1737=CARTESIAN_POINT('',(0.0,-1.75,0.0));
#1738=DIRECTION('',(0.0,-1.0,0.0));
#1739=DIRECTION('',(-1.0,0.0,0.0));
#1740=CARTESIAN_POINT('',(0.0,0.0,0.0));
#1741=DIRECTION('',(0.0,1.0,0.0));
#1742=DIRECTION('',(-1.0,0.0,0.0));
#1743=CARTESIAN_POINT('',(0.0,0.0,0.0));
#1744=DIRECTION('',(-0.0,-1.0,-0.0));
#1745=DIRECTION('',(-1.0,0.0,0.0));
#1746=DIRECTION('',(1.0,0.0,0.0));
#1747=CARTESIAN_POINT('',(0.0,-3.5,0.0));
#1748=DIRECTION('',(0.0,1.0,0.0));
#1749=DIRECTION('',(-1.0,0.0,0.0));
#1750=CARTESIAN_POINT('',(0.0,-1.75,0.0));
#1751=DIRECTION('',(-0.0,-1.0,-0.0));
#1752=DIRECTION('',(-1.0,0.0,0.0));
#1753=CARTESIAN_POINT('',(0.0,-1.75,0.0));
#1754=DIRECTION('',(-0.0,-1.0,-0.0));
#1755=DIRECTION('',(-1.0,0.0,0.0));
#1756=DIRECTION('',(0.0,1.0,0.0));
#1757=DIRECTION('',(0.0,0.0,-1.0));
#1758=DIRECTION('',(0.0,-1.0,0.0));
#1759=CARTESIAN_POINT('',(0.0,23.5,0.0));
#1760=DIRECTION('',(-0.0,-1.0,-0.0));
#1761=DIRECTION('',(-1.0,0.0,0.0));
#1762=DIRECTION('',(1.0,0.0,0.0));
#1763=DIRECTION('',(0.0,0.0,1.0));
#1764=DIRECTION('',(1.0,-0.0,0.0));
#1765=CARTESIAN_POINT('',(-19.6499999999,0.0,9.99991200956174E-011));
#1766=DIRECTION('',(0.0,-1.0,-0.0));
#1767=DIRECTION('',(-1.39628901033954E-011,0.0,-1.0));
#1768=CARTESIAN_POINT('',(-19.6499999999,0.0,-9.99977369804511E-011));
#1769=DIRECTION('',(-0.0,-1.0,0.0));
#1770=DIRECTION('',(-1.0,0.0,1.39623322800148E-011));
#1771=DIRECTION('',(-1.0,0.0,0.0));
#1772=DIRECTION('',(0.0,0.0,1.0));
#1773=DIRECTION('',(-1.0,0.0,0.0));
#1774=CARTESIAN_POINT('',(-20.0,-1.75,0.0));
#1775=DIRECTION('',(0.0,1.0,-0.0));
#1776=DIRECTION('',(-1.0,0.0,0.0));
#1777=CARTESIAN_POINT('',(-20.0,-3.5,0.0));
#1778=DIRECTION('',(0.0,-1.0,0.0));
#1779=DIRECTION('',(-1.0,0.0,0.0));
#1780=CARTESIAN_POINT('',(-20.0,23.5,0.0));
#1781=DIRECTION('',(0.0,1.0,0.0));
#1782=DIRECTION('',(-1.0,0.0,0.0));
#1783=CARTESIAN_POINT('',(-20.0,21.75,0.0));
#1784=DIRECTION('',(-0.0,-1.0,-0.0));
#1785=DIRECTION('',(-1.0,0.0,0.0));
#1786=CARTESIAN_POINT('',(-19.6499999999,21.75,9.99991200956174E-011));
#1787=DIRECTION('',(0.0,-1.0,-0.0));
#1788=DIRECTION('',(-1.39628901033954E-011,0.0,-1.0));
#1789=CARTESIAN_POINT('',(-19.6499999999,21.75,-9.99977369804511E-011));
#1790=DIRECTION('',(-0.0,-1.0,0.0));
#1791=DIRECTION('',(-1.0,0.0,1.39623322800148E-011));
#1792=DIRECTION('',(-1.0,0.0,0.0));
#1793=DIRECTION('',(0.0,0.0,1.0));
#1794=DIRECTION('',(1.0,-0.0,0.0));
#1795=DIRECTION('',(0.0,-0.0,1.0));
#1796=DIRECTION('',(0.0,1.0,0.0));
#1797=DIRECTION('',(0.0,-1.0,0.0));
#1798=DIRECTION('',(1.0,-0.0,0.0));
#1799=DIRECTION('',(0.0,1.0,0.0));
#1800=DIRECTION('',(1.0,-0.0,0.0));
#1801=DIRECTION('',(0.0,1.0,0.0));
#1802=DIRECTION('',(-1.0,0.0,0.0));
#1803=DIRECTION('',(0.0,1.0,0.0));
#1804=DIRECTION('',(-1.0,-0.0,-0.0));
#1805=DIRECTION('',(0.0,1.0,0.0));
#1806=DIRECTION('',(0.0,1.0,0.0));
#1807=DIRECTION('',(0.0,1.0,0.0));
#1808=DIRECTION('',(-1.0,0.0,0.0));
#1809=CARTESIAN_POINT('',(-0.350000000099996,23.5,-9.99982319171977E-011));
#1810=DIRECTION('',(0.0,-1.0,0.0));
#1811=DIRECTION('',(1.3962164757686E-011,0.0,1.0));
#1812=CARTESIAN_POINT('',(-0.35000000010001,23.5,1.00007717636794E-010));
#1813=DIRECTION('',(0.0,-1.0,0.0));
#1814=DIRECTION('',(1.0,0.0,-1.39630713112453E-011));
#1815=DIRECTION('',(0.0,1.0,0.0));
#1816=DIRECTION('',(0.0,-1.0,0.0));
#1817=DIRECTION('',(0.0,1.0,0.0));
#1818=DIRECTION('',(1.0,0.0,-0.0));
#1819=DIRECTION('',(0.0,-1.0,0.0));
#1820=DIRECTION('',(1.0,0.0,0.0));
#1821=DIRECTION('',(0.0,1.0,0.0));
#1822=DIRECTION('',(-1.0,0.0,0.0));
#1823=DIRECTION('',(0.0,1.0,0.0));
#1824=CARTESIAN_POINT('',(-19.6499999999,-1.75,9.99991200956174E-011));
#1825=DIRECTION('',(0.0,1.0,0.0));
#1826=DIRECTION('',(-1.39628901033954E-011,0.0,-1.0));
#1827=DIRECTION('',(0.0,0.0,1.0));
#1828=CARTESIAN_POINT('',(-19.6499999999,-1.75,-9.99977369804511E-011));
#1829=DIRECTION('',(0.0,1.0,-0.0));
#1830=DIRECTION('',(-1.0,0.0,1.39623322800148E-011));
#1831=DIRECTION('',(0.0,0.0,-1.0));
#1832=DIRECTION('',(0.0,1.0,0.0));
#1833=CARTESIAN_POINT('',(-0.350000000099996,-1.75,-9.99982319171977E-011));
#1834=DIRECTION('',(0.0,-1.0,0.0));
#1835=DIRECTION('',(1.3962164757686E-011,0.0,1.0));
#1836=CARTESIAN_POINT('',(-0.35000000010001,-1.75,1.00007717636794E-010));
#1837=DIRECTION('',(0.0,-1.0,-0.0));
#1838=DIRECTION('',(1.0,0.0,-1.39630713112453E-011));
#1839=CARTESIAN_POINT('',(-0.350000000099996,-3.5,-9.99982319171977E-011));
#1840=DIRECTION('',(-0.0,1.0,0.0));
#1841=DIRECTION('',(1.3962164757686E-011,0.0,1.0));
#1842=DIRECTION('',(0.0,1.0,0.0));
#1843=DIRECTION('',(0.0,1.0,0.0));
#1844=CARTESIAN_POINT('',(-0.35000000010001,-3.5,1.00007717636794E-010));
#1845=DIRECTION('',(0.0,1.0,0.0));
#1846=DIRECTION('',(1.0,0.0,-1.39630713112453E-011));
#1847=DIRECTION('',(0.0,-1.0,0.0));
#1848=DIRECTION('',(0.0,1.0,0.0));
#1849=DIRECTION('',(0.0,1.0,0.0));
ENDSEC;
END-ISO-10303-21;
