{
    "id": "lulzbot_gladiator_evergreen_bagworm",
    "name": "TAZ ProXT Dual Extruder",
    "inherits": "lulzbot_gladiator_base",
    "version": 2,
    "metadata":
    {
        "type": "machine",
        "visible": true,
        "priority": "01",
        "machine_extruder_trains":
        {
            "0": "lulzbot_gladiator_evergreen_bagowrm_1st",
            "1": "lulzbot_gladiator_evergreen_bagworm_2nd"
        },
        "platform": "gladiator_bed.stl",
        "platform_offset":
        [
            0,
            -25,
            0
        ],
        "category": "LulzBot",
        "firmware_toolhead_name": "DualExtruder",
        "firmware_last_version": "2.0.0.144.5",
        "base_machine": "LulzBot TAZ ProXT",
        "base_machine_name": "TAZ Pro XT",
        "preferred_material": "*PolyLite_PLA*",
        "user_toolhead_name": "Pro Dual | 0.50 mm | Hardened SST",
        "toolhead_info_link": "https://www.lulzbot.com/store/tool-heads?pk_campaign=software-cura",
        "default_category": "All"
    },
    "overrides":
    {
        "machine_name":
        {
            "default_value": "LulzBot ProXT"
        },
        "machine_start_gcode":
        {
            "default_value_from_file": "lulzbot_gladiator_evergreen_bagworm_start"
        },
        "machine_end_gcode":
        {
            "default_value_from_file": "lulzbot_gladiator_evergreen_bagworm_end"
        },
        "machine_level_x_axis_gcode":
        {
            "default_value_from_file": "lulzbot_gladiator_level_x_axis"
        },
        "machine_extruder_count": {
            "default_value": 2
        },
        "machine_width":
        {
            "default_value": 282
        },
        "machine_depth":
        {
            "default_value": 282
        },
        "machine_height":
        {
            "default_value": 586
        },
        "machine_wipe_gcode":
        {
            "default_value_from_file": "lulzbot_quiver_evergreen_bagworm_wipe"
        },
        "layer_start_x": { "value": "100" },
        "layer_start_y": { "value": "100" }
    }
}
