{
    "id": "LulzBot_TAZ6_aerostruder",
    "name": "TAZ 6 Aerostruder",
    "inherits": "lulzbot_taz6",
    "version": 2,
    "metadata":
    {
        "priority": "08",
        "machine_extruder_trains":
        {
            "0": "lulzbot_taz6_aerostruder_extruder"
        },
        "type": "machine",
        "visible": true,
        "user_toolhead_name": "Aerostruder v1",
        "toolhead_info_link": "https://www.lulzbot.com/store/tool-heads/lulzbot-taz-aerostruder-tool-head?pk_campaign=software-cura",
        "firmware_toolhead_name": "Aerostruder",
        "firmware_last_version": "1.1.9.34"
    },
    "overrides":
    {
        "machine_name":
        {
            "default_value": "LulzBot TAZ 6 Aerostruder"
        },
        "machine_start_gcode":
        {
            "default_value_from_file": "lulzbot_taz6_aerostruder_start"
        },
        "machine_end_gcode":
        {
            "default_value_from_file": "lulzbot_taz6_end"
        }
    }
}
