{
    "id": "LulzBot_Hibiscus_Achemon",
    "name": "LulzBot Mini 2 | SL | 0.25 mm",
    "inherits": "lulzbot_hibiscus",
    "version": 2,
    "metadata":
    {
        "priority": "01",
        "machine_extruder_trains":
        {
            "0": "lulzbot_hibiscus_achemon_extruder"
        },
        "type": "machine",
        "platform": "lulzbot_mini.stl",
        "platform_offset":
        [
            -100,
            -11,
            100
        ],
        "preferred_material": "*PolyLite_PLA*",
        "preferred_quality": "*High Detail*",
        "file_formats": "text/x-gcode",
        "visible": true,
        "printer_info_link": "https://www.lulzbot.com/store/printers/",
        "toolhead_info_link": "https://www.lulzbot.com/store/tool-heads/",
        "base_machine": "lulzbot_hibiscus",
        "user_toolhead_name": "SL | 0.25 mm | Nickel Plated Copper",
        "default_extrusion_rate": 60
    },
    "overrides":
    {
        "machine_start_gcode":
        {
            "default_value_from_file": "lulzbot_hibiscus_achemon_start"
        },
        "machine_end_gcode":
        {
            "default_value_from_file": "lulzbot_hibiscus_end"
        },
        "machine_wipe_gcode":
        {
            "default_value_from_file": "lulzbot_hibiscus_wipe"
        },
        "machine_level_x_axis_gcode":
        {
            "default_value_from_file": "lulzbot_hibiscus_level_x_axis"
        },
        "firmware_machine_type":
        {
            "default_value": "LulzBot Mini 2"
        }
    }
}
