{
    "version": 2,
    "name": "AST285",
    "inherits": "galaxy_extruder",
    "metadata":
    {
        "machine": "taz_pro_xt_lb_ast285"
    },
    "overrides":
    {
        "machine_nozzle_size": { "default_value": 1.2 }
    }
}