{
    "version": 2,
    "name": "TAZ Workhorse+ | MET285",
    "inherits": "taz_workhorse_galaxy",
    "metadata":
    {
        "priority": "01",
        "visible": true,
        "base_machine": false,
        "toolhead_selection_name": "METEOR 285 | Nickel-Plated Brass",
        "machine_extruder_trains":
        {
            "0": "taz_workhorse_met285_extruder"
        }
    },
    "overrides":
    {
        "machine_name": { "default_value": "LulzBot TAZ Workhorse | MET285" }
    }
}
