{
    "name": "TAZ 5",
    "inherits": "taz",
    "version": 2,
    "metadata":
    {
        "visible": false,
        "machine_priority": "02",
        "base_machine": true,
        "base_machine_id": "taz_5",
        "machine_category": "Legacy",
        "toolhead_category": "",
        "platform": "bed_plates/labeled/taz_5_labeled.stl",
        "platform_offset":
        [
            0,
            -17.6,
            0
        ],
        "firmware_latest_version": "1.1.9.34"
    },
    "overrides":
    {
        "machine_name": { "default_value": "LulzBot TAZ 5" },
        "machine_width": { "default_value": 290 },
        "machine_depth": { "default_value": 275 },
        "machine_height": { "default_value": 250 },
        "machine_max_feedrate_z": { "default_value": 3 },
        "machine_start_gcode": { "default_value_from_file": "taz_5/taz_5_start" },
        "machine_end_gcode": { "default_value_from_file": "taz_5/taz_5_end" },
        "firmware_machine_type": { "default_value": "LulzBot TAZ 5" },
        "machine_acceleration": { "default_value": 500 },
        "acceleration_print": { "default_value": 500 },
        "acceleration_travel": { "default_value": 500 }
    }
}
