{
    "version": 2,
    "name": "Mini 1 | M175 | 0.50 mm",
    "inherits": "mini_1",
    "metadata":
    {
        "priority": "05",
        "visible": true,
        "base_machine": false,
        "toolhead_selection_name": "M175 | 0.50 mm | Carbide Coated Copper",
        "machine_extruder_trains":
        {
            "0": "mini_1_m175_extruder"
        },
        "firmware_toolhead_name": "lutefisk",
        "firmware_toolhead_name_no_lcd": "lutefisk",
        "firmware_latest_version": "2.0.0.144.1-LCD",
        "firmware_file": "Mini/Marlin_MiniLCD_M175_2.0.0.144.1_8c651988.hex",
        "firmware_no_lcd_latest_version": "2.0.0.144.1",
        "firmware_file_no_lcd": "Mini/Marlin_Mini_M175_2.0.0.144.1_8c651988.hex"
    },
    "overrides":
    {
        "machine_name": { "default_value": "LulzBot Mini 1 | M175" }
    }
}
