{
    "version": 2,
    "name": "TAZ Pro (S)",
    "inherits": "taz",
    "metadata":
    {
        "machine_priority": "00",
        "visible": false,
        "base_machine": true,
        "base_machine_id": "taz_pro",
        "toolhead_selection_name": "Universal Tool Head",
        "platform": "bed_plates/labeled/taz_pro_labeled.stl",
        "platform_offset":
        [
            0,
            -14.6,
            2
        ],
        "file_formats": "text/x-gcode",
        "has_optional_bltouch": true,
        "firmware_toolhead_name": "Legacy Universal",
        "firmware_latest_version": "2.1.3.0.29",
        "firmware_file": "Pro/Marlin_TAZPro_Universal_2.1.3.0.29_c1aa9fe.bin",
        "firmware_bltouch_latest_version": "2.1.3.0.29-BLTouch",
        "firmware_file_bltouch": "Pro/Marlin_TAZPro_Universal_BLTouch_2.1.3.0.29_c1aa9fe.bin"
    },
    "overrides":
    {
        "machine_name": { "default_value": "LulzBot TAZ Pro" },
        "machine_width": { "default_value": 285 },
        "machine_depth": { "default_value": 285 },
        "firmware_machine_type": { "default_value": "LulzBot TAZ Pro" },
        "machine_start_gcode": { "default_value_from_file": "taz_pro/taz_pro_universal_start" },
        "machine_end_gcode": { "default_value_from_file": "taz_pro/taz_pro_end" },
        "machine_level_x_axis_gcode": { "default_value_from_file": "taz_pro/taz_pro_level_x_axis" },
        "machine_wipe_gcode": { "default_value_from_file": "taz_pro/taz_pro_wipe" }
    }
}
