{
    "version": 2,
    "name": "MET175",
    "inherits": "galaxy_extruder",
    "metadata":
    {
        "machine": "taz_pro_xt_lb_met175"
    },
    "overrides":
    {
        "material_diameter": { "default_value": 1.75 }
    }
}