{
    "version": 2,
    "name": "SideKick 747",
    "inherits": "sidekick_747",
    "metadata":
    {
        "visible": false,
        "base_machine": false,
        "toolhead_category": "Galaxy",
        "toolhead_selection_name": "Galaxy Tool Head",
        "preferred_quality_type": "normal",
        "has_variants": true,
        "preferred_variant_name": "0.5 mm",
        "firmware_toolhead_name": "Galaxy Series",
        "firmware_latest_version": "2.1.3.0.27",
        "firmware_file": "747/Marlin_747_Galaxy_2.1.3.0.27_ed7bb14.hex",
        "has_optional_lcd": false
    },
    "overrides":
    {
        "cool_min_layer_time": { "value": 15 },
        "machine_start_gcode": { "default_value_from_file": "sidekick/sidekick_galaxy_start" },
        "speed_travel_layer_0": { "value": 100 }
    }
}
