{
    "version": 2,
    "name": "TAZ 5 | Single Extruder",
    "inherits": "taz_5",
    "metadata":
    {
        "priority": "00",
        "visible": true,
        "base_machine": false,
        "toolhead_selection_name": "Single Extruder",
        "machine_extruder_trains":
        {
            "0": "taz_5_single_extruder"
        },
        "firmware_toolhead_name": "SingleExtruder",
        "firmware_file": "TAZ5/Marlin_TAZ5_SingleExtruder_1.1.9.34_5f9c029d1.hex"
    },
    "overrides":
    {
        "machine_name": { "default_value": "LulzBot TAZ 5 | Single Extruder" }
    }
}
