{
    "version": 2,
    "name": "[DEV] TAZ Pro XT Long Bed | M175 v2 | 0.50 mm",
    "inherits": "taz_pro_xt_lb",
    "metadata":
    {
        "priority": "07",
        "visible": true,
        "base_machine": false,
        "toolhead_selection_name": "M175 v2 | 0.50 mm | Carbide Coated Copper",
        "machine_extruder_trains":
        {
            "0": "taz_pro_xt_lb_m175_extruder"
        }
    },
    "overrides":
    {
        "machine_name": { "default_value": "[DEV] LulzBot TAZ Pro XT Long Bed | M175 v2" }
    }
}
