{
    "version": 2,
    "name": "TAZ",
    "inherits": "lulzbot",
    "overrides":
    {
        "machine_width": { "default_value": 280 },
        "machine_depth": { "default_value": 280 },
        "machine_height": { "default_value": 285 },
        "machine_acceleration": { "default_value": 1000 },
        "acceleration_print": { "default_value": 1000 },
        "jerk_print": { "default_value": 12 },
        "jerk_travel": { "value": 12 },
        "prime_tower_position_x": { "default_value": 200 },
        "prime_tower_position_y": { "default_value": 200 }
    }
}
