{
    "version": 2,
    "name": "[DEV] TAZ Pro XT Long Bed | SE | 0.50 mm",
    "inherits": "taz_pro_xt_lb",
    "metadata":
    {
        "priority": "03",
        "visible": true,
        "base_machine": false,
        "toolhead_selection_name": "SE | 0.50 mm | Nickel-Plated Copper",
        "machine_extruder_trains":
        {
            "0": "taz_pro_xt_lb_se_extruder"
        }
    },
    "overrides":
    {
        "machine_name": { "default_value": "[DEV] LulzBot TAZ Pro XT Long Bed | SE" }
    }
}
