{
    "name": "TAZ 6 | Dual v2",
    "inherits": "taz_6",
    "version": 2,
    "metadata":
    {
        "base_machine": false,
        "visible": true,
        "priority": "10",
        "machine_extruder_trains":
        {
            "0": "taz_6_dual_v2_1st",
            "1": "taz_6_dual_v2_2nd"
        },
        "toolhead_selection_name": "Dual v2",
        "nozzle_offsetting_for_disallowed_areas": false,
        "firmware_toolhead_name": "DualExtruder v2",
        "firmware_latest_version": "1.1.9.34",
        "firmware_file": "TAZ6/Marlin_TAZ6_DualExtruderV2_1.1.9.34_5f9c029d1.hex"
    },
    "overrides":
    {
        "machine_name": { "default_value": "LulzBot TAZ 6 | Dual v2" },
        "machine_start_gcode": { "default_value_from_file": "taz_6/taz_6_dual_start" },
        "machine_end_gcode": { "default_value_from_file": "taz_6/taz_6_dual_end" },
        "machine_wipe_gcode": { "default_value": "" },
        "machine_extruder_count": { "default_value": 2 }
    }
}
