{
    "AcquisitionMatrixPE": 70,
    "AcquisitionNumber": 1,
    "AcquisitionTime": "08:49:36.392500",
    "BandwidthPerPixelPhaseEncode": 10.352,
    "BaseResolution": 70,
    "BodyPartExamined": "BRAIN",
    "CoilCombinationMethod": "Sum of Squares",
    "ConsistencyInfo": "N4_VD13D_LATEST_20130810",
    "ConversionSoftware": "dcm2niix",
    "ConversionSoftwareVersion": "v1.0.20211006",
    "DerivedVendorReportedEchoSpacing": 0.000689998,
    "DeviceSerialNumber": "66044",
    "DiffusionScheme": "Monopolar",
    "EchoTime": 0.0892,
    "EchoTrainLength": 52,
    "EffectiveEchoSpacing": 0.000689998,
    "FlipAngle": 78,
    "ImageOrientationPatientDICOM": [
        0.996215,
        -0.0738525,
        0.0458487,
        0.0863339,
        0.902106,
        -0.42279
    ],
    "ImageType": [
        "ORIGINAL",
        "PRIMARY",
        "DIFFUSION",
        "NONE",
        "MB",
        "ND",
        "MOSAIC"
    ],
    "ImagingFrequency": 123.255,
    "InPlanePhaseEncodingDirectionDICOM": "COL",
    "InstitutionName": "University of Pennsylvania",
    "MRAcquisitionType": "2D",
    "MagneticFieldStrength": 3,
    "Manufacturer": "Siemens",
    "ManufacturersModelName": "Prisma",
    "MatrixCoilMode": "SENSE",
    "Modality": "MR",
    "MultibandAccelerationFactor": 4,
    "PartialFourier": 0.75,
    "PatientPosition": "HFS",
    "PercentPhaseFOV": 100,
    "PercentSampling": 100,
    "PhaseEncodingDirection": "j-",
    "PhaseEncodingSteps": 52,
    "PhaseResolution": 1,
    "PixelBandwidth": 1700,
    "ProtocolName": "dMRI_dir98_AP",
    "PulseSequenceDetails": "%CustomerSeq%\\cmrr_mbep2d_diff",
    "ReceiveCoilActiveElements": "HC1-7",
    "ReceiveCoilName": "HeadNeck_64",
    "ReconMatrixPE": 140,
    "RepetitionTime": 3.23,
    "SAR": 0.1896,
    "ScanOptions": "PFP",
    "ScanningSequence": "EP",
    "SequenceName": "ep_b5#1",
    "SequenceVariant": "SK\\SS",
    "SeriesDescription": "dMRI_dir98_AP",
    "SeriesNumber": 20,
    "ShimSetting": [
        3803,
        2693,
        384,
        160,
        -47,
        -245,
        -164,
        -6
    ],
    "SliceThickness": 3.000,
    "SliceTiming": [
        0,
        1.6725,
        0.1375,
        1.8125,
        0.2775,
        1.9525,
        0.4175,
        2.0925,
        0.5575,
        2.2325,
        0.6975,
        2.3725,
        0.8375,
        2.51,
        0.975,
        2.65,
        1.115,
        2.79,
        1.255,
        2.93,
        1.395,
        3.07,
        1.535,
        0,
        1.6725,
        0.1375,
        1.8125,
        0.2775,
        1.9525,
        0.4175,
        2.0925,
        0.5575,
        2.2325,
        0.6975,
        2.3725,
        0.8375,
        2.51,
        0.975,
        2.65,
        1.115,
        2.79,
        1.255,
        2.93,
        1.395,
        3.07,
        1.535,
        0,
        1.6725,
        0.1375,
        1.8125,
        0.2775,
        1.9525,
        0.4175,
        2.0925,
        0.5575,
        2.2325,
        0.6975,
        2.3725,
        0.8375,
        2.51,
        0.975,
        2.65,
        1.115,
        2.79,
        1.255,
        2.93,
        1.395,
        3.07,
        1.535,
        0,
        1.6725,
        0.1375,
        1.8125,
        0.2775,
        1.9525,
        0.4175,
        2.0925,
        0.5575,
        2.2325,
        0.6975,
        2.3725,
        0.8375,
        2.51,
        0.975,
        2.65,
        1.115,
        2.79,
        1.255,
        2.93,
        1.395,
        3.07,
        1.535
    ],
    "SoftwareVersions": "syngo MR D13D",
    "SpacingBetweenSlices": 3.000,
    "StationName": "AWP66044",
    "TotalReadoutTime": 0.0959097,
    "TxRefAmp": 245.665,
    "WipMemBlock": "bc38a1df-b1a4-4296-ba3a-0b17d5316bc0||Sequence: vd13d/master r/0d08c20; Mar  9 2017 09:29:16 by eja"
}