{
  "classifierPath" : "meta::pure::metamodel::type::Enumeration",
  "content" : {
    "_type" : "Enumeration",
    "name" : "Country",
    "package" : "demo",
    "values" : [ {
      "value" : "UK"
    } ]
  }
}