{
  "artifactGenerations" : [ ],
  "artifactId" : "currencyrefdata",
  "groupId" : "org.finos.legend.gft",
  "metamodelDependencies" : [ ],
  "projectDependencies" : [ ],
  "projectId" : "UAT-27508002",
  "projectStructureVersion" : {
    "extensionVersion" : null,
    "version" : 0
  },
  "projectType" : "PROTOTYPE"
}