{
  "classifierPath" : "meta::pure::metamodel::type::Class",
  "content" : {
    "_type" : "class",
    "name" : "Security",
    "package" : "underliers::asset",
    "superTypes" : [ "underliers::asset::FinancialAsset" ]
  }
}