{
  "classifierPath" : "meta::pure::metamodel::diagram::Diagram",
  "content" : {
    "_type" : "diagram",
    "classViews" : [ {
      "class" : "underliers::Underlier",
      "id" : "58922f23-33e6-4a4f-aed0-62b4bd9f7266",
      "position" : {
        "x" : 315,
        "y" : 36
      },
      "rectangle" : {
        "height" : 142,
        "width" : 189.361328125
      }
    }, {
      "class" : "underliers::benchmarks::PriceBenchmark",
      "id" : "77a9f81f-f698-4ae9-b3d8-9bdc1df02f4d",
      "position" : {
        "x" : 160,
        "y" : 299
      },
      "rectangle" : {
        "height" : 30,
        "width" : 114.716796875
      }
    }, {
      "class" : "underliers::asset::FinancialAsset",
      "id" : "81500279-29ef-43d6-95f5-d7c6e66fb107",
      "position" : {
        "x" : 477.96533203125,
        "y" : 228.5
      },
      "rectangle" : {
        "height" : 30,
        "width" : 104.697265625
      }
    }, {
      "class" : "underliers::asset::Security",
      "id" : "82a24e13-d97f-4927-94f1-dce0e14ea7d5",
      "position" : {
        "x" : 594.96533203125,
        "y" : 278.5
      },
      "rectangle" : {
        "height" : 30,
        "width" : 67.35546875
      }
    }, {
      "class" : "underliers::asset::Metal",
      "id" : "9892c5f9-3efc-4b28-abb6-fd1c1b82a029",
      "position" : {
        "x" : 744.44533203125,
        "y" : 294.6
      },
      "rectangle" : {
        "height" : 30,
        "width" : 51.34765625
      }
    }, {
      "class" : "underliers::asset::Power",
      "id" : "df66ad70-b76d-4ba2-b133-e7f674309bac",
      "position" : {
        "x" : 844.28533203125,
        "y" : 294.6
      },
      "rectangle" : {
        "height" : 30,
        "width" : 56.01171875
      }
    }, {
      "class" : "underliers::asset::Commodity",
      "id" : "ec972619-8479-4099-ad89-e4eae1741722",
      "position" : {
        "x" : 730.96533203125,
        "y" : 224.5
      },
      "rectangle" : {
        "height" : 44,
        "width" : 115.94921875
      }
    }, {
      "class" : "underliers::benchmarks::FxPriceBenchmark",
      "id" : "ede51991-6d48-49ac-bc7a-5bad8206937f",
      "position" : {
        "x" : 259,
        "y" : 364
      },
      "rectangle" : {
        "height" : 44,
        "width" : 128.720703125
      }
    }, {
      "class" : "underliers::benchmarks::Benchmark",
      "id" : "dd64e564-203d-499c-a0e8-088ba8ab6433",
      "position" : {
        "x" : 159,
        "y" : 215
      },
      "rectangle" : {
        "height" : 58,
        "width" : 170.34228515625
      }
    }, {
      "class" : "underliers::benchmarks::CommodityPriceBenchmark",
      "id" : "a2c00a62-33a7-48d6-a82d-97acf7cdebc0",
      "position" : {
        "x" : 27,
        "y" : 368
      },
      "rectangle" : {
        "height" : 44,
        "width" : 204.63134765625
      }
    }, {
      "class" : "underliers::benchmarks::IsdaRefData",
      "id" : "33e0f4a1-21e9-46e2-843b-2e8196e01a82",
      "position" : {
        "x" : -29.688388671874918,
        "y" : 434.99838557059013
      },
      "rectangle" : {
        "height" : 86,
        "width" : 168.5322265625
      }
    }, {
      "class" : "underliers::benchmarks::Pair",
      "id" : "0a22bd83-a1a1-41f9-a003-21de79434626",
      "position" : {
        "x" : 234.2515050167225,
        "y" : 435.4555183946489
      },
      "rectangle" : {
        "height" : 48.46068956930816,
        "width" : 89.26010631140258
      }
    }, {
      "class" : "underliers::asset::Cash",
      "id" : "59ff02fc-ec2c-45fb-9a01-5e256affae3f",
      "position" : {
        "x" : 416.9753654760663,
        "y" : 457.03090301003334
      },
      "rectangle" : {
        "height" : 44,
        "width" : 154.44921875
      }
    }, {
      "class" : "underliers::Classification",
      "id" : "9fb673b5-359b-40ec-9e0f-b029a68ffe67",
      "position" : {
        "x" : 544.3116113281251,
        "y" : 77.99838557059013
      },
      "rectangle" : {
        "height" : 30,
        "width" : 98.0234375
      }
    }, {
      "class" : "underliers::ClassificationAsset",
      "id" : "faf03b67-cbba-4d37-8dc5-c6aba689877a",
      "position" : {
        "x" : 698.9674169921875,
        "y" : 11.499192785295065
      },
      "rectangle" : {
        "height" : 86,
        "width" : 157.53759765625
      }
    }, {
      "class" : "underliers::ClassificationVolker",
      "id" : "d7a5dbc0-d2ba-481f-9e1c-74bfb06562d6",
      "position" : {
        "x" : 709.9674169921875,
        "y" : 118.49919278529507
      },
      "rectangle" : {
        "height" : 44,
        "width" : 133.818359375
      }
    }, {
      "class" : "underliers::Identifiers",
      "id" : "3e00043c-4b73-45c7-9ee6-376c252b2065",
      "position" : {
        "x" : 38.96741699218751,
        "y" : 80.49919278529507
      },
      "rectangle" : {
        "height" : 58,
        "width" : 172.603515625
      }
    }, {
      "class" : "underliers::asset::Future",
      "id" : "36c0ddb5-8cf2-4701-a13b-87f4235f8eee",
      "position" : {
        "x" : 687.8583086198788,
        "y" : 378.82441471571906
      },
      "rectangle" : {
        "height" : 100,
        "width" : 194.216796875
      }
    } ],
    "generalizationViews" : [ {
      "line" : {
        "points" : [ {
          "x" : 243.8623046875,
          "y" : 244
        }, {
          "x" : 408.7568359375,
          "y" : 107
        } ]
      },
      "sourceView" : "dd64e564-203d-499c-a0e8-088ba8ab6433",
      "targetView" : "58922f23-33e6-4a4f-aed0-62b4bd9f7266"
    }, {
      "line" : {
        "points" : [ {
          "x" : 184.3408203125,
          "y" : 314
        }, {
          "x" : 243.8623046875,
          "y" : 244
        } ]
      },
      "sourceView" : "77a9f81f-f698-4ae9-b3d8-9bdc1df02f4d",
      "targetView" : "dd64e564-203d-499c-a0e8-088ba8ab6433"
    }, {
      "line" : {
        "points" : [ {
          "x" : 129.315673828125,
          "y" : 390
        }, {
          "x" : 184.3408203125,
          "y" : 314
        } ]
      },
      "sourceView" : "a2c00a62-33a7-48d6-a82d-97acf7cdebc0",
      "targetView" : "77a9f81f-f698-4ae9-b3d8-9bdc1df02f4d"
    }, {
      "line" : {
        "points" : [ {
          "x" : 300.794189453125,
          "y" : 386
        }, {
          "x" : 184.3408203125,
          "y" : 314
        } ]
      },
      "sourceView" : "ede51991-6d48-49ac-bc7a-5bad8206937f",
      "targetView" : "77a9f81f-f698-4ae9-b3d8-9bdc1df02f4d"
    }, {
      "line" : {
        "points" : [ {
          "x" : 528.64697265625,
          "y" : 243.5
        }, {
          "x" : 408.7568359375,
          "y" : 107
        } ]
      },
      "sourceView" : "81500279-29ef-43d6-95f5-d7c6e66fb107",
      "targetView" : "58922f23-33e6-4a4f-aed0-62b4bd9f7266"
    }, {
      "line" : {
        "points" : [ {
          "x" : 627.97802734375,
          "y" : 293.5
        }, {
          "x" : 528.64697265625,
          "y" : 243.5
        } ]
      },
      "sourceView" : "82a24e13-d97f-4927-94f1-dce0e14ea7d5",
      "targetView" : "81500279-29ef-43d6-95f5-d7c6e66fb107"
    }, {
      "line" : {
        "points" : [ {
          "x" : 784.9667070573788,
          "y" : 428.82441471571906
        }, {
          "x" : 627.97802734375,
          "y" : 293.5
        } ]
      },
      "sourceView" : "36c0ddb5-8cf2-4701-a13b-87f4235f8eee",
      "targetView" : "82a24e13-d97f-4927-94f1-dce0e14ea7d5"
    }, {
      "line" : {
        "points" : [ {
          "x" : 788.93994140625,
          "y" : 246.5
        }, {
          "x" : 408.7568359375,
          "y" : 107
        } ]
      },
      "sourceView" : "ec972619-8479-4099-ad89-e4eae1741722",
      "targetView" : "58922f23-33e6-4a4f-aed0-62b4bd9f7266"
    }, {
      "line" : {
        "points" : [ {
          "x" : 770.11916015625,
          "y" : 309.6
        }, {
          "x" : 788.93994140625,
          "y" : 246.5
        } ]
      },
      "sourceView" : "9892c5f9-3efc-4b28-abb6-fd1c1b82a029",
      "targetView" : "ec972619-8479-4099-ad89-e4eae1741722"
    }, {
      "line" : {
        "points" : [ {
          "x" : 871.95427734375,
          "y" : 309.6
        }, {
          "x" : 788.93994140625,
          "y" : 246.5
        } ]
      },
      "sourceView" : "df66ad70-b76d-4ba2-b133-e7f674309bac",
      "targetView" : "ec972619-8479-4099-ad89-e4eae1741722"
    }, {
      "line" : {
        "points" : [ {
          "x" : 494.1999748510663,
          "y" : 479.03090301003334
        }, {
          "x" : 528.64697265625,
          "y" : 243.5
        } ]
      },
      "sourceView" : "59ff02fc-ec2c-45fb-9a01-5e256affae3f",
      "targetView" : "81500279-29ef-43d6-95f5-d7c6e66fb107"
    }, {
      "line" : {
        "points" : [ {
          "x" : 777.7362158203125,
          "y" : 54.499192785295065
        }, {
          "x" : 592.3272363281251,
          "y" : 92.99838557059013
        } ]
      },
      "sourceView" : "faf03b67-cbba-4d37-8dc5-c6aba689877a",
      "targetView" : "9fb673b5-359b-40ec-9e0f-b029a68ffe67"
    }, {
      "line" : {
        "points" : [ {
          "x" : 775.8805029296875,
          "y" : 140.49919278529507
        }, {
          "x" : 592.3272363281251,
          "y" : 92.99838557059013
        } ]
      },
      "sourceView" : "d7a5dbc0-d2ba-481f-9e1c-74bfb06562d6",
      "targetView" : "9fb673b5-359b-40ec-9e0f-b029a68ffe67"
    } ],
    "name" : "UnderlierDiagram",
    "package" : "underliers",
    "propertyViews" : [ {
      "line" : {
        "points" : [ {
          "x" : 300.794189453125,
          "y" : 386
        }, {
          "x" : 278.88155817242375,
          "y" : 459.68586317930294
        } ]
      },
      "property" : {
        "class" : "underliers::benchmarks::FxPriceBenchmark",
        "property" : "pair"
      },
      "sourceView" : "ede51991-6d48-49ac-bc7a-5bad8206937f",
      "targetView" : "0a22bd83-a1a1-41f9-a003-21de79434626"
    }, {
      "line" : {
        "points" : [ {
          "x" : 313.911611328125,
          "y" : 439.5162079639571
        }, {
          "x" : 368.511611328125,
          "y" : 434.316207963957
        }, {
          "x" : 494.1999748510663,
          "y" : 479.03090301003334
        } ]
      },
      "property" : {
        "class" : "underliers::benchmarks::Pair",
        "property" : "overCurrency"
      },
      "sourceView" : "0a22bd83-a1a1-41f9-a003-21de79434626",
      "targetView" : "59ff02fc-ec2c-45fb-9a01-5e256affae3f"
    }, {
      "line" : {
        "points" : [ {
          "x" : 278.88155817242375,
          "y" : 459.68586317930294
        }, {
          "x" : 280.91161132812505,
          "y" : 493.11620796395704
        }, {
          "x" : 296.51161132812507,
          "y" : 496.71620796395706
        }, {
          "x" : 494.1999748510663,
          "y" : 479.03090301003334
        } ]
      },
      "property" : {
        "class" : "underliers::benchmarks::Pair",
        "property" : "underCurrency"
      },
      "sourceView" : "0a22bd83-a1a1-41f9-a003-21de79434626",
      "targetView" : "59ff02fc-ec2c-45fb-9a01-5e256affae3f"
    }, {
      "line" : {
        "points" : [ {
          "x" : 129.315673828125,
          "y" : 390
        }, {
          "x" : 54.57772460937508,
          "y" : 477.99838557059013
        } ]
      },
      "property" : {
        "class" : "underliers::benchmarks::CommodityPriceBenchmark",
        "property" : "isdaReferenceData"
      },
      "sourceView" : "a2c00a62-33a7-48d6-a82d-97acf7cdebc0",
      "targetView" : "33e0f4a1-21e9-46e2-843b-2e8196e01a82"
    }, {
      "line" : {
        "points" : [ {
          "x" : 408.7568359375,
          "y" : 107
        }, {
          "x" : 592.3272363281251,
          "y" : 92.99838557059013
        } ]
      },
      "property" : {
        "class" : "underliers::Underlier",
        "property" : "classifications"
      },
      "sourceView" : "58922f23-33e6-4a4f-aed0-62b4bd9f7266",
      "targetView" : "9fb673b5-359b-40ec-9e0f-b029a68ffe67"
    }, {
      "line" : {
        "points" : [ {
          "x" : 408.7568359375,
          "y" : 107
        }, {
          "x" : 124.65955566406251,
          "y" : 109.49919278529507
        } ]
      },
      "property" : {
        "class" : "underliers::Underlier",
        "property" : "identifiers"
      },
      "sourceView" : "58922f23-33e6-4a4f-aed0-62b4bd9f7266",
      "targetView" : "3e00043c-4b73-45c7-9ee6-376c252b2065"
    } ]
  }
}