{
  "classifierPath" : "meta::pure::metamodel::type::Enumeration",
  "content" : {
    "_type" : "Enumeration",
    "name" : "FxRegionUpperBoundDirectionEnum",
    "package" : "cdm::synonymSources::fpml",
    "values" : [ {
      "value" : "AtOrBelow"
    }, {
      "value" : "Below"
    } ]
  }
}