{
  "classifierPath" : "meta::pure::metamodel::type::Enumeration",
  "content" : {
    "_type" : "Enumeration",
    "name" : "FinancialUnitEnum",
    "package" : "cdm::model",
    "taggedValues" : [ {
      "tag" : {
        "profile" : "meta::pure::profiles::doc",
        "value" : "doc"
      },
      "value" : "Provides enumerated values for financial units, generally used in the context of defining quantities for securities."
    } ],
    "values" : [ {
      "taggedValues" : [ {
        "tag" : {
          "profile" : "meta::pure::profiles::doc",
          "value" : "doc"
        },
        "value" : "Denotes financial contracts, such as listed futures and options."
      } ],
      "value" : "Contract"
    }, {
      "taggedValues" : [ {
        "tag" : {
          "profile" : "meta::pure::profiles::doc",
          "value" : "doc"
        },
        "value" : "Denotes a Contractual Product as defined in the CDM.  This unit type would be used when the price applies to the whole product, for example, in the case of a premium expressed as a cash amount."
      } ],
      "value" : "ContractualProduct"
    }, {
      "taggedValues" : [ {
        "tag" : {
          "profile" : "meta::pure::profiles::doc",
          "value" : "doc"
        },
        "value" : "Denotes a price expressed in index points, e.g. for a stock index."
      } ],
      "value" : "IndexUnit"
    }, {
      "taggedValues" : [ {
        "tag" : {
          "profile" : "meta::pure::profiles::doc",
          "value" : "doc"
        },
        "value" : "Denotes a log normal volatility, expressed in %/month, where the percentage is represented as a decimal. For example, 0.15 means a log-normal volatility of 15% per month."
      } ],
      "value" : "LogNormalVolatility"
    }, {
      "taggedValues" : [ {
        "tag" : {
          "profile" : "meta::pure::profiles::doc",
          "value" : "doc"
        },
        "value" : "Denotes the number of units of financial stock shares."
      } ],
      "value" : "Share"
    }, {
      "taggedValues" : [ {
        "tag" : {
          "profile" : "meta::pure::profiles::doc",
          "value" : "doc"
        },
        "value" : "Denotes a value (expressed in currency units) for a one day change in a valuation date, which is typically used for expressing sensitivity to the passage of time, also known as theta risk, or carry, or other names."
      } ],
      "value" : "ValuePerDay"
    }, {
      "taggedValues" : [ {
        "tag" : {
          "profile" : "meta::pure::profiles::doc",
          "value" : "doc"
        },
        "value" : "Denotes a value (expressed in currency units) per percent change in the underlying rate which is typically used for expressing sensitivity to volatility changes, also known as vega risk."
      } ],
      "value" : "ValuePerPercent"
    } ]
  }
}