{
  "classifierPath" : "meta::pure::metamodel::type::Class",
  "content" : {
    "_type" : "class",
    "name" : "SpecifiedEntities",
    "package" : "cdm::model",
    "properties" : [ {
      "multiplicity" : {
        "lowerBound" : 1,
        "upperBound" : 1
      },
      "name" : "specifiedEntityClause",
      "taggedValues" : [ {
        "tag" : {
          "profile" : "meta::pure::profiles::doc",
          "value" : "doc"
        },
        "value" : "The Event of Default or Termination event for which Specified Entities terms are being defined."
      } ],
      "type" : "cdm::model::SpecifiedEntityClauseEnum"
    }, {
      "multiplicity" : {
        "lowerBound" : 2,
        "upperBound" : 2
      },
      "name" : "specifiedEntity",
      "taggedValues" : [ {
        "tag" : {
          "profile" : "meta::pure::profiles::doc",
          "value" : "doc"
        },
        "value" : "The party specific election of Specified Entities for the Event of Default or Termination Event specified."
      } ],
      "type" : "cdm::model::SpecifiedEntity"
    } ],
    "taggedValues" : [ {
      "tag" : {
        "profile" : "meta::pure::profiles::doc",
        "value" : "doc"
      },
      "value" : "A provision that allows each party to specify its Specified Entities for certain Events of Default and Termination Events"
    } ]
  }
}