{
  "classifierPath" : "meta::pure::metamodel::type::Enumeration",
  "content" : {
    "_type" : "Enumeration",
    "name" : "MarginTypeEnum",
    "package" : "cdm::model",
    "taggedValues" : [ {
      "tag" : {
        "profile" : "meta::pure::profiles::doc",
        "value" : "doc"
      },
      "value" : "This indicator defines which type of assets (cash or securities) is specified to apply as margin to the repo transaction."
    } ],
    "values" : [ {
      "taggedValues" : [ {
        "tag" : {
          "profile" : "meta::pure::profiles::doc",
          "value" : "doc"
        },
        "value" : "When the margin type is Cash, the margin factor is applied to the cash value of the transaction."
      } ],
      "value" : "Cash"
    }, {
      "taggedValues" : [ {
        "tag" : {
          "profile" : "meta::pure::profiles::doc",
          "value" : "doc"
        },
        "value" : "When the margin type is Instrument, the margin factor is applied to the instrument value for the transaction. In the 'instrument' case, the haircut would be applied to the securities."
      } ],
      "value" : "Instrument"
    } ]
  }
}