{
  "classifierPath" : "meta::pure::metamodel::type::Class",
  "content" : {
    "_type" : "class",
    "name" : "AdjustableDates",
    "package" : "cdm::synonymSources::fpml",
    "properties" : [ {
      "multiplicity" : {
        "lowerBound" : 1
      },
      "name" : "unadjustedDate",
      "taggedValues" : [ {
        "tag" : {
          "profile" : "meta::pure::profiles::doc",
          "value" : "doc"
        },
        "value" : "A date subject to adjustment."
      } ],
      "type" : "cdm::synonymSources::fpml::IdentifiedDate"
    }, {
      "multiplicity" : {
        "lowerBound" : 1,
        "upperBound" : 1
      },
      "name" : "dateAdjustments",
      "taggedValues" : [ {
        "tag" : {
          "profile" : "meta::pure::profiles::doc",
          "value" : "doc"
        },
        "value" : "The business day convention and financial business centers used for adjusting the date if it would otherwise fall on a day that is not a business dat in the specified business centers."
      } ],
      "type" : "cdm::synonymSources::fpml::BusinessDayAdjustments"
    }, {
      "multiplicity" : {
        "lowerBound" : 0
      },
      "name" : "adjustedDate",
      "taggedValues" : [ {
        "tag" : {
          "profile" : "meta::pure::profiles::doc",
          "value" : "doc"
        },
        "value" : "The date once the adjustment has been performed. (Note that this date may change if the business center holidays change)."
      } ],
      "type" : "cdm::synonymSources::fpml::IdentifiedDate"
    }, {
      "multiplicity" : {
        "lowerBound" : 0,
        "upperBound" : 1
      },
      "name" : "id",
      "type" : "String"
    } ]
  }
}