{
  "classifierPath" : "meta::pure::metamodel::type::Enumeration",
  "content" : {
    "_type" : "Enumeration",
    "name" : "PositionStatusEnum",
    "package" : "cdm::model",
    "taggedValues" : [ {
      "tag" : {
        "profile" : "meta::pure::profiles::doc",
        "value" : "doc"
      },
      "value" : "Enumeration to describe the different (risk) states of a Position, whether executed, settled, matured...etc"
    } ],
    "values" : [ {
      "taggedValues" : [ {
        "tag" : {
          "profile" : "meta::pure::profiles::doc",
          "value" : "doc"
        },
        "value" : "The position has been executed, which is the point at which risk has been transferred."
      } ],
      "value" : "Executed"
    }, {
      "taggedValues" : [ {
        "tag" : {
          "profile" : "meta::pure::profiles::doc",
          "value" : "doc"
        },
        "value" : "Contract has been formed, in case position is on a contractual product."
      } ],
      "value" : "Formed"
    }, {
      "taggedValues" : [ {
        "tag" : {
          "profile" : "meta::pure::profiles::doc",
          "value" : "doc"
        },
        "value" : "The position has settled, in case product is subject to settlement after execution, such as securities."
      } ],
      "value" : "Settled"
    }, {
      "taggedValues" : [ {
        "tag" : {
          "profile" : "meta::pure::profiles::doc",
          "value" : "doc"
        },
        "value" : "The position has been cancelled, in case of a cancellation event following an execution."
      } ],
      "value" : "Cancelled"
    }, {
      "taggedValues" : [ {
        "tag" : {
          "profile" : "meta::pure::profiles::doc",
          "value" : "doc"
        },
        "value" : "The position has been closed, in case of a termination event."
      } ],
      "value" : "Closed"
    } ]
  }
}