{
  "classifierPath" : "meta::pure::metamodel::type::Enumeration",
  "content" : {
    "_type" : "Enumeration",
    "name" : "QuantifierEnum",
    "package" : "cdm::model",
    "taggedValues" : [ {
      "tag" : {
        "profile" : "meta::pure::profiles::doc",
        "value" : "doc"
      },
      "value" : "The enumerated values to specify a logical quantification, i.e. either All or Any."
    } ],
    "values" : [ {
      "taggedValues" : [ {
        "tag" : {
          "profile" : "meta::pure::profiles::doc",
          "value" : "doc"
        },
        "value" : "The condition in the scope of the quantifier is true of every member of the domain i.e. every one of the elements in scope."
      } ],
      "value" : "All"
    }, {
      "taggedValues" : [ {
        "tag" : {
          "profile" : "meta::pure::profiles::doc",
          "value" : "doc"
        },
        "value" : "The condition in the scope of the quantifier is true of at least one member of the domain i.e. one or more of the elements in scope."
      } ],
      "value" : "Any"
    } ]
  }
}