{
  "classifierPath" : "meta::pure::metamodel::type::Class",
  "content" : {
    "_type" : "class",
    "name" : "PostContractFormationState",
    "package" : "cdm::model",
    "properties" : [ {
      "multiplicity" : {
        "lowerBound" : 0,
        "upperBound" : 1
      },
      "name" : "creditLimitInformation",
      "taggedValues" : [ {
        "tag" : {
          "profile" : "meta::pure::profiles::doc",
          "value" : "doc"
        },
        "value" : "Credit limit utilization information."
      } ],
      "type" : "cdm::model::CreditLimitInformation"
    }, {
      "multiplicity" : {
        "lowerBound" : 0,
        "upperBound" : 1
      },
      "name" : "tradeWarehouseWorkflow",
      "taggedValues" : [ {
        "tag" : {
          "profile" : "meta::pure::profiles::doc",
          "value" : "doc"
        },
        "value" : "Information related to trade warehouse workflow."
      } ],
      "type" : "cdm::model::TradeWarehouseWorkflow"
    } ],
    "superTypes" : [ "cdm::model::ContractState" ]
  }
}