{
  "classifierPath" : "meta::pure::metamodel::type::Class",
  "content" : {
    "_type" : "class",
    "name" : "PrevailingTime",
    "package" : "cdm::synonymSources::fpml",
    "properties" : [ {
      "multiplicity" : {
        "lowerBound" : 1,
        "upperBound" : 1
      },
      "name" : "hourMinuteTime",
      "taggedValues" : [ {
        "tag" : {
          "profile" : "meta::pure::profiles::doc",
          "value" : "doc"
        },
        "value" : "A time specified in hh:mm:ss format where the second component must be '00', e.g. 11am would be represented as 11:00:00."
      } ],
      "type" : "DateTime"
    }, {
      "multiplicity" : {
        "lowerBound" : 1,
        "upperBound" : 1
      },
      "name" : "location",
      "taggedValues" : [ {
        "tag" : {
          "profile" : "meta::pure::profiles::doc",
          "value" : "doc"
        },
        "value" : "The geographic location to which the hourMinuteTime applies. The time takes into account any current day light saving changes or other adjustments i.e. it is the prevaling time at the location."
      } ],
      "type" : "cdm::synonymSources::fpml::TimezoneLocation"
    } ]
  }
}