{
  "classifierPath" : "meta::pure::metamodel::type::Class",
  "content" : {
    "_type" : "class",
    "name" : "AdjustableRelativeOrPeriodicDates",
    "package" : "cdm::synonymSources::fpml",
    "properties" : [ {
      "multiplicity" : {
        "lowerBound" : 0,
        "upperBound" : 1
      },
      "name" : "id",
      "type" : "String"
    }, {
      "multiplicity" : {
        "lowerBound" : 1,
        "upperBound" : 1
      },
      "name" : "adjustableDates",
      "type" : "cdm::synonymSources::fpml::AdjustableDates"
    }, {
      "multiplicity" : {
        "lowerBound" : 1,
        "upperBound" : 1
      },
      "name" : "periodicDates",
      "type" : "cdm::synonymSources::fpml::PeriodicDates"
    }, {
      "multiplicity" : {
        "lowerBound" : 1,
        "upperBound" : 1
      },
      "name" : "relativeDateSequence",
      "type" : "cdm::synonymSources::fpml::RelativeDateSequence"
    } ]
  }
}