{
  "classifierPath" : "meta::pure::metamodel::type::Enumeration",
  "content" : {
    "_type" : "Enumeration",
    "name" : "CashflowTypeEnum",
    "package" : "cdm::model",
    "taggedValues" : [ {
      "tag" : {
        "profile" : "meta::pure::profiles::doc",
        "value" : "doc"
      },
      "value" : "The qualification of the type of cash flows associated with OTC derivatives contracts and their lifecycle events."
    } ],
    "values" : [ {
      "taggedValues" : [ {
        "tag" : {
          "profile" : "meta::pure::profiles::doc",
          "value" : "doc"
        },
        "value" : "A cash flow associated with an amendment lifecycle event."
      } ],
      "value" : "AmendmentFee"
    }, {
      "taggedValues" : [ {
        "tag" : {
          "profile" : "meta::pure::profiles::doc",
          "value" : "doc"
        },
        "value" : "A cash flow resulting from the assignment of a contract to a new counterparty."
      } ],
      "value" : "AssignmentFee"
    }, {
      "taggedValues" : [ {
        "tag" : {
          "profile" : "meta::pure::profiles::doc",
          "value" : "doc"
        },
        "value" : "The brokerage commission."
      } ],
      "value" : "BrokerageCommission"
    }, {
      "taggedValues" : [ {
        "tag" : {
          "profile" : "meta::pure::profiles::doc",
          "value" : "doc"
        },
        "value" : "A cash flow corresponding to the periodic accrued interests."
      } ],
      "value" : "Coupon"
    }, {
      "taggedValues" : [ {
        "tag" : {
          "profile" : "meta::pure::profiles::doc",
          "value" : "doc"
        },
        "value" : "A cashflow resulting from a credit event."
      } ],
      "value" : "CreditEvent"
    }, {
      "taggedValues" : [ {
        "tag" : {
          "profile" : "meta::pure::profiles::doc",
          "value" : "doc"
        },
        "value" : "A cash flow corresponding to the synthetic dividend of an equity underlier asset traded through a derivative instrument."
      } ],
      "value" : "DividendReturn"
    }, {
      "taggedValues" : [ {
        "tag" : {
          "profile" : "meta::pure::profiles::doc",
          "value" : "doc"
        },
        "value" : "A cash flow associated with an exercise lifecycle event."
      } ],
      "value" : "ExerciseFee"
    }, {
      "taggedValues" : [ {
        "tag" : {
          "profile" : "meta::pure::profiles::doc",
          "value" : "doc"
        },
        "value" : "A generic term for describing a non-scheduled cashflow that can be associated either with the initial contract, with some later corrections to it (e.g. a correction to the day count fraction that has a cashflow impact) or with some lifecycle events. Fees that are specifically associated with termination and partial termination, increase, amendment, and exercise events are qualified accordingly."
      } ],
      "value" : "Fee"
    }, {
      "taggedValues" : [ {
        "tag" : {
          "profile" : "meta::pure::profiles::doc",
          "value" : "doc"
        },
        "value" : "A cash flow associated with an increase lifecycle event."
      } ],
      "value" : "IncreaseFee"
    }, {
      "taggedValues" : [ {
        "tag" : {
          "profile" : "meta::pure::profiles::doc",
          "value" : "doc"
        },
        "value" : "Interest, without qualification as to whether it a gross or net interest relates cashflow."
      } ],
      "value" : "Interest"
    }, {
      "taggedValues" : [ {
        "tag" : {
          "profile" : "meta::pure::profiles::doc",
          "value" : "doc"
        },
        "value" : "A cash flow corresponding to the return of the interest rate portion of a derivative instrument that has different types of underlying assets, such as a total return swap."
      } ],
      "value" : "InterestReturn"
    }, {
      "taggedValues" : [ {
        "tag" : {
          "profile" : "meta::pure::profiles::doc",
          "value" : "doc"
        },
        "value" : "Net interest across payout components. Applicable to products such as interest rate swaps."
      } ],
      "value" : "NetInterest"
    }, {
      "taggedValues" : [ {
        "tag" : {
          "profile" : "meta::pure::profiles::doc",
          "value" : "doc"
        },
        "value" : "The novation fee."
      } ],
      "value" : "NovationFee"
    }, {
      "taggedValues" : [ {
        "tag" : {
          "profile" : "meta::pure::profiles::doc",
          "value" : "doc"
        },
        "value" : "A cash flow associated with a partial termination lifecycle event."
      } ],
      "value" : "PartialTerminationFee"
    }, {
      "taggedValues" : [ {
        "tag" : {
          "profile" : "meta::pure::profiles::doc",
          "value" : "doc"
        },
        "value" : "The premium associated with an OTC contract such as an option or a cap/floor."
      } ],
      "value" : "Premium"
    }, {
      "taggedValues" : [ {
        "tag" : {
          "profile" : "meta::pure::profiles::doc",
          "value" : "doc"
        },
        "value" : "A cash flow corresponding to the return of the price portion of a derivative instrument that has different types of underlying assets, such as a total return swap."
      } ],
      "value" : "PriceReturn"
    }, {
      "taggedValues" : [ {
        "tag" : {
          "profile" : "meta::pure::profiles::doc",
          "value" : "doc"
        },
        "value" : "A cash flow which amount typically corresponds to the notional of the contract and that is exchanged between the parties on trade inception and reverted back when the contract is terminated."
      } ],
      "value" : "PrincipalExchange"
    }, {
      "taggedValues" : [ {
        "tag" : {
          "profile" : "meta::pure::profiles::doc",
          "value" : "doc"
        },
        "value" : "A cash flow associated with a termination lifecycle event."
      } ],
      "value" : "TerminationFee"
    }, {
      "taggedValues" : [ {
        "tag" : {
          "profile" : "meta::pure::profiles::doc",
          "value" : "doc"
        },
        "value" : "An upfront cashflow associated to the swap to adjust for a difference between the swap price and the current market price."
      } ],
      "value" : "UpfrontFee"
    }, {
      "value" : "NetCashflow"
    } ]
  }
}