{
  "classifierPath" : "meta::pure::metamodel::type::Class",
  "content" : {
    "_type" : "class",
    "name" : "Stub",
    "package" : "cdm::synonymSources::fpml",
    "properties" : [ {
      "multiplicity" : {
        "lowerBound" : 0,
        "upperBound" : 1
      },
      "name" : "stubStartDate",
      "taggedValues" : [ {
        "tag" : {
          "profile" : "meta::pure::profiles::doc",
          "value" : "doc"
        },
        "value" : "Start date of stub period. This was created to support use of the InterestRateStream within the Equity Derivative sphere, and this element is not expected to be produced in the representation of Interest Rate products."
      } ],
      "type" : "cdm::synonymSources::fpml::AdjustableOrRelativeDate"
    }, {
      "multiplicity" : {
        "lowerBound" : 0,
        "upperBound" : 1
      },
      "name" : "stubEndDate",
      "taggedValues" : [ {
        "tag" : {
          "profile" : "meta::pure::profiles::doc",
          "value" : "doc"
        },
        "value" : "End date of stub period. This was created to support use of the InterestRateStream within the Equity Derivative sphere, and this element is not expected to be produced in the representation of Interest Rate products."
      } ],
      "type" : "cdm::synonymSources::fpml::AdjustableOrRelativeDate"
    } ],
    "superTypes" : [ "cdm::synonymSources::fpml::StubValue" ]
  }
}