{
  "classifierPath" : "meta::pure::metamodel::type::Class",
  "content" : {
    "_type" : "class",
    "name" : "LegalAgreementBase",
    "package" : "cdm::model",
    "properties" : [ {
      "multiplicity" : {
        "lowerBound" : 1,
        "upperBound" : 1
      },
      "name" : "agreementDate",
      "taggedValues" : [ {
        "tag" : {
          "profile" : "meta::pure::profiles::doc",
          "value" : "doc"
        },
        "value" : "The date on which the legal agreement has been agreed between the parties. This corresponds to the Date of Deed in an English Law document."
      } ],
      "type" : "Date"
    }, {
      "multiplicity" : {
        "lowerBound" : 0,
        "upperBound" : 1
      },
      "name" : "effectiveDate",
      "taggedValues" : [ {
        "tag" : {
          "profile" : "meta::pure::profiles::doc",
          "value" : "doc"
        },
        "value" : "The date on which, or as of which, the agreement is effective, if different from the agreement date. It is expected that it will most often correspond to the agreement date, although there could be situations where the parties will explicitly agree on a distinct effective date."
      } ],
      "type" : "Date"
    }, {
      "multiplicity" : {
        "lowerBound" : 0
      },
      "name" : "identifier",
      "taggedValues" : [ {
        "tag" : {
          "profile" : "meta::pure::profiles::doc",
          "value" : "doc"
        },
        "value" : "The legal agreement identifier. Several identifiers can be specified."
      } ],
      "type" : "cdm::model::Identifier"
    }, {
      "multiplicity" : {
        "lowerBound" : 1,
        "upperBound" : 1
      },
      "name" : "agreementType",
      "taggedValues" : [ {
        "tag" : {
          "profile" : "meta::pure::profiles::doc",
          "value" : "doc"
        },
        "value" : "The type of legal agreement, identified via a set of distinct attributes: name, publisher, governing law and version, e.g. ISDA 2013 Standard Credit Support Annex English Law."
      } ],
      "type" : "cdm::model::LegalAgreementType"
    }, {
      "multiplicity" : {
        "lowerBound" : 2,
        "upperBound" : 2
      },
      "name" : "contractualParty",
      "stereotypes" : [ {
        "profile" : "cdm::model::metadata",
        "value" : "reference"
      } ],
      "taggedValues" : [ {
        "tag" : {
          "profile" : "meta::pure::profiles::doc",
          "value" : "doc"
        },
        "value" : "The two contractual parties to the legal agreement, which reference information is positioned as part of the partyInformation attribute."
      } ],
      "type" : "cdm::model::Party"
    }, {
      "multiplicity" : {
        "lowerBound" : 0
      },
      "name" : "otherParty",
      "taggedValues" : [ {
        "tag" : {
          "profile" : "meta::pure::profiles::doc",
          "value" : "doc"
        },
        "value" : "The role(s) that other party(ies) may have in relation to the legal agreement, further to the contractual parties."
      } ],
      "type" : "cdm::model::PartyRole"
    } ],
    "taggedValues" : [ {
      "tag" : {
        "profile" : "meta::pure::profiles::doc",
        "value" : "doc"
      },
      "value" : "A class describing the legal agreement baseline information, other than the specialized elections: type of legal agreement, agreement date and effective date, parties to the agreement, ... The purpose of this abstract class is to provide the ability to associate a 'one of' feature to the LegalAgreement class as a way to enforce a systematic choice between its attributes."
    } ]
  }
}