{
  "classifierPath" : "meta::pure::metamodel::type::Class",
  "content" : {
    "_type" : "class",
    "name" : "IndependentAmount",
    "package" : "cdm::model",
    "properties" : [ {
      "multiplicity" : {
        "lowerBound" : 1
      },
      "name" : "paymentDetail",
      "taggedValues" : [ {
        "tag" : {
          "profile" : "meta::pure::profiles::doc",
          "value" : "doc"
        },
        "value" : "An attribute that specifies a payment as the combination of a payment amount, a payment date and an associated payment calculation rule."
      } ],
      "type" : "cdm::model::PaymentDetail"
    } ],
    "superTypes" : [ "cdm::model::PartyReferencePayerReceiver" ],
    "taggedValues" : [ {
      "tag" : {
        "profile" : "meta::pure::profiles::doc",
        "value" : "doc"
      },
      "value" : "A class specifying the Independent Amount as the combination of a payer/receiver, a payment amount, a payment date and an associated payment calculation rule."
    } ]
  }
}