{
  "classifierPath" : "meta::pure::metamodel::type::Enumeration",
  "content" : {
    "_type" : "Enumeration",
    "name" : "PeriodExtendedEnum",
    "package" : "cdm::synonymSources::fpml",
    "values" : [ {
      "taggedValues" : [ {
        "tag" : {
          "profile" : "meta::pure::profiles::doc",
          "value" : "doc"
        },
        "value" : "Term. The period commencing on the effective date and ending on the termination date. The T period always appears in association with periodMultiplier = 1, and the notation is intended for use in contexts where the interval thus qualified (e.g. accrual period, payment period, reset period, ...) spans the entire term of the trade.."
      } ],
      "value" : "T"
    } ]
  }
}