{
  "classifierPath" : "meta::pure::metamodel::type::Class",
  "content" : {
    "_type" : "class",
    "name" : "TransferPrimitive",
    "package" : "cdm::model",
    "properties" : [ {
      "multiplicity" : {
        "lowerBound" : 1,
        "upperBound" : 1
      },
      "name" : "before",
      "stereotypes" : [ {
        "profile" : "cdm::model::metadata",
        "value" : "reference"
      } ],
      "type" : "cdm::model::TradeState"
    }, {
      "multiplicity" : {
        "lowerBound" : 1,
        "upperBound" : 1
      },
      "name" : "after",
      "type" : "cdm::model::TradeState"
    } ],
    "stereotypes" : [ {
      "profile" : "cdm::model::metadata",
      "value" : "key"
    } ],
    "taggedValues" : [ {
      "tag" : {
        "profile" : "meta::pure::profiles::doc",
        "value" : "doc"
      },
      "value" : "A class to specify the transfer of assets between parties, those assets being either cash, securities or physical assets. This class combines components that are cross-assets (settlement date, settlement type, status, ...) and some other which are specialized by asset class (e.g. the payer/receiver amount and cashflow type for a cash transfer, the transferor/transferee, security indication, quantity, and asset transfer type qualification for the case of a security). The associated globalKey denotes the ability to associate a hash value to the respective Execution instantiations for the purpose of model cross-referencing, in support of functionality such as the event effect and the lineage."
    } ]
  }
}