{
  "classifierPath" : "meta::pure::metamodel::type::Class",
  "content" : {
    "_type" : "class",
    "constraints" : [ {
      "functionDefinition" : {
        "_type" : "lambda",
        "body" : [ {
          "_type" : "func",
          "function" : "if",
          "parameters" : [ {
            "_type" : "func",
            "function" : "equal",
            "parameters" : [ {
              "_type" : "property",
              "parameters" : [ {
                "_type" : "var",
                "name" : "this"
              } ],
              "property" : "returnType"
            }, {
              "_type" : "property",
              "parameters" : [ {
                "_type" : "enum",
                "fullPath" : "cdm::model::ReturnTypeEnum"
              } ],
              "property" : "Price"
            } ]
          }, {
            "_type" : "lambda",
            "body" : [ {
              "_type" : "func",
              "function" : "and",
              "parameters" : [ {
                "_type" : "func",
                "function" : "isNotEmpty",
                "parameters" : [ {
                  "_type" : "property",
                  "parameters" : [ {
                    "_type" : "var",
                    "name" : "this"
                  } ],
                  "property" : "priceReturnTerms"
                } ]
              }, {
                "_type" : "func",
                "function" : "isEmpty",
                "parameters" : [ {
                  "_type" : "property",
                  "parameters" : [ {
                    "_type" : "var",
                    "name" : "this"
                  } ],
                  "property" : "dividendReturnTerms"
                } ]
              } ]
            } ],
            "parameters" : [ ]
          }, {
            "_type" : "lambda",
            "body" : [ {
              "_type" : "boolean",
              "multiplicity" : {
                "lowerBound" : 1,
                "upperBound" : 1
              },
              "values" : [ true ]
            } ],
            "parameters" : [ ]
          } ]
        } ],
        "parameters" : [ ]
      },
      "name" : "DividendReturn"
    }, {
      "functionDefinition" : {
        "_type" : "lambda",
        "body" : [ {
          "_type" : "func",
          "function" : "if",
          "parameters" : [ {
            "_type" : "func",
            "function" : "equal",
            "parameters" : [ {
              "_type" : "property",
              "parameters" : [ {
                "_type" : "var",
                "name" : "this"
              } ],
              "property" : "returnType"
            }, {
              "_type" : "property",
              "parameters" : [ {
                "_type" : "enum",
                "fullPath" : "cdm::model::ReturnTypeEnum"
              } ],
              "property" : "Dividend"
            } ]
          }, {
            "_type" : "lambda",
            "body" : [ {
              "_type" : "func",
              "function" : "and",
              "parameters" : [ {
                "_type" : "func",
                "function" : "isNotEmpty",
                "parameters" : [ {
                  "_type" : "property",
                  "parameters" : [ {
                    "_type" : "var",
                    "name" : "this"
                  } ],
                  "property" : "dividendReturnTerms"
                } ]
              }, {
                "_type" : "func",
                "function" : "isEmpty",
                "parameters" : [ {
                  "_type" : "property",
                  "parameters" : [ {
                    "_type" : "var",
                    "name" : "this"
                  } ],
                  "property" : "priceReturnTerms"
                } ]
              } ]
            } ],
            "parameters" : [ ]
          }, {
            "_type" : "lambda",
            "body" : [ {
              "_type" : "boolean",
              "multiplicity" : {
                "lowerBound" : 1,
                "upperBound" : 1
              },
              "values" : [ true ]
            } ],
            "parameters" : [ ]
          } ]
        } ],
        "parameters" : [ ]
      },
      "name" : "PriceReturn"
    }, {
      "functionDefinition" : {
        "_type" : "lambda",
        "body" : [ {
          "_type" : "func",
          "function" : "if",
          "parameters" : [ {
            "_type" : "func",
            "function" : "equal",
            "parameters" : [ {
              "_type" : "property",
              "parameters" : [ {
                "_type" : "var",
                "name" : "this"
              } ],
              "property" : "returnType"
            }, {
              "_type" : "property",
              "parameters" : [ {
                "_type" : "enum",
                "fullPath" : "cdm::model::ReturnTypeEnum"
              } ],
              "property" : "Total"
            } ]
          }, {
            "_type" : "lambda",
            "body" : [ {
              "_type" : "func",
              "function" : "and",
              "parameters" : [ {
                "_type" : "func",
                "function" : "isNotEmpty",
                "parameters" : [ {
                  "_type" : "property",
                  "parameters" : [ {
                    "_type" : "var",
                    "name" : "this"
                  } ],
                  "property" : "priceReturnTerms"
                } ]
              }, {
                "_type" : "func",
                "function" : "isNotEmpty",
                "parameters" : [ {
                  "_type" : "property",
                  "parameters" : [ {
                    "_type" : "var",
                    "name" : "this"
                  } ],
                  "property" : "dividendReturnTerms"
                } ]
              } ]
            } ],
            "parameters" : [ ]
          }, {
            "_type" : "lambda",
            "body" : [ {
              "_type" : "boolean",
              "multiplicity" : {
                "lowerBound" : 1,
                "upperBound" : 1
              },
              "values" : [ true ]
            } ],
            "parameters" : [ ]
          } ]
        } ],
        "parameters" : [ ]
      },
      "name" : "TotalReturn"
    }, {
      "functionDefinition" : {
        "_type" : "lambda",
        "body" : [ {
          "_type" : "func",
          "function" : "if",
          "parameters" : [ {
            "_type" : "func",
            "function" : "isNotEmpty",
            "parameters" : [ {
              "_type" : "property",
              "parameters" : [ {
                "_type" : "var",
                "name" : "this"
              } ],
              "property" : "underlier"
            } ]
          }, {
            "_type" : "lambda",
            "body" : [ {
              "_type" : "func",
              "function" : "or",
              "parameters" : [ {
                "_type" : "func",
                "function" : "or",
                "parameters" : [ {
                  "_type" : "func",
                  "function" : "or",
                  "parameters" : [ {
                    "_type" : "func",
                    "function" : "equal",
                    "parameters" : [ {
                      "_type" : "property",
                      "parameters" : [ {
                        "_type" : "property",
                        "parameters" : [ {
                          "_type" : "property",
                          "parameters" : [ {
                            "_type" : "property",
                            "parameters" : [ {
                              "_type" : "var",
                              "name" : "this"
                            } ],
                            "property" : "underlier"
                          } ],
                          "property" : "underlyingProduct"
                        } ],
                        "property" : "security"
                      } ],
                      "property" : "securityType"
                    }, {
                      "_type" : "property",
                      "parameters" : [ {
                        "_type" : "enum",
                        "fullPath" : "cdm::model::SecurityTypeEnum"
                      } ],
                      "property" : "Equity"
                    } ]
                  }, {
                    "_type" : "func",
                    "function" : "and",
                    "parameters" : [ {
                      "_type" : "func",
                      "function" : "equal",
                      "parameters" : [ {
                        "_type" : "property",
                        "parameters" : [ {
                          "_type" : "property",
                          "parameters" : [ {
                            "_type" : "property",
                            "parameters" : [ {
                              "_type" : "property",
                              "parameters" : [ {
                                "_type" : "var",
                                "name" : "this"
                              } ],
                              "property" : "underlier"
                            } ],
                            "property" : "underlyingProduct"
                          } ],
                          "property" : "security"
                        } ],
                        "property" : "securityType"
                      }, {
                        "_type" : "property",
                        "parameters" : [ {
                          "_type" : "enum",
                          "fullPath" : "cdm::model::SecurityTypeEnum"
                        } ],
                        "property" : "Fund"
                      } ]
                    }, {
                      "_type" : "func",
                      "function" : "equal",
                      "parameters" : [ {
                        "_type" : "property",
                        "parameters" : [ {
                          "_type" : "property",
                          "parameters" : [ {
                            "_type" : "property",
                            "parameters" : [ {
                              "_type" : "property",
                              "parameters" : [ {
                                "_type" : "var",
                                "name" : "this"
                              } ],
                              "property" : "underlier"
                            } ],
                            "property" : "underlyingProduct"
                          } ],
                          "property" : "security"
                        } ],
                        "property" : "fundType"
                      }, {
                        "_type" : "property",
                        "parameters" : [ {
                          "_type" : "enum",
                          "fullPath" : "cdm::model::FundProductTypeEnum"
                        } ],
                        "property" : "ExchangeTradedFund"
                      } ]
                    } ]
                  } ]
                }, {
                  "_type" : "func",
                  "function" : "and",
                  "parameters" : [ {
                    "_type" : "func",
                    "function" : "equal",
                    "parameters" : [ {
                      "_type" : "property",
                      "parameters" : [ {
                        "_type" : "property",
                        "parameters" : [ {
                          "_type" : "property",
                          "parameters" : [ {
                            "_type" : "property",
                            "parameters" : [ {
                              "_type" : "var",
                              "name" : "this"
                            } ],
                            "property" : "underlier"
                          } ],
                          "property" : "underlyingProduct"
                        } ],
                        "property" : "security"
                      } ],
                      "property" : "securityType"
                    }, {
                      "_type" : "property",
                      "parameters" : [ {
                        "_type" : "enum",
                        "fullPath" : "cdm::model::SecurityTypeEnum"
                      } ],
                      "property" : "Fund"
                    } ]
                  }, {
                    "_type" : "func",
                    "function" : "equal",
                    "parameters" : [ {
                      "_type" : "property",
                      "parameters" : [ {
                        "_type" : "property",
                        "parameters" : [ {
                          "_type" : "property",
                          "parameters" : [ {
                            "_type" : "property",
                            "parameters" : [ {
                              "_type" : "var",
                              "name" : "this"
                            } ],
                            "property" : "underlier"
                          } ],
                          "property" : "underlyingProduct"
                        } ],
                        "property" : "security"
                      } ],
                      "property" : "fundType"
                    }, {
                      "_type" : "property",
                      "parameters" : [ {
                        "_type" : "enum",
                        "fullPath" : "cdm::model::FundProductTypeEnum"
                      } ],
                      "property" : "MutualFund"
                    } ]
                  } ]
                } ]
              }, {
                "_type" : "func",
                "function" : "equal",
                "parameters" : [ {
                  "_type" : "property",
                  "parameters" : [ {
                    "_type" : "property",
                    "parameters" : [ {
                      "_type" : "property",
                      "parameters" : [ {
                        "_type" : "property",
                        "parameters" : [ {
                          "_type" : "var",
                          "name" : "this"
                        } ],
                        "property" : "underlier"
                      } ],
                      "property" : "underlyingProduct"
                    } ],
                    "property" : "security"
                  } ],
                  "property" : "securityType"
                }, {
                  "_type" : "property",
                  "parameters" : [ {
                    "_type" : "enum",
                    "fullPath" : "cdm::model::SecurityTypeEnum"
                  } ],
                  "property" : "Warrant"
                } ]
              } ]
            } ],
            "parameters" : [ ]
          }, {
            "_type" : "lambda",
            "body" : [ {
              "_type" : "boolean",
              "multiplicity" : {
                "lowerBound" : 1,
                "upperBound" : 1
              },
              "values" : [ true ]
            } ],
            "parameters" : [ ]
          } ]
        } ],
        "parameters" : [ ]
      },
      "name" : "SingleUnderlier"
    } ],
    "name" : "EquityPayout",
    "package" : "cdm::model",
    "properties" : [ {
      "multiplicity" : {
        "lowerBound" : 0,
        "upperBound" : 1
      },
      "name" : "payerReceiver",
      "type" : "cdm::model::PayerReceiver"
    }, {
      "multiplicity" : {
        "lowerBound" : 1,
        "upperBound" : 1
      },
      "name" : "underlier",
      "taggedValues" : [ {
        "tag" : {
          "profile" : "meta::pure::profiles::doc",
          "value" : "doc"
        },
        "value" : "2018 ISDA CDM Equity Confirmation for Security Equity Swap: Security"
      } ],
      "type" : "cdm::model::Underlier"
    }, {
      "multiplicity" : {
        "lowerBound" : 1,
        "upperBound" : 1
      },
      "name" : "returnType",
      "taggedValues" : [ {
        "tag" : {
          "profile" : "meta::pure::profiles::doc",
          "value" : "doc"
        },
        "value" : "Specifies the type of return associated with the equity payout."
      } ],
      "type" : "cdm::model::ReturnTypeEnum"
    }, {
      "multiplicity" : {
        "lowerBound" : 0,
        "upperBound" : 1
      },
      "name" : "dividendReturnTerms",
      "taggedValues" : [ {
        "tag" : {
          "profile" : "meta::pure::profiles::doc",
          "value" : "doc"
        },
        "value" : "2018 ISDA CDM Equity Confirmation for Security Equity Swap: Dividend Obligations"
      } ],
      "type" : "cdm::model::DividendReturnTerms"
    }, {
      "multiplicity" : {
        "lowerBound" : 0,
        "upperBound" : 1
      },
      "name" : "priceReturnTerms",
      "taggedValues" : [ {
        "tag" : {
          "profile" : "meta::pure::profiles::doc",
          "value" : "doc"
        },
        "value" : "2018 ISDA CDM Equity Confirmation for Security Equity Swap: Pricing"
      } ],
      "type" : "cdm::model::PriceReturnTerms"
    }, {
      "multiplicity" : {
        "lowerBound" : 0,
        "upperBound" : 1
      },
      "name" : "fxFeature",
      "taggedValues" : [ {
        "tag" : {
          "profile" : "meta::pure::profiles::doc",
          "value" : "doc"
        },
        "value" : "A quanto or composite FX feature."
      } ],
      "type" : "cdm::model::FxFeature"
    }, {
      "multiplicity" : {
        "lowerBound" : 1,
        "upperBound" : 1
      },
      "name" : "calculationPeriodDates",
      "taggedValues" : [ {
        "tag" : {
          "profile" : "meta::pure::profiles::doc",
          "value" : "doc"
        },
        "value" : "The calculation period dates schedule."
      } ],
      "type" : "cdm::model::CalculationPeriodDates"
    }, {
      "multiplicity" : {
        "lowerBound" : 1,
        "upperBound" : 1
      },
      "name" : "paymentDates",
      "taggedValues" : [ {
        "tag" : {
          "profile" : "meta::pure::profiles::doc",
          "value" : "doc"
        },
        "value" : "The payment date schedule, as defined by the parameters that are needed to specify it, either in a parametric way or by reference to another schedule of dates (e.g. the valuation dates)."
      } ],
      "type" : "cdm::model::PaymentDates"
    }, {
      "multiplicity" : {
        "lowerBound" : 1,
        "upperBound" : 1
      },
      "name" : "settlementTerms",
      "taggedValues" : [ {
        "tag" : {
          "profile" : "meta::pure::profiles::doc",
          "value" : "doc"
        },
        "value" : "2018 ISDA CDM Equity Confirmation for Security Equity Swap: Settlement."
      } ],
      "type" : "cdm::model::SettlementTerms"
    }, {
      "multiplicity" : {
        "lowerBound" : 0,
        "upperBound" : 1
      },
      "name" : "rateOfReturn",
      "taggedValues" : [ {
        "tag" : {
          "profile" : "meta::pure::profiles::doc",
          "value" : "doc"
        },
        "value" : "Rate of Return calculation, in accordance with Part 1 Section 12 of the 2018 ISDA CDM Equity Confirmation for Security Equity Swap, Para 139. 'Rate Of Return'."
      } ],
      "type" : "Float"
    }, {
      "multiplicity" : {
        "lowerBound" : 0,
        "upperBound" : 1
      },
      "name" : "performance",
      "taggedValues" : [ {
        "tag" : {
          "profile" : "meta::pure::profiles::doc",
          "value" : "doc"
        },
        "value" : "Performance calculation, in accordance with Part 1 Section 12 of the 2018 ISDA CDM Equity Confirmation for Security Equity Swap, Para 75. 'Equity Performance'. Cumulative performance is used as a notional multiplier factor on both legs of an Equity Swap."
      } ],
      "type" : "Float"
    } ],
    "stereotypes" : [ {
      "profile" : "cdm::model::metadata",
      "value" : "key"
    } ],
    "superTypes" : [ "cdm::model::PayoutBase" ],
    "taggedValues" : [ {
      "tag" : {
        "profile" : "meta::pure::profiles::doc",
        "value" : "doc"
      },
      "value" : "The equity payout specification terms. The associated globalKey denotes the ability to associate a hash value to the EquityPayout instantiations for the purpose of model cross-referencing, in support of functionality such as the event effect and the lineage."
    } ]
  }
}