{
  "classifierPath" : "meta::pure::metamodel::type::Class",
  "content" : {
    "_type" : "class",
    "name" : "AddressForNotices",
    "package" : "cdm::model",
    "properties" : [ {
      "multiplicity" : {
        "lowerBound" : 1,
        "upperBound" : 1
      },
      "name" : "primaryNotices",
      "taggedValues" : [ {
        "tag" : {
          "profile" : "meta::pure::profiles::doc",
          "value" : "doc"
        },
        "value" : "Specification of primary notice details"
      } ],
      "type" : "cdm::model::ContactElection"
    }, {
      "multiplicity" : {
        "lowerBound" : 0
      },
      "name" : "additionalNotices",
      "taggedValues" : [ {
        "tag" : {
          "profile" : "meta::pure::profiles::doc",
          "value" : "doc"
        },
        "value" : "The optional specification of additional information when a party requires notices to be delivered to more than one address."
      } ],
      "type" : "cdm::model::PartyContactInformation"
    } ],
    "taggedValues" : [ {
      "tag" : {
        "profile" : "meta::pure::profiles::doc",
        "value" : "doc"
      },
      "value" : "Specification of the address and other details for notices."
    } ]
  }
}