{
  "classifierPath" : "meta::pure::metamodel::type::Class",
  "content" : {
    "_type" : "class",
    "name" : "ExerciseNotice",
    "package" : "cdm::model",
    "properties" : [ {
      "multiplicity" : {
        "lowerBound" : 1,
        "upperBound" : 1
      },
      "name" : "exerciseNoticeGiver",
      "taggedValues" : [ {
        "tag" : {
          "profile" : "meta::pure::profiles::doc",
          "value" : "doc"
        },
        "value" : "Specifies the principal party of the trade that has the right to exercise."
      } ],
      "type" : "cdm::model::ExerciseNoticeGiverEnum"
    }, {
      "multiplicity" : {
        "lowerBound" : 0,
        "upperBound" : 1
      },
      "name" : "exerciseNoticeReceiver",
      "taggedValues" : [ {
        "tag" : {
          "profile" : "meta::pure::profiles::doc",
          "value" : "doc"
        },
        "value" : "Specifies the party to which notice of exercise should be given, e.g. by the buyer of the option. Although in many cases it is the buyer of the option who sends the exercise notice to the seller of the option, this component is reused, e.g. in case of OptionEarlyTermination, either or both parties have the right to exercise."
      } ],
      "type" : "cdm::model::AncillaryRoleEnum"
    }, {
      "multiplicity" : {
        "lowerBound" : 1,
        "upperBound" : 1
      },
      "name" : "businessCenter",
      "stereotypes" : [ {
        "profile" : "cdm::model::metadata",
        "value" : "scheme"
      } ],
      "taggedValues" : [ {
        "tag" : {
          "profile" : "meta::pure::profiles::doc",
          "value" : "doc"
        },
        "value" : "Specifies the location where the exercise must be reported, e.g. where the exercise notice receiver is based."
      } ],
      "type" : "cdm::model::BusinessCenterEnum"
    } ],
    "taggedValues" : [ {
      "tag" : {
        "profile" : "meta::pure::profiles::doc",
        "value" : "doc"
      },
      "value" : "Defines to whom and where notice of execution should be given. The exerciseNoticeGiver refers to one or both of the principal parties of the trade. If present the exerciseNoticeReceiver refers to a party, other than the principal party, to whom notice should be given."
    } ]
  }
}