{
  "classifierPath" : "meta::pure::metamodel::type::Enumeration",
  "content" : {
    "_type" : "Enumeration",
    "name" : "DividendPeriodEnum",
    "package" : "cdm::synonymSources::fpml",
    "values" : [ {
      "taggedValues" : [ {
        "tag" : {
          "profile" : "meta::pure::profiles::doc",
          "value" : "doc"
        },
        "value" : "\"First Period\" per the 2002 ISDA Equity Derivatives Definitions will apply."
      } ],
      "value" : "FirstPeriod"
    }, {
      "taggedValues" : [ {
        "tag" : {
          "profile" : "meta::pure::profiles::doc",
          "value" : "doc"
        },
        "value" : "\"Second Period\" per the 2002 ISDA Equity Derivatives Definitions will apply."
      } ],
      "value" : "SecondPeriod"
    } ]
  }
}