{
  "classifierPath" : "meta::pure::metamodel::type::Enumeration",
  "content" : {
    "_type" : "Enumeration",
    "name" : "SimmExceptionApplicableEnum",
    "package" : "cdm::model",
    "taggedValues" : [ {
      "tag" : {
        "profile" : "meta::pure::profiles::doc",
        "value" : "doc"
      },
      "value" : "The enumerated values to the specify the SIMM normalized exception approaches applicable to the ISDA 2018 Standard CSA. ISDA 2018 Credit Support Annex for Initial Margin, paragraph 13, General Principles."
    } ],
    "values" : [ {
      "taggedValues" : [ {
        "tag" : {
          "profile" : "meta::pure::profiles::doc",
          "value" : "doc"
        },
        "value" : "The ISDA Standard Initial Margin Model exception is applicable as a Fallback to Mandatory Method. ISDA 2018 Credit Support Annex for Initial Margin, paragraph 13, General Principles."
      } ],
      "value" : "FallBackToMandatoryMethod"
    }, {
      "taggedValues" : [ {
        "tag" : {
          "profile" : "meta::pure::profiles::doc",
          "value" : "doc"
        },
        "value" : "The ISDA Standard Initial Margin Model exception is applicable as a Mandatory Method. This means that the method applicable is to determine the Margin Amount (IM) by reference to the methodology prescribed pursuant to the applicable regulatory regime which uses a standardized initial margin schedule (such that prescribed percentages are applied to notional amounts before being adjusted, including by a net-to-gross ratio (NGR)). ISDA 2018 Credit Support Annex for Initial Margin, paragraph 13, General Principles."
      } ],
      "value" : "MandatoryMethod"
    }, {
      "taggedValues" : [ {
        "tag" : {
          "profile" : "meta::pure::profiles::doc",
          "value" : "doc"
        },
        "value" : "An alternative approach is described in the document as follows."
      } ],
      "value" : "OtherMethod"
    } ]
  }
}