{
  "classifierPath" : "meta::pure::metamodel::type::Enumeration",
  "content" : {
    "_type" : "Enumeration",
    "name" : "DeliveryDatesEnum",
    "package" : "cdm::synonymSources::fpml",
    "values" : [ {
      "taggedValues" : [ {
        "tag" : {
          "profile" : "meta::pure::profiles::doc",
          "value" : "doc"
        },
        "value" : "The Delivery Date of the underlying Commodity shall be the month of expiration of the futures contract that corresponds to the month and year of the Calculation Period. e.g. The JAN 09 contract when pricing in January '09 (In the case of contracts like Brent crude, this will mean that the contract expired in DEC 08.)"
      } ],
      "value" : "CalculationPeriod"
    }, {
      "taggedValues" : [ {
        "tag" : {
          "profile" : "meta::pure::profiles::doc",
          "value" : "doc"
        },
        "value" : "The Delivery Date of the underlying Commodity shall be the month of expiration of the First Nearby Month futures contract."
      } ],
      "value" : "FirstNearby"
    }, {
      "taggedValues" : [ {
        "tag" : {
          "profile" : "meta::pure::profiles::doc",
          "value" : "doc"
        },
        "value" : "The Delivery Date of the underlying Commodity shall be the month of expiration of the Second Nearby Month futures contract."
      } ],
      "value" : "SecondNearby"
    }, {
      "taggedValues" : [ {
        "tag" : {
          "profile" : "meta::pure::profiles::doc",
          "value" : "doc"
        },
        "value" : "The Delivery Date of the underlying Commodity shall be the month of expiration of the Third Nearby Month futures contract."
      } ],
      "value" : "ThirdNearby"
    }, {
      "taggedValues" : [ {
        "tag" : {
          "profile" : "meta::pure::profiles::doc",
          "value" : "doc"
        },
        "value" : "The Delivery Date of the underlying Commodity shall be the month of expiration of the Fourth Nearby Month futures contract."
      } ],
      "value" : "FourthNearby"
    }, {
      "taggedValues" : [ {
        "tag" : {
          "profile" : "meta::pure::profiles::doc",
          "value" : "doc"
        },
        "value" : "The Delivery Date of the underlying Commodity shall be the month of expiration of the Fifth Nearby Month futures contract."
      } ],
      "value" : "FifthNearby"
    }, {
      "taggedValues" : [ {
        "tag" : {
          "profile" : "meta::pure::profiles::doc",
          "value" : "doc"
        },
        "value" : "The Delivery Date of the underlying Commodity shall be the month of expiration of the Sixth Nearby Month futures contract."
      } ],
      "value" : "SixthNearby"
    }, {
      "taggedValues" : [ {
        "tag" : {
          "profile" : "meta::pure::profiles::doc",
          "value" : "doc"
        },
        "value" : "The Delivery Date of the underlying Commodity shall be the month of expiration of the Seventh Nearby Month futures contract."
      } ],
      "value" : "SeventhNearby"
    }, {
      "taggedValues" : [ {
        "tag" : {
          "profile" : "meta::pure::profiles::doc",
          "value" : "doc"
        },
        "value" : "The Delivery Date of the underlying Commodity shall be the month of expiration of the Eighth Nearby Month futures contract."
      } ],
      "value" : "EighthNearby"
    }, {
      "taggedValues" : [ {
        "tag" : {
          "profile" : "meta::pure::profiles::doc",
          "value" : "doc"
        },
        "value" : "The Delivery Date of the underlying Commodity shall be the month of expiration of the Ninth Nearby Month futures contract."
      } ],
      "value" : "NinthNearby"
    }, {
      "taggedValues" : [ {
        "tag" : {
          "profile" : "meta::pure::profiles::doc",
          "value" : "doc"
        },
        "value" : "The Delivery Date of the underlying Commodity shall be the month of expiration of the Tenth Nearby Month futures contract."
      } ],
      "value" : "TenthNearby"
    }, {
      "taggedValues" : [ {
        "tag" : {
          "profile" : "meta::pure::profiles::doc",
          "value" : "doc"
        },
        "value" : "The Delivery Date of the underlying Commodity shall be the month of expiration of the Eleventh Nearby Month futures contract."
      } ],
      "value" : "EleventhNearby"
    }, {
      "taggedValues" : [ {
        "tag" : {
          "profile" : "meta::pure::profiles::doc",
          "value" : "doc"
        },
        "value" : "The Delivery Date of the underlying Commodity shall be the month of expiration of the Twelfth Nearby Month futures contract."
      } ],
      "value" : "TwelfthNearby"
    }, {
      "taggedValues" : [ {
        "tag" : {
          "profile" : "meta::pure::profiles::doc",
          "value" : "doc"
        },
        "value" : "The Delivery Date of the underlying Commodity shall be the month of expiration of the Thirteenth Nearby Month futures contract."
      } ],
      "value" : "ThirteenthNearby"
    }, {
      "taggedValues" : [ {
        "tag" : {
          "profile" : "meta::pure::profiles::doc",
          "value" : "doc"
        },
        "value" : "The Delivery Date of the underlying Commodity shall be the month of expiration of the Fourteenth Nearby Month futures contract."
      } ],
      "value" : "FourteenthNearby"
    }, {
      "taggedValues" : [ {
        "tag" : {
          "profile" : "meta::pure::profiles::doc",
          "value" : "doc"
        },
        "value" : "The Delivery Date of the underlying Commodity shall be the month of expiration of the FifteenthNearby Month futures contract."
      } ],
      "value" : "FifteenthNearby"
    }, {
      "taggedValues" : [ {
        "tag" : {
          "profile" : "meta::pure::profiles::doc",
          "value" : "doc"
        },
        "value" : "The Delivery Date of the underlying Commodity shall be the month of expiration of the SixteenthNearby Month futures contract."
      } ],
      "value" : "SixteenthNearby"
    }, {
      "taggedValues" : [ {
        "tag" : {
          "profile" : "meta::pure::profiles::doc",
          "value" : "doc"
        },
        "value" : "The Delivery Date of the underlying Commodity shall be the month of expiration of the SeventeenthNearby Month futures contract."
      } ],
      "value" : "SeventeenthNearby"
    }, {
      "taggedValues" : [ {
        "tag" : {
          "profile" : "meta::pure::profiles::doc",
          "value" : "doc"
        },
        "value" : "The Delivery Date of the underlying Commodity shall be the month of expiration of the EighteenthNearby Month futures contract."
      } ],
      "value" : "EighteenthNearby"
    }, {
      "taggedValues" : [ {
        "tag" : {
          "profile" : "meta::pure::profiles::doc",
          "value" : "doc"
        },
        "value" : "The Delivery Date of the underlying Commodity shall be the month of expiration of the NineteenthNearby Month futures contract."
      } ],
      "value" : "NineteenthNearby"
    }, {
      "taggedValues" : [ {
        "tag" : {
          "profile" : "meta::pure::profiles::doc",
          "value" : "doc"
        },
        "value" : "The Delivery Date of the underlying Commodity shall be the month of expiration of the TwentiethNearby Month futures contract."
      } ],
      "value" : "TwentiethNearby"
    }, {
      "taggedValues" : [ {
        "tag" : {
          "profile" : "meta::pure::profiles::doc",
          "value" : "doc"
        },
        "value" : "The Delivery Date of the underlying Commodity shall be the month of expiration of the TwentyFirstNearby Month futures contract."
      } ],
      "value" : "TwentyFirstNearby"
    }, {
      "taggedValues" : [ {
        "tag" : {
          "profile" : "meta::pure::profiles::doc",
          "value" : "doc"
        },
        "value" : "The Delivery Date of the underlying Commodity shall be the month of expiration of the TwentySecondNearby Month futures contract."
      } ],
      "value" : "TwentySecondNearby"
    }, {
      "taggedValues" : [ {
        "tag" : {
          "profile" : "meta::pure::profiles::doc",
          "value" : "doc"
        },
        "value" : "The Delivery Date of the underlying Commodity shall be the month of expiration of the TwentyThirdNearby Month futures contract."
      } ],
      "value" : "TwentyThirdNearby"
    }, {
      "taggedValues" : [ {
        "tag" : {
          "profile" : "meta::pure::profiles::doc",
          "value" : "doc"
        },
        "value" : "The Delivery Date of the underlying Commodity shall be the month of expiration of the TwentyFourthNearby Month futures contract."
      } ],
      "value" : "TwentyFourthNearby"
    }, {
      "taggedValues" : [ {
        "tag" : {
          "profile" : "meta::pure::profiles::doc",
          "value" : "doc"
        },
        "value" : "The Delivery Date of the underlying Commodity shall be the month of expiration of the TwentyFifthNearby Month futures contract."
      } ],
      "value" : "TwentyFifthNearby"
    }, {
      "taggedValues" : [ {
        "tag" : {
          "profile" : "meta::pure::profiles::doc",
          "value" : "doc"
        },
        "value" : "The Delivery Date of the underlying Commodity shall be the month of expiration of the TwentySixthNearby Month futures contract."
      } ],
      "value" : "TwentySixthNearby"
    }, {
      "taggedValues" : [ {
        "tag" : {
          "profile" : "meta::pure::profiles::doc",
          "value" : "doc"
        },
        "value" : "The Delivery Date of the underlying Commodity shall be the month of expiration of the TwentySeventhNearby Month futures contract."
      } ],
      "value" : "TwentySeventhNearby"
    }, {
      "taggedValues" : [ {
        "tag" : {
          "profile" : "meta::pure::profiles::doc",
          "value" : "doc"
        },
        "value" : "The Delivery Date of the underlying Commodity shall be the month of expiration of the TwentyEighthNearby Month futures contract."
      } ],
      "value" : "TwentyEighthNearby"
    }, {
      "taggedValues" : [ {
        "tag" : {
          "profile" : "meta::pure::profiles::doc",
          "value" : "doc"
        },
        "value" : "The Delivery Date of the underlying Commodity shall be the month of expiration of the TwentyNinthNearby Month futures contract."
      } ],
      "value" : "TwentyNinthNearby"
    }, {
      "taggedValues" : [ {
        "tag" : {
          "profile" : "meta::pure::profiles::doc",
          "value" : "doc"
        },
        "value" : "The Delivery Date of the underlying Commodity shall be the month of expiration of the ThirtiethNearby Month futures contract."
      } ],
      "value" : "ThirtiethNearby"
    }, {
      "taggedValues" : [ {
        "tag" : {
          "profile" : "meta::pure::profiles::doc",
          "value" : "doc"
        },
        "value" : "The Delivery Date of the underlying Commodity shall be the month of expiration of the ThirtyFirstNearby Month futures contract."
      } ],
      "value" : "ThirtyFirstNearby"
    }, {
      "taggedValues" : [ {
        "tag" : {
          "profile" : "meta::pure::profiles::doc",
          "value" : "doc"
        },
        "value" : "The Delivery Date of the underlying Commodity shall be the month of expiration of the ThirtySecondNearby Month futures contract."
      } ],
      "value" : "ThirtySecondNearby"
    }, {
      "taggedValues" : [ {
        "tag" : {
          "profile" : "meta::pure::profiles::doc",
          "value" : "doc"
        },
        "value" : "The Delivery Date of the underlying Commodity shall be the month of expiration of the ThirtyThirdNearby Month futures contract."
      } ],
      "value" : "ThirtyThirdNearby"
    }, {
      "taggedValues" : [ {
        "tag" : {
          "profile" : "meta::pure::profiles::doc",
          "value" : "doc"
        },
        "value" : "The Delivery Date of the underlying Commodity shall be the month of expiration of the ThirtyFourthNearby Month futures contract."
      } ],
      "value" : "ThirtyFourthNearby"
    }, {
      "taggedValues" : [ {
        "tag" : {
          "profile" : "meta::pure::profiles::doc",
          "value" : "doc"
        },
        "value" : "The Delivery Date of the underlying Commodity shall be the month of expiration of the ThirtyFifthNearby Month futures contract."
      } ],
      "value" : "ThirtyFifthNearby"
    }, {
      "taggedValues" : [ {
        "tag" : {
          "profile" : "meta::pure::profiles::doc",
          "value" : "doc"
        },
        "value" : "The Delivery Date of the underlying Commodity shall be the month of expiration of the ThirtySixthNearby Month futures contract."
      } ],
      "value" : "ThirtySixthNearby"
    }, {
      "taggedValues" : [ {
        "tag" : {
          "profile" : "meta::pure::profiles::doc",
          "value" : "doc"
        },
        "value" : "The Delivery Date of the underlying Commodity shall be the month of expiration of the ThirtySeventhNearby Month futures contract."
      } ],
      "value" : "ThirtySeventhNearby"
    }, {
      "taggedValues" : [ {
        "tag" : {
          "profile" : "meta::pure::profiles::doc",
          "value" : "doc"
        },
        "value" : "The Delivery Date of the underlying Commodity shall be the month of expiration of the ThirtyEighthNearby Month futures contract."
      } ],
      "value" : "ThirtyEighthNearby"
    }, {
      "taggedValues" : [ {
        "tag" : {
          "profile" : "meta::pure::profiles::doc",
          "value" : "doc"
        },
        "value" : "The Delivery Date of the underlying Commodity shall be the month of expiration of the ThirtyNinthNearby Month futures contract."
      } ],
      "value" : "ThirtyNinthNearby"
    }, {
      "taggedValues" : [ {
        "tag" : {
          "profile" : "meta::pure::profiles::doc",
          "value" : "doc"
        },
        "value" : "The Delivery Date of the underlying Commodity shall be the month of expiration of the FortiethNearby Month futures contract."
      } ],
      "value" : "FortiethNearby"
    }, {
      "taggedValues" : [ {
        "tag" : {
          "profile" : "meta::pure::profiles::doc",
          "value" : "doc"
        },
        "value" : "The Delivery Date of the underlying Commodity shall be the month of expiration of the FortyFirstNearby Month futures contract."
      } ],
      "value" : "FortyFirstNearby"
    }, {
      "taggedValues" : [ {
        "tag" : {
          "profile" : "meta::pure::profiles::doc",
          "value" : "doc"
        },
        "value" : "The Delivery Date of the underlying Commodity shall be the month of expiration of the FortySecondNearby Month futures contract."
      } ],
      "value" : "FortySecondNearby"
    }, {
      "taggedValues" : [ {
        "tag" : {
          "profile" : "meta::pure::profiles::doc",
          "value" : "doc"
        },
        "value" : "The Delivery Date of the underlying Commodity shall be the month of expiration of the FortyThirdNearby Month futures contract."
      } ],
      "value" : "FortyThirdNearby"
    }, {
      "taggedValues" : [ {
        "tag" : {
          "profile" : "meta::pure::profiles::doc",
          "value" : "doc"
        },
        "value" : "The Delivery Date of the underlying Commodity shall be the month of expiration of the FortyFourthNearby Month futures contract."
      } ],
      "value" : "FortyFourthNearby"
    }, {
      "taggedValues" : [ {
        "tag" : {
          "profile" : "meta::pure::profiles::doc",
          "value" : "doc"
        },
        "value" : "The Delivery Date of the underlying Commodity shall be the month of expiration of the FortyFifthNearby Month futures contract."
      } ],
      "value" : "FortyFifthNearby"
    }, {
      "taggedValues" : [ {
        "tag" : {
          "profile" : "meta::pure::profiles::doc",
          "value" : "doc"
        },
        "value" : "The Delivery Date of the underlying Commodity shall be the month of expiration of the FortySixthNearby Month futures contract."
      } ],
      "value" : "FortySixthNearby"
    }, {
      "taggedValues" : [ {
        "tag" : {
          "profile" : "meta::pure::profiles::doc",
          "value" : "doc"
        },
        "value" : "The Delivery Date of the underlying Commodity shall be the month of expiration of the FortySeventhNearby Month futures contract."
      } ],
      "value" : "FortySeventhNearby"
    }, {
      "taggedValues" : [ {
        "tag" : {
          "profile" : "meta::pure::profiles::doc",
          "value" : "doc"
        },
        "value" : "The Delivery Date of the underlying Commodity shall be the month of expiration of the FortyEighthNearby Month futures contract."
      } ],
      "value" : "FortyEighthNearby"
    }, {
      "taggedValues" : [ {
        "tag" : {
          "profile" : "meta::pure::profiles::doc",
          "value" : "doc"
        },
        "value" : "The Delivery Date of the underlying Commodity shall be the month of expiration of the FortyNinthNearby Month futures contract."
      } ],
      "value" : "FortyNinthNearby"
    }, {
      "taggedValues" : [ {
        "tag" : {
          "profile" : "meta::pure::profiles::doc",
          "value" : "doc"
        },
        "value" : "The Delivery Date of the underlying Commodity shall be the month of expiration of the FiftiethNearby Month futures contract."
      } ],
      "value" : "FiftiethNearby"
    }, {
      "taggedValues" : [ {
        "tag" : {
          "profile" : "meta::pure::profiles::doc",
          "value" : "doc"
        },
        "value" : "The Delivery Date of the underlying Commodity shall be the month of expiration of the FiftyFirstNearby Month futures contract."
      } ],
      "value" : "FiftyFirstNearby"
    }, {
      "taggedValues" : [ {
        "tag" : {
          "profile" : "meta::pure::profiles::doc",
          "value" : "doc"
        },
        "value" : "The Delivery Date of the underlying Commodity shall be the month of expiration of the FiftySecondNearby Month futures contract."
      } ],
      "value" : "FiftySecondNearby"
    }, {
      "taggedValues" : [ {
        "tag" : {
          "profile" : "meta::pure::profiles::doc",
          "value" : "doc"
        },
        "value" : "The Delivery Date of the underlying Commodity shall be the month of expiration of the FiftyThirdNearby Month futures contract."
      } ],
      "value" : "FiftyThirdNearby"
    }, {
      "taggedValues" : [ {
        "tag" : {
          "profile" : "meta::pure::profiles::doc",
          "value" : "doc"
        },
        "value" : "The Delivery Date of the underlying Commodity shall be the month of expiration of the FiftyFourthNearby Month futures contract."
      } ],
      "value" : "FiftyFourthNearby"
    }, {
      "taggedValues" : [ {
        "tag" : {
          "profile" : "meta::pure::profiles::doc",
          "value" : "doc"
        },
        "value" : "The Delivery Date of the underlying Commodity shall be the month of expiration of the FiftyFifthNearby Month futures contract."
      } ],
      "value" : "FiftyFifthNearby"
    }, {
      "taggedValues" : [ {
        "tag" : {
          "profile" : "meta::pure::profiles::doc",
          "value" : "doc"
        },
        "value" : "The Delivery Date of the underlying Commodity shall be the month of expiration of the FiftySixthNearby Month futures contract."
      } ],
      "value" : "FiftySixthNearby"
    }, {
      "taggedValues" : [ {
        "tag" : {
          "profile" : "meta::pure::profiles::doc",
          "value" : "doc"
        },
        "value" : "The Delivery Date of the underlying Commodity shall be the month of expiration of the FiftySeventhNearby Month futures contract."
      } ],
      "value" : "FiftySeventhNearby"
    }, {
      "taggedValues" : [ {
        "tag" : {
          "profile" : "meta::pure::profiles::doc",
          "value" : "doc"
        },
        "value" : "The Delivery Date of the underlying Commodity shall be the month of expiration of the FiftyEighthNearby Month futures contract."
      } ],
      "value" : "FiftyEighthNearby"
    }, {
      "taggedValues" : [ {
        "tag" : {
          "profile" : "meta::pure::profiles::doc",
          "value" : "doc"
        },
        "value" : "The Delivery Date of the underlying Commodity shall be the month of expiration of the FiftyNinthNearby Month futures contract."
      } ],
      "value" : "FiftyNinthNearby"
    }, {
      "taggedValues" : [ {
        "tag" : {
          "profile" : "meta::pure::profiles::doc",
          "value" : "doc"
        },
        "value" : "The Delivery Date of the underlying Commodity shall be the Spot date."
      } ],
      "value" : "Spot"
    }, {
      "taggedValues" : [ {
        "tag" : {
          "profile" : "meta::pure::profiles::doc",
          "value" : "doc"
        },
        "value" : "The Delivery Date of the underlying Commodity shall be during the First Nearby Week."
      } ],
      "value" : "FirstNearbyWeek"
    }, {
      "taggedValues" : [ {
        "tag" : {
          "profile" : "meta::pure::profiles::doc",
          "value" : "doc"
        },
        "value" : "The Delivery Date of the underlying Commodity shall be during the Second Nearby Week."
      } ],
      "value" : "SecondNearbyWeek"
    }, {
      "taggedValues" : [ {
        "tag" : {
          "profile" : "meta::pure::profiles::doc",
          "value" : "doc"
        },
        "value" : "The Delivery Date of the underlying Commodity shall be during the Third Nearby Week."
      } ],
      "value" : "ThirdNearbyWeek"
    }, {
      "taggedValues" : [ {
        "tag" : {
          "profile" : "meta::pure::profiles::doc",
          "value" : "doc"
        },
        "value" : "The Delivery Date of the underlying Commodity shall be during the Fourth Nearby Week."
      } ],
      "value" : "FourthNearbyWeek"
    }, {
      "taggedValues" : [ {
        "tag" : {
          "profile" : "meta::pure::profiles::doc",
          "value" : "doc"
        },
        "value" : "The Delivery Date of the underlying Commodity shall be during the Fifth Nearby Week."
      } ],
      "value" : "FifthNearbyWeek"
    }, {
      "taggedValues" : [ {
        "tag" : {
          "profile" : "meta::pure::profiles::doc",
          "value" : "doc"
        },
        "value" : "The Delivery Date of the underlying Commodity shall be during the Sixth Nearby Week."
      } ],
      "value" : "SixthNearbyWeek"
    }, {
      "taggedValues" : [ {
        "tag" : {
          "profile" : "meta::pure::profiles::doc",
          "value" : "doc"
        },
        "value" : "The Delivery Date of the underlying Commodity shall be during the Seventh Nearby Week."
      } ],
      "value" : "SeventhNearbyWeek"
    }, {
      "taggedValues" : [ {
        "tag" : {
          "profile" : "meta::pure::profiles::doc",
          "value" : "doc"
        },
        "value" : "The Delivery Date of the underlying Commodity shall be during the Eighth Nearby Week."
      } ],
      "value" : "EighthNearbyWeek"
    }, {
      "taggedValues" : [ {
        "tag" : {
          "profile" : "meta::pure::profiles::doc",
          "value" : "doc"
        },
        "value" : "The Delivery Date of the underlying Commodity shall be during the Ninth Nearby Week."
      } ],
      "value" : "NinthNearbyWeek"
    }, {
      "taggedValues" : [ {
        "tag" : {
          "profile" : "meta::pure::profiles::doc",
          "value" : "doc"
        },
        "value" : "The Delivery Date of the underlying Commodity shall be during the Tenth Nearby Week."
      } ],
      "value" : "TenthNearbyWeek"
    }, {
      "taggedValues" : [ {
        "tag" : {
          "profile" : "meta::pure::profiles::doc",
          "value" : "doc"
        },
        "value" : "The Delivery Date of the underlying Commodity shall be during the Eleventh Nearby Week."
      } ],
      "value" : "EleventhNearbyWeek"
    }, {
      "taggedValues" : [ {
        "tag" : {
          "profile" : "meta::pure::profiles::doc",
          "value" : "doc"
        },
        "value" : "The Delivery Date of the underlying Commodity shall be during the Twelfth Nearby Week."
      } ],
      "value" : "TwelfthNearbyWeek"
    }, {
      "taggedValues" : [ {
        "tag" : {
          "profile" : "meta::pure::profiles::doc",
          "value" : "doc"
        },
        "value" : "The Delivery Date of the underlying Commodity shall be during the Thirteenth Nearby Week."
      } ],
      "value" : "ThirteenthNearbyWeek"
    }, {
      "taggedValues" : [ {
        "tag" : {
          "profile" : "meta::pure::profiles::doc",
          "value" : "doc"
        },
        "value" : "The Delivery Date of the underlying Commodity shall be during the Fourteenth Nearby Week."
      } ],
      "value" : "FourteenthNearbyWeek"
    }, {
      "taggedValues" : [ {
        "tag" : {
          "profile" : "meta::pure::profiles::doc",
          "value" : "doc"
        },
        "value" : "The Delivery Date of the underlying Commodity shall be during the Fifteenth Nearby Week."
      } ],
      "value" : "FifteenthNearbyWeek"
    }, {
      "taggedValues" : [ {
        "tag" : {
          "profile" : "meta::pure::profiles::doc",
          "value" : "doc"
        },
        "value" : "The Delivery Date of the underlying Commodity shall be during the Sixteenth Nearby Week."
      } ],
      "value" : "SixteenthNearbyWeek"
    }, {
      "taggedValues" : [ {
        "tag" : {
          "profile" : "meta::pure::profiles::doc",
          "value" : "doc"
        },
        "value" : "The Delivery Date of the underlying Commodity shall be during the Seventeenth Nearby Week."
      } ],
      "value" : "SeventeenthNearbyWeek"
    }, {
      "taggedValues" : [ {
        "tag" : {
          "profile" : "meta::pure::profiles::doc",
          "value" : "doc"
        },
        "value" : "The Delivery Date of the underlying Commodity shall be during the Eighteenth Nearby Week."
      } ],
      "value" : "EighteenthNearbyWeek"
    }, {
      "taggedValues" : [ {
        "tag" : {
          "profile" : "meta::pure::profiles::doc",
          "value" : "doc"
        },
        "value" : "The Delivery Date of the underlying Commodity shall be during the Nineteenth Nearby Week."
      } ],
      "value" : "NineteenthNearbyWeek"
    }, {
      "taggedValues" : [ {
        "tag" : {
          "profile" : "meta::pure::profiles::doc",
          "value" : "doc"
        },
        "value" : "The Delivery Date of the underlying Commodity shall be during the Twentieth Nearby Week."
      } ],
      "value" : "TwentiethNearbyWeek"
    }, {
      "taggedValues" : [ {
        "tag" : {
          "profile" : "meta::pure::profiles::doc",
          "value" : "doc"
        },
        "value" : "The Delivery Date of the underlying Commodity shall be during the Twenty First Nearby Week."
      } ],
      "value" : "TwentyFirstNearbyWeek"
    }, {
      "taggedValues" : [ {
        "tag" : {
          "profile" : "meta::pure::profiles::doc",
          "value" : "doc"
        },
        "value" : "The Delivery Date of the underlying Commodity shall be during the Twenty Second Nearby Week."
      } ],
      "value" : "TwentySecondNearbyWeek"
    }, {
      "taggedValues" : [ {
        "tag" : {
          "profile" : "meta::pure::profiles::doc",
          "value" : "doc"
        },
        "value" : "The Delivery Date of the underlying Commodity shall be during the Twenty Third Nearby Week."
      } ],
      "value" : "TwentyThirdNearbyWeek"
    }, {
      "taggedValues" : [ {
        "tag" : {
          "profile" : "meta::pure::profiles::doc",
          "value" : "doc"
        },
        "value" : "The Delivery Date of the underlying Commodity shall be during the Twenty Fourth Nearby Week."
      } ],
      "value" : "TwentyFourthearbyWeek"
    }, {
      "taggedValues" : [ {
        "tag" : {
          "profile" : "meta::pure::profiles::doc",
          "value" : "doc"
        },
        "value" : "The Delivery Date of the underlying Commodity shall be during the Twenty Fifth Nearby Week."
      } ],
      "value" : "TwentyFifthNearbyWeek"
    }, {
      "taggedValues" : [ {
        "tag" : {
          "profile" : "meta::pure::profiles::doc",
          "value" : "doc"
        },
        "value" : "The Delivery Date of the underlying Commodity shall be during the Twenty Sixth Nearby Week."
      } ],
      "value" : "TwentySixthNearbyWeek"
    }, {
      "taggedValues" : [ {
        "tag" : {
          "profile" : "meta::pure::profiles::doc",
          "value" : "doc"
        },
        "value" : "The Delivery Date of the underlying Commodity shall be during the Twenty Seventh Nearby Week."
      } ],
      "value" : "TwentySeventhNearbyWeek"
    }, {
      "taggedValues" : [ {
        "tag" : {
          "profile" : "meta::pure::profiles::doc",
          "value" : "doc"
        },
        "value" : "The Delivery Date of the underlying Commodity shall be during the Twenty Eighth Nearby Week."
      } ],
      "value" : "TwentyEighthNearbyWeek"
    }, {
      "taggedValues" : [ {
        "tag" : {
          "profile" : "meta::pure::profiles::doc",
          "value" : "doc"
        },
        "value" : "The Delivery Date of the underlying Commodity shall be during the Twenty Ninth Nearby Week."
      } ],
      "value" : "TwentyNinthNearbyWeek"
    }, {
      "taggedValues" : [ {
        "tag" : {
          "profile" : "meta::pure::profiles::doc",
          "value" : "doc"
        },
        "value" : "The Delivery Date of the underlying Commodity shall be during the Thirtieth Nearby Week."
      } ],
      "value" : "ThirtiethNearbyWeek"
    }, {
      "taggedValues" : [ {
        "tag" : {
          "profile" : "meta::pure::profiles::doc",
          "value" : "doc"
        },
        "value" : "The Delivery Date of the underlying Commodity shall be during the Thirty First Nearby Week."
      } ],
      "value" : "ThirtyFirstNearbyWeek"
    }, {
      "taggedValues" : [ {
        "tag" : {
          "profile" : "meta::pure::profiles::doc",
          "value" : "doc"
        },
        "value" : "The Delivery Date of the underlying Commodity shall be during the Thirty Second Nearby Week."
      } ],
      "value" : "ThirtySecondNearbyWeek"
    }, {
      "taggedValues" : [ {
        "tag" : {
          "profile" : "meta::pure::profiles::doc",
          "value" : "doc"
        },
        "value" : "The Delivery Date of the underlying Commodity shall be during the Thirty Third Nearby Week."
      } ],
      "value" : "ThirtyThirdNearbyWeek"
    }, {
      "taggedValues" : [ {
        "tag" : {
          "profile" : "meta::pure::profiles::doc",
          "value" : "doc"
        },
        "value" : "The Delivery Date of the underlying Commodity shall be during the Thirty Fourth Nearby Week."
      } ],
      "value" : "ThirtyFourthNearbyWeek"
    }, {
      "taggedValues" : [ {
        "tag" : {
          "profile" : "meta::pure::profiles::doc",
          "value" : "doc"
        },
        "value" : "The Delivery Date of the underlying Commodity shall be during the Thirty Fifth Nearby Week."
      } ],
      "value" : "ThirtyFifthNearbyWeek"
    }, {
      "taggedValues" : [ {
        "tag" : {
          "profile" : "meta::pure::profiles::doc",
          "value" : "doc"
        },
        "value" : "The Delivery Date of the underlying Commodity shall be during the Thirty Sixth Nearby Week."
      } ],
      "value" : "ThirtySixthNearbyWeek"
    }, {
      "taggedValues" : [ {
        "tag" : {
          "profile" : "meta::pure::profiles::doc",
          "value" : "doc"
        },
        "value" : "The Delivery Date of the underlying Commodity shall be during the Thirty Seventh Nearby Week."
      } ],
      "value" : "ThirtySeventhNearbyWeek"
    }, {
      "taggedValues" : [ {
        "tag" : {
          "profile" : "meta::pure::profiles::doc",
          "value" : "doc"
        },
        "value" : "The Delivery Date of the underlying Commodity shall be during the Thirty Eighth Nearby Week."
      } ],
      "value" : "ThirtyEighthNearbyWeek"
    }, {
      "taggedValues" : [ {
        "tag" : {
          "profile" : "meta::pure::profiles::doc",
          "value" : "doc"
        },
        "value" : "The Delivery Date of the underlying Commodity shall be during the Thirty Ninth Nearby Week."
      } ],
      "value" : "ThirtyNinthNearbyWeek"
    }, {
      "taggedValues" : [ {
        "tag" : {
          "profile" : "meta::pure::profiles::doc",
          "value" : "doc"
        },
        "value" : "The Delivery Date of the underlying Commodity shall be during the Fortieth Nearby Week."
      } ],
      "value" : "FortiethNearbyWeek"
    }, {
      "taggedValues" : [ {
        "tag" : {
          "profile" : "meta::pure::profiles::doc",
          "value" : "doc"
        },
        "value" : "The Delivery Date of the underlying Commodity shall be during the Forty First Nearby Week."
      } ],
      "value" : "FortyFirstNearbyWeek"
    }, {
      "taggedValues" : [ {
        "tag" : {
          "profile" : "meta::pure::profiles::doc",
          "value" : "doc"
        },
        "value" : "The Delivery Date of the underlying Commodity shall be during the Forty Second Nearby Week."
      } ],
      "value" : "FortySecondNearbyWeek"
    }, {
      "taggedValues" : [ {
        "tag" : {
          "profile" : "meta::pure::profiles::doc",
          "value" : "doc"
        },
        "value" : "The Delivery Date of the underlying Commodity shall be during the Forty Third Nearby Week."
      } ],
      "value" : "FortyThirdNearbyWeek"
    }, {
      "taggedValues" : [ {
        "tag" : {
          "profile" : "meta::pure::profiles::doc",
          "value" : "doc"
        },
        "value" : "The Delivery Date of the underlying Commodity shall be during the Forty Fourth Nearby Week."
      } ],
      "value" : "FortyFourthNearbyWeek"
    }, {
      "taggedValues" : [ {
        "tag" : {
          "profile" : "meta::pure::profiles::doc",
          "value" : "doc"
        },
        "value" : "The Delivery Date of the underlying Commodity shall be during the Forty Fifth Nearby Week."
      } ],
      "value" : "FortyFifthNearbyWeek"
    }, {
      "taggedValues" : [ {
        "tag" : {
          "profile" : "meta::pure::profiles::doc",
          "value" : "doc"
        },
        "value" : "The Delivery Date of the underlying Commodity shall be during the Forty Sixth Nearby Week."
      } ],
      "value" : "FortySixthNearbyWeek"
    }, {
      "taggedValues" : [ {
        "tag" : {
          "profile" : "meta::pure::profiles::doc",
          "value" : "doc"
        },
        "value" : "The Delivery Date of the underlying Commodity shall be during the Forty Seventh Nearby Week."
      } ],
      "value" : "FortySeventhNearbyWeek"
    }, {
      "taggedValues" : [ {
        "tag" : {
          "profile" : "meta::pure::profiles::doc",
          "value" : "doc"
        },
        "value" : "The Delivery Date of the underlying Commodity shall be during the Forty Eighth Nearby Week."
      } ],
      "value" : "FortyEighthNearbyWeek"
    }, {
      "taggedValues" : [ {
        "tag" : {
          "profile" : "meta::pure::profiles::doc",
          "value" : "doc"
        },
        "value" : "The Delivery Date of the underlying Commodity shall be during the Forty Ninth Nearby Week."
      } ],
      "value" : "FortyNinthNearbyWeek"
    }, {
      "taggedValues" : [ {
        "tag" : {
          "profile" : "meta::pure::profiles::doc",
          "value" : "doc"
        },
        "value" : "The Delivery Date of the underlying Commodity shall be during the Fiftieth Nearby Week."
      } ],
      "value" : "FiftiethNearbyWeek"
    }, {
      "taggedValues" : [ {
        "tag" : {
          "profile" : "meta::pure::profiles::doc",
          "value" : "doc"
        },
        "value" : "The Delivery Date of the underlying Commodity shall be during the Fifty First Nearby Week."
      } ],
      "value" : "FiftyFirstNearbyWeek"
    }, {
      "taggedValues" : [ {
        "tag" : {
          "profile" : "meta::pure::profiles::doc",
          "value" : "doc"
        },
        "value" : "The Delivery Date of the underlying Commodity shall be during the Fifty Second Nearby Week."
      } ],
      "value" : "FiftySecondNearbyWeek"
    } ]
  }
}