{
  "classifierPath" : "meta::pure::metamodel::type::Class",
  "content" : {
    "_type" : "class",
    "name" : "QuasiGovernmentIssuerType",
    "package" : "cdm::model",
    "properties" : [ {
      "multiplicity" : {
        "lowerBound" : 1,
        "upperBound" : 1
      },
      "name" : "sovereignEntity",
      "taggedValues" : [ {
        "tag" : {
          "profile" : "meta::pure::profiles::doc",
          "value" : "doc"
        },
        "value" : "True if sovereign entity (e.g. not separate legal personality from sovereign) or false if non-sovereign entity (e.g. separate legal personality from sovereign)."
      } ],
      "type" : "Boolean"
    }, {
      "multiplicity" : {
        "lowerBound" : 0,
        "upperBound" : 1
      },
      "name" : "sovereignRecourse",
      "taggedValues" : [ {
        "tag" : {
          "profile" : "meta::pure::profiles::doc",
          "value" : "doc"
        },
        "value" : "Applies to non-sovereign entity (e.g. separate legal personality from sovereign).  True if entity has recourse to sovereign (e.g. debt guaranteed by government).  False if entity does not have recourse to sovereign."
      } ],
      "type" : "Boolean"
    } ],
    "taggedValues" : [ {
      "tag" : {
        "profile" : "meta::pure::profiles::doc",
        "value" : "doc"
      },
      "value" : "A class to allow specification of different types of Quasi Government collateral."
    } ]
  }
}