{
  "classifierPath" : "meta::pure::metamodel::type::Enumeration",
  "content" : {
    "_type" : "Enumeration",
    "name" : "FeeElectionEnum",
    "package" : "cdm::synonymSources::fpml",
    "values" : [ {
      "taggedValues" : [ {
        "tag" : {
          "profile" : "meta::pure::profiles::doc",
          "value" : "doc"
        },
        "value" : "The product of (i) the Break Fee Rate multiplied by (ii) the Equity Notional Amount corresponding to the Early Termination Portion."
      } ],
      "value" : "FlatFee"
    }, {
      "taggedValues" : [ {
        "tag" : {
          "profile" : "meta::pure::profiles::doc",
          "value" : "doc"
        },
        "value" : "The product of (i) the Break Fee Rate multiplied by (ii) the Equity Notional Amount corresponding to the Early Termination Portion multiplied by (iii) the number of days from the Early Termination Date to the later of the Termination Date or the Cash Settlement Payment Date corresponding to the latest Valuation Date."
      } ],
      "value" : "AmortizedFee"
    }, {
      "taggedValues" : [ {
        "tag" : {
          "profile" : "meta::pure::profiles::doc",
          "value" : "doc"
        },
        "value" : "The product of (i) the Equity Notional Amount corresponding to the Early Termination Portion multiplied by (ii) the Break Funding Rate multiplied by (iii) the number of days from the Early Termination Date to the next scheduled Reset Date divided by (iv) a number equivalent to the denominator of the Day Count Fraction applicable to the Floating Rate Option."
      } ],
      "value" : "FundingFee"
    }, {
      "taggedValues" : [ {
        "tag" : {
          "profile" : "meta::pure::profiles::doc",
          "value" : "doc"
        },
        "value" : "Both Flat Fee and Funding Fee are applicable."
      } ],
      "value" : "FlatFeeAndFundingFee"
    }, {
      "taggedValues" : [ {
        "tag" : {
          "profile" : "meta::pure::profiles::doc",
          "value" : "doc"
        },
        "value" : "Amortized Fee and Funding Fee are applicable."
      } ],
      "value" : "AmortizedFeeAndFundingFee"
    } ]
  }
}