{
  "classifierPath" : "meta::pure::metamodel::type::Class",
  "content" : {
    "_type" : "class",
    "name" : "EuropeanExercise",
    "package" : "cdm::synonymSources::fpml",
    "properties" : [ {
      "multiplicity" : {
        "lowerBound" : 1,
        "upperBound" : 1
      },
      "name" : "expirationDate",
      "taggedValues" : [ {
        "tag" : {
          "profile" : "meta::pure::profiles::doc",
          "value" : "doc"
        },
        "value" : "The last day within an exercise period for an American style option. For a European style option it is the only day within the exercise period."
      } ],
      "type" : "cdm::synonymSources::fpml::AdjustableOrRelativeDate"
    }, {
      "multiplicity" : {
        "lowerBound" : 0,
        "upperBound" : 1
      },
      "name" : "relevantUnderlyingDate",
      "taggedValues" : [ {
        "tag" : {
          "profile" : "meta::pure::profiles::doc",
          "value" : "doc"
        },
        "value" : "The date on the underlying set by the exercise of an option. What this date is depends on the option (e.g. in a swaption it is the swap effective date, in an extendible/cancelable provision it is the swap termination date)."
      } ],
      "type" : "cdm::synonymSources::fpml::AdjustableOrRelativeDates"
    }, {
      "multiplicity" : {
        "lowerBound" : 1,
        "upperBound" : 1
      },
      "name" : "earliestExerciseTime",
      "taggedValues" : [ {
        "tag" : {
          "profile" : "meta::pure::profiles::doc",
          "value" : "doc"
        },
        "value" : "The earliest time at which notice of exercise can be given by the buyer to the seller (or seller's agent) i) on the expriation date, in the case of a European style option, (ii) on each bermuda option exercise date and the expiration date, in the case of a Bermuda style option the commencement date to, and including, the expiration date , in the case of an American option."
      } ],
      "type" : "cdm::synonymSources::fpml::BusinessCenterTime"
    }, {
      "multiplicity" : {
        "lowerBound" : 1,
        "upperBound" : 1
      },
      "name" : "expirationTime",
      "taggedValues" : [ {
        "tag" : {
          "profile" : "meta::pure::profiles::doc",
          "value" : "doc"
        },
        "value" : "The latest time for exercise on expirationDate."
      } ],
      "type" : "cdm::synonymSources::fpml::BusinessCenterTime"
    }, {
      "multiplicity" : {
        "lowerBound" : 0,
        "upperBound" : 1
      },
      "name" : "partialExercise",
      "taggedValues" : [ {
        "tag" : {
          "profile" : "meta::pure::profiles::doc",
          "value" : "doc"
        },
        "value" : "As defined in the 2000 ISDA Definitions, Section 12.3. Partial Exercise, the buyer of the option has the right to exercise all or less than all the notional amount of the underlying swap on the expiration date, but may not exercise less than the minimum notional amount, and if an integral multiple amount is specified, the notional amount exercised must be equal to, or be an integral multiple of, the integral multiple amount."
      } ],
      "type" : "cdm::synonymSources::fpml::PartialExercise"
    }, {
      "multiplicity" : {
        "lowerBound" : 0,
        "upperBound" : 1
      },
      "name" : "exerciseFee",
      "taggedValues" : [ {
        "tag" : {
          "profile" : "meta::pure::profiles::doc",
          "value" : "doc"
        },
        "value" : "A fee to be paid on exercise. This could be represented as an amount or a rate and notional reference on which to apply the rate."
      } ],
      "type" : "cdm::synonymSources::fpml::ExerciseFee"
    } ],
    "superTypes" : [ "cdm::synonymSources::fpml::Exercise" ]
  }
}