{
  "classifierPath" : "meta::pure::metamodel::type::Class",
  "content" : {
    "_type" : "class",
    "name" : "ConcentrationLimitCriteria",
    "package" : "cdm::model",
    "properties" : [ {
      "multiplicity" : {
        "lowerBound" : 0
      },
      "name" : "issuer",
      "taggedValues" : [ {
        "tag" : {
          "profile" : "meta::pure::profiles::doc",
          "value" : "doc"
        },
        "value" : "Filter based on the issuer."
      } ],
      "type" : "cdm::model::IssuerCriteria"
    }, {
      "multiplicity" : {
        "lowerBound" : 0
      },
      "name" : "asset",
      "taggedValues" : [ {
        "tag" : {
          "profile" : "meta::pure::profiles::doc",
          "value" : "doc"
        },
        "value" : "Filter based on the asset."
      } ],
      "type" : "cdm::model::AssetCriteria"
    } ],
    "taggedValues" : [ {
      "tag" : {
        "profile" : "meta::pure::profiles::doc",
        "value" : "doc"
      },
      "value" : "A class to describe a set of criteria to describe specific assets that the concentration limits apply to."
    } ]
  }
}