{
  "classifierPath" : "meta::pure::metamodel::type::Enumeration",
  "content" : {
    "_type" : "Enumeration",
    "name" : "PeriodEnum",
    "package" : "cdm::model",
    "taggedValues" : [ {
      "tag" : {
        "profile" : "meta::pure::profiles::doc",
        "value" : "doc"
      },
      "value" : "The enumerated values to specify the period, e.g. day, week."
    } ],
    "values" : [ {
      "taggedValues" : [ {
        "tag" : {
          "profile" : "meta::pure::profiles::doc",
          "value" : "doc"
        },
        "value" : "Day"
      } ],
      "value" : "D"
    }, {
      "taggedValues" : [ {
        "tag" : {
          "profile" : "meta::pure::profiles::doc",
          "value" : "doc"
        },
        "value" : "Week"
      } ],
      "value" : "W"
    }, {
      "taggedValues" : [ {
        "tag" : {
          "profile" : "meta::pure::profiles::doc",
          "value" : "doc"
        },
        "value" : "Month"
      } ],
      "value" : "M"
    }, {
      "taggedValues" : [ {
        "tag" : {
          "profile" : "meta::pure::profiles::doc",
          "value" : "doc"
        },
        "value" : "Year"
      } ],
      "value" : "Y"
    }, {
      "taggedValues" : [ {
        "tag" : {
          "profile" : "meta::pure::profiles::doc",
          "value" : "doc"
        },
        "value" : "Term. The period commencing on the effective date and ending on the termination date. The T period always appears in association with periodMultiplier = 1, and the notation is intended for use in contexts where the interval thus qualified (e.g. accrual period, payment period, reset period, ...) spans the entire term of the trade."
      } ],
      "value" : "T"
    }, {
      "taggedValues" : [ {
        "tag" : {
          "profile" : "meta::pure::profiles::doc",
          "value" : "doc"
        },
        "value" : "CalculationPeriod - the period corresponds to the calculation period   For example, used in the Commodity Markets to indicate that a reference contract is the one that corresponds to the period of the calculation period."
      } ],
      "value" : "C"
    } ]
  }
}