{
  "classifierPath" : "meta::pure::metamodel::type::Enumeration",
  "content" : {
    "_type" : "Enumeration",
    "name" : "FxTargetStyleEnum",
    "package" : "cdm::synonymSources::fpml",
    "values" : [ {
      "taggedValues" : [ {
        "tag" : {
          "profile" : "meta::pure::profiles::doc",
          "value" : "doc"
        },
        "value" : "The gain for the knockout period is adjusted to yield a final accumulated value equal to the target level."
      } ],
      "value" : "Exact"
    }, {
      "taggedValues" : [ {
        "tag" : {
          "profile" : "meta::pure::profiles::doc",
          "value" : "doc"
        },
        "value" : "The gain for the knockout period is adjusted to zero i.e. the target yields zero value in the final period."
      } ],
      "value" : "Exclusive"
    }, {
      "taggedValues" : [ {
        "tag" : {
          "profile" : "meta::pure::profiles::doc",
          "value" : "doc"
        },
        "value" : "The gain for the knockout period is equal to the whole benefit of the final fixing over spot i.e. the final accumulated value may exceed the target level."
      } ],
      "value" : "Inclusive"
    } ]
  }
}