{
  "classifierPath" : "meta::pure::metamodel::type::Enumeration",
  "content" : {
    "_type" : "Enumeration",
    "name" : "LoanTransferFeePaidByEnum",
    "package" : "cdm::synonymSources::fpml",
    "values" : [ {
      "taggedValues" : [ {
        "tag" : {
          "profile" : "meta::pure::profiles::doc",
          "value" : "doc"
        },
        "value" : "Buyer is responsible for one half of one allocation's assignment fee (regardless of the number of allocations)."
      } ],
      "value" : "BuyerSplitOneHalf"
    }, {
      "taggedValues" : [ {
        "tag" : {
          "profile" : "meta::pure::profiles::doc",
          "value" : "doc"
        },
        "value" : "Buyer is responsible for one allocation's assignment fee (regardless of the number of allocations)."
      } ],
      "value" : "OneFeePaidByBuyer"
    }, {
      "taggedValues" : [ {
        "tag" : {
          "profile" : "meta::pure::profiles::doc",
          "value" : "doc"
        },
        "value" : "Seller is responsible for one allocation's assignment fee (regardless of the number of allocations)."
      } ],
      "value" : "OneFeePaidBySeller"
    }, {
      "taggedValues" : [ {
        "tag" : {
          "profile" : "meta::pure::profiles::doc",
          "value" : "doc"
        },
        "value" : "Fee is paid by buyer."
      } ],
      "value" : "PaidByBuyer"
    }, {
      "taggedValues" : [ {
        "tag" : {
          "profile" : "meta::pure::profiles::doc",
          "value" : "doc"
        },
        "value" : "Fee is paid by seller."
      } ],
      "value" : "PaidBySeller"
    }, {
      "taggedValues" : [ {
        "tag" : {
          "profile" : "meta::pure::profiles::doc",
          "value" : "doc"
        },
        "value" : "Seller is responsible for one half of one allocation's assignment fee (regardless of the number of allocations)."
      } ],
      "value" : "SellerSplitOneHalf"
    }, {
      "taggedValues" : [ {
        "tag" : {
          "profile" : "meta::pure::profiles::doc",
          "value" : "doc"
        },
        "value" : "Ticket owner is responsible for one allocation's assignment fee (regardless of the number of allocations)."
      } ],
      "value" : "SplitFull"
    } ]
  }
}