{
  "classifierPath" : "meta::pure::metamodel::type::Class",
  "content" : {
    "_type" : "class",
    "name" : "RelativeDateSequence",
    "package" : "cdm::synonymSources::fpml",
    "properties" : [ {
      "multiplicity" : {
        "lowerBound" : 1,
        "upperBound" : 1
      },
      "name" : "dateRelativeTo",
      "taggedValues" : [ {
        "tag" : {
          "profile" : "meta::pure::profiles::doc",
          "value" : "doc"
        },
        "value" : "Specifies the anchor as an href attribute. The href attribute value is a pointer style reference to the element or component elsewhere in the document where the anchor date is defined."
      } ],
      "type" : "cdm::synonymSources::fpml::DateReference"
    }, {
      "multiplicity" : {
        "lowerBound" : 1
      },
      "name" : "dateOffset",
      "type" : "cdm::synonymSources::fpml::DateOffset"
    } ]
  }
}