\BOOKMARK [0][-]{section*.2}{List of figures}{}% 1
\BOOKMARK [0][-]{section*.4}{List of tables}{}% 2
\BOOKMARK [0][-]{chapter*.6}{Introduction}{}% 3
\BOOKMARK [0][-]{chapter.1}{Tables and Figures}{}% 4
\BOOKMARK [1][-]{section.1.1}{Tables}{chapter.1}% 5
\BOOKMARK [1][-]{section.1.2}{Figures}{chapter.1}% 6
\BOOKMARK [0][-]{chapter.2}{Mathematics}{}% 7
\BOOKMARK [1][-]{section.2.1}{Very important formulas}{chapter.2}% 8
\BOOKMARK [0][-]{chapter.3}{Another chapter}{}% 9
\BOOKMARK [0][-]{appendix.A}{An appendix}{}% 10
\BOOKMARK [0][-]{appendix*.12}{Bibliography}{}% 11
\BOOKMARK [0][-]{section*.13}{Curriculum Vitae}{}% 12
