ISO-10303-21;
HEADER;
/* Generated by software containing ST-Developer
 * from STEP Tools, Inc. (www.steptools.com) 
 */

FILE_DESCRIPTION(
/* description */ (''),
/* implementation_level */ '2;1');

FILE_NAME(
/* name */ 'Wishbone v3.step',
/* time_stamp */ '2023-06-12T11:25:20+02:00',
/* author */ (''),
/* organization */ (''),
/* preprocessor_version */ 'ST-DEVELOPER v19.2',
/* originating_system */ 'Autodesk Translation Framework v12.6.0.85',
/* authorisation */ '');

FILE_SCHEMA (('AUTOMOTIVE_DESIGN { 1 0 10303 214 3 1 1 }'));
ENDSEC;

DATA;
#10=MECHANICAL_DESIGN_GEOMETRIC_PRESENTATION_REPRESENTATION('',(#13),#539);
#11=SHAPE_REPRESENTATION_RELATIONSHIP('SRR','None',#546,#12);
#12=ADVANCED_BREP_SHAPE_REPRESENTATION('',(#14),#538);
#13=STYLED_ITEM('',(#556),#14);
#14=MANIFOLD_SOLID_BREP('Wishbone',#231);
#15=FACE_BOUND('',#50,.T.);
#16=FACE_BOUND('',#51,.T.);
#17=FACE_BOUND('',#53,.T.);
#18=FACE_BOUND('',#54,.T.);
#19=PLANE('',#267);
#20=PLANE('',#268);
#21=CYLINDRICAL_SURFACE('',#253,3.25000036198713);
#22=CYLINDRICAL_SURFACE('',#256,3.2500000145709);
#23=CYLINDRICAL_SURFACE('',#259,1.60000007571694);
#24=CYLINDRICAL_SURFACE('',#260,1.59999983893841);
#25=CYLINDRICAL_SURFACE('',#261,178.620008047591);
#26=CYLINDRICAL_SURFACE('',#264,178.62000804759);
#27=FACE_OUTER_BOUND('',#39,.T.);
#28=FACE_OUTER_BOUND('',#40,.T.);
#29=FACE_OUTER_BOUND('',#41,.T.);
#30=FACE_OUTER_BOUND('',#42,.T.);
#31=FACE_OUTER_BOUND('',#43,.T.);
#32=FACE_OUTER_BOUND('',#44,.T.);
#33=FACE_OUTER_BOUND('',#45,.T.);
#34=FACE_OUTER_BOUND('',#46,.T.);
#35=FACE_OUTER_BOUND('',#47,.T.);
#36=FACE_OUTER_BOUND('',#48,.T.);
#37=FACE_OUTER_BOUND('',#49,.T.);
#38=FACE_OUTER_BOUND('',#52,.T.);
#39=EDGE_LOOP('',(#151,#152,#153,#154,#155,#156));
#40=EDGE_LOOP('',(#157,#158,#159,#160,#161));
#41=EDGE_LOOP('',(#162,#163,#164,#165,#166,#167));
#42=EDGE_LOOP('',(#168,#169,#170,#171,#172));
#43=EDGE_LOOP('',(#173,#174,#175,#176));
#44=EDGE_LOOP('',(#177,#178,#179,#180));
#45=EDGE_LOOP('',(#181,#182,#183,#184,#185,#186,#187));
#46=EDGE_LOOP('',(#188,#189,#190,#191,#192,#193,#194));
#47=EDGE_LOOP('',(#195,#196,#197,#198));
#48=EDGE_LOOP('',(#199,#200,#201,#202));
#49=EDGE_LOOP('',(#203,#204,#205,#206));
#50=EDGE_LOOP('',(#207));
#51=EDGE_LOOP('',(#208));
#52=EDGE_LOOP('',(#209,#210,#211,#212));
#53=EDGE_LOOP('',(#213));
#54=EDGE_LOOP('',(#214));
#55=B_SPLINE_CURVE_WITH_KNOTS('',3,(#336,#337,#338,#339,#340,#341,#342,
#343,#344,#345,#346,#347,#348,#349,#350,#351,#352,#353),.UNSPECIFIED.,.F.,
 .F.,(4,2,2,2,2,2,2,2,4),(0.964317991332127,1.02458786699278,1.08485774265342,
1.14512761776908,1.20539749288473,1.2656673670703,1.32593724125586,1.38620711467108,
1.4464769880863),.UNSPECIFIED.);
#56=B_SPLINE_CURVE_WITH_KNOTS('',3,(#355,#356,#357,#358,#359,#360,#361,
#362,#363,#364),.UNSPECIFIED.,.F.,.F.,(4,2,2,2,4),(0.723238494030505,0.783508367970737,
0.843778241910968,0.904048116621548,0.964317991332127),.UNSPECIFIED.);
#57=B_SPLINE_CURVE_WITH_KNOTS('',3,(#365,#366,#367,#368,#369,#370,#371,
#372,#373,#374),.UNSPECIFIED.,.F.,.F.,(4,2,2,2,4),(1.4464769880863,1.50674686134216,
1.56701673459803,1.6272866083989,1.68755648219976),.UNSPECIFIED.);
#58=B_SPLINE_CURVE_WITH_KNOTS('',3,(#381,#382,#383,#384,#385,#386,#387,
#388,#389,#390,#391,#392,#393,#394,#395,#396,#397,#398,#399,#400,#401,#402,
#403,#404,#405,#406,#407),.UNSPECIFIED.,.F.,.F.,(4,2,2,2,3,2,2,2,2,2,2,
2,4),(0.723238493499096,0.783508367957354,0.843778242415612,0.90404811687387,
0.964317991332128,1.02458786579039,1.08485774024864,1.1451276147069,1.20539748916516,
1.26566736362342,1.32593723808168,1.38620711253993,1.44647698699819),
 .UNSPECIFIED.);
#59=B_SPLINE_CURVE_WITH_KNOTS('',3,(#408,#409,#410,#411,#412,#413,#414,
#415,#416,#417),.UNSPECIFIED.,.F.,.F.,(4,2,2,2,4),(1.44647698699819,1.50674686145645,
1.56701673591471,1.62728661037297,1.68755648483122),.UNSPECIFIED.);
#60=B_SPLINE_CURVE_WITH_KNOTS('',3,(#424,#425,#426,#427,#428,#429,#430,
#431,#432,#433,#434,#435,#436,#437,#438,#439,#440,#441),.UNSPECIFIED.,.F.,
 .F.,(4,2,2,2,2,2,2,2,4),(0.964317848626011,1.02458770948571,1.08485757034541,
1.14512743084817,1.20539729135093,1.26566715444698,1.32593701754303,1.38620688466349,
1.44647675178395),.UNSPECIFIED.);
#61=B_SPLINE_CURVE_WITH_KNOTS('',3,(#443,#444,#445,#446,#447,#448,#449,
#450,#451,#452),.UNSPECIFIED.,.F.,.F.,(4,2,2,2,4),(0.723238384746028,0.783508250094376,
0.843778115442723,0.904047976766658,0.964317838090593),.UNSPECIFIED.);
#62=B_SPLINE_CURVE_WITH_KNOTS('',3,(#453,#454,#455,#456,#457,#458,#459,
#460,#461,#462),.UNSPECIFIED.,.F.,.F.,(4,2,2,2,4),(1.44647675178395,1.50674655171564,
1.56701635164733,1.62728615193597,1.68755595222461),.UNSPECIFIED.);
#63=B_SPLINE_CURVE_WITH_KNOTS('',3,(#469,#470,#471,#472,#473,#474,#475,
#476,#477,#478,#479,#480,#481,#482,#483,#484,#485,#486,#487,#488,#489,#490,
#491,#492,#493,#494,#495),.UNSPECIFIED.,.F.,.F.,(4,2,2,2,3,2,2,2,2,2,2,
2,4),(0.723238658798147,0.783508500765304,0.843778342732461,0.904048184699618,
0.964318026666776,1.02458786863393,1.08485771060109,1.14512755256825,1.2053973945354,
1.26566723650256,1.32593707846972,1.38620692043687,1.44647676240403),
 .UNSPECIFIED.);
#64=B_SPLINE_CURVE_WITH_KNOTS('',3,(#496,#497,#498,#499,#500,#501,#502,
#503,#504,#505),.UNSPECIFIED.,.F.,.F.,(4,2,2,2,4),(1.44647677293902,1.50674663847814,
1.56701650401727,1.62728636955639,1.68755623509552),.UNSPECIFIED.);
#65=LINE('',#334,#75);
#66=LINE('',#379,#76);
#67=LINE('',#422,#77);
#68=LINE('',#467,#78);
#69=LINE('',#511,#79);
#70=LINE('',#514,#80);
#71=LINE('',#518,#81);
#72=LINE('',#522,#82);
#73=LINE('',#525,#83);
#74=LINE('',#527,#84);
#75=VECTOR('',#275,10.);
#76=VECTOR('',#280,10.);
#77=VECTOR('',#285,10.);
#78=VECTOR('',#290,10.);
#79=VECTOR('',#295,10.);
#80=VECTOR('',#298,10.);
#81=VECTOR('',#301,10.);
#82=VECTOR('',#304,10.);
#83=VECTOR('',#309,10.);
#84=VECTOR('',#312,10.);
#85=CIRCLE('',#246,2.10000051164846);
#86=CIRCLE('',#248,2.10000051167399);
#87=CIRCLE('',#250,2.10000025515204);
#88=CIRCLE('',#252,2.10000025512655);
#89=CIRCLE('',#254,3.25000036198713);
#90=CIRCLE('',#255,3.25000036198713);
#91=CIRCLE('',#257,3.2500000145709);
#92=CIRCLE('',#258,3.2500000145709);
#93=CIRCLE('',#262,178.620008047591);
#94=CIRCLE('',#263,178.620008047591);
#95=CIRCLE('',#265,178.62000804759);
#96=CIRCLE('',#266,178.62000804759);
#97=VERTEX_POINT('',#331);
#98=VERTEX_POINT('',#333);
#99=VERTEX_POINT('',#335);
#100=VERTEX_POINT('',#354);
#101=VERTEX_POINT('',#376);
#102=VERTEX_POINT('',#378);
#103=VERTEX_POINT('',#380);
#104=VERTEX_POINT('',#419);
#105=VERTEX_POINT('',#421);
#106=VERTEX_POINT('',#423);
#107=VERTEX_POINT('',#442);
#108=VERTEX_POINT('',#464);
#109=VERTEX_POINT('',#466);
#110=VERTEX_POINT('',#468);
#111=VERTEX_POINT('',#507);
#112=VERTEX_POINT('',#508);
#113=VERTEX_POINT('',#510);
#114=VERTEX_POINT('',#512);
#115=VERTEX_POINT('',#516);
#116=VERTEX_POINT('',#517);
#117=VERTEX_POINT('',#519);
#118=VERTEX_POINT('',#521);
#119=EDGE_CURVE('',#97,#97,#85,.T.);
#120=EDGE_CURVE('',#97,#98,#65,.T.);
#121=EDGE_CURVE('',#99,#98,#55,.T.);
#122=EDGE_CURVE('',#100,#99,#56,.T.);
#123=EDGE_CURVE('',#98,#100,#57,.T.);
#124=EDGE_CURVE('',#101,#101,#86,.T.);
#125=EDGE_CURVE('',#101,#102,#66,.T.);
#126=EDGE_CURVE('',#103,#102,#58,.T.);
#127=EDGE_CURVE('',#102,#103,#59,.T.);
#128=EDGE_CURVE('',#104,#104,#87,.T.);
#129=EDGE_CURVE('',#104,#105,#67,.T.);
#130=EDGE_CURVE('',#106,#105,#60,.T.);
#131=EDGE_CURVE('',#107,#106,#61,.T.);
#132=EDGE_CURVE('',#105,#107,#62,.T.);
#133=EDGE_CURVE('',#108,#108,#88,.T.);
#134=EDGE_CURVE('',#108,#109,#68,.T.);
#135=EDGE_CURVE('',#110,#109,#63,.T.);
#136=EDGE_CURVE('',#109,#110,#64,.T.);
#137=EDGE_CURVE('',#111,#112,#89,.T.);
#138=EDGE_CURVE('',#113,#111,#69,.T.);
#139=EDGE_CURVE('',#114,#113,#90,.T.);
#140=EDGE_CURVE('',#112,#114,#70,.T.);
#141=EDGE_CURVE('',#115,#116,#71,.T.);
#142=EDGE_CURVE('',#117,#115,#91,.T.);
#143=EDGE_CURVE('',#118,#117,#72,.T.);
#144=EDGE_CURVE('',#116,#118,#92,.T.);
#145=EDGE_CURVE('',#102,#99,#73,.T.);
#146=EDGE_CURVE('',#109,#106,#74,.T.);
#147=EDGE_CURVE('',#113,#117,#93,.T.);
#148=EDGE_CURVE('',#118,#111,#94,.T.);
#149=EDGE_CURVE('',#112,#116,#95,.T.);
#150=EDGE_CURVE('',#115,#114,#96,.T.);
#151=ORIENTED_EDGE('',*,*,#119,.F.);
#152=ORIENTED_EDGE('',*,*,#120,.T.);
#153=ORIENTED_EDGE('',*,*,#121,.F.);
#154=ORIENTED_EDGE('',*,*,#122,.F.);
#155=ORIENTED_EDGE('',*,*,#123,.F.);
#156=ORIENTED_EDGE('',*,*,#120,.F.);
#157=ORIENTED_EDGE('',*,*,#124,.F.);
#158=ORIENTED_EDGE('',*,*,#125,.T.);
#159=ORIENTED_EDGE('',*,*,#126,.F.);
#160=ORIENTED_EDGE('',*,*,#127,.F.);
#161=ORIENTED_EDGE('',*,*,#125,.F.);
#162=ORIENTED_EDGE('',*,*,#128,.F.);
#163=ORIENTED_EDGE('',*,*,#129,.T.);
#164=ORIENTED_EDGE('',*,*,#130,.F.);
#165=ORIENTED_EDGE('',*,*,#131,.F.);
#166=ORIENTED_EDGE('',*,*,#132,.F.);
#167=ORIENTED_EDGE('',*,*,#129,.F.);
#168=ORIENTED_EDGE('',*,*,#133,.F.);
#169=ORIENTED_EDGE('',*,*,#134,.T.);
#170=ORIENTED_EDGE('',*,*,#135,.F.);
#171=ORIENTED_EDGE('',*,*,#136,.F.);
#172=ORIENTED_EDGE('',*,*,#134,.F.);
#173=ORIENTED_EDGE('',*,*,#137,.F.);
#174=ORIENTED_EDGE('',*,*,#138,.F.);
#175=ORIENTED_EDGE('',*,*,#139,.F.);
#176=ORIENTED_EDGE('',*,*,#140,.F.);
#177=ORIENTED_EDGE('',*,*,#141,.F.);
#178=ORIENTED_EDGE('',*,*,#142,.F.);
#179=ORIENTED_EDGE('',*,*,#143,.F.);
#180=ORIENTED_EDGE('',*,*,#144,.F.);
#181=ORIENTED_EDGE('',*,*,#126,.T.);
#182=ORIENTED_EDGE('',*,*,#145,.T.);
#183=ORIENTED_EDGE('',*,*,#121,.T.);
#184=ORIENTED_EDGE('',*,*,#123,.T.);
#185=ORIENTED_EDGE('',*,*,#122,.T.);
#186=ORIENTED_EDGE('',*,*,#145,.F.);
#187=ORIENTED_EDGE('',*,*,#127,.T.);
#188=ORIENTED_EDGE('',*,*,#135,.T.);
#189=ORIENTED_EDGE('',*,*,#146,.T.);
#190=ORIENTED_EDGE('',*,*,#130,.T.);
#191=ORIENTED_EDGE('',*,*,#132,.T.);
#192=ORIENTED_EDGE('',*,*,#131,.T.);
#193=ORIENTED_EDGE('',*,*,#146,.F.);
#194=ORIENTED_EDGE('',*,*,#136,.T.);
#195=ORIENTED_EDGE('',*,*,#143,.T.);
#196=ORIENTED_EDGE('',*,*,#147,.F.);
#197=ORIENTED_EDGE('',*,*,#138,.T.);
#198=ORIENTED_EDGE('',*,*,#148,.F.);
#199=ORIENTED_EDGE('',*,*,#149,.F.);
#200=ORIENTED_EDGE('',*,*,#140,.T.);
#201=ORIENTED_EDGE('',*,*,#150,.F.);
#202=ORIENTED_EDGE('',*,*,#141,.T.);
#203=ORIENTED_EDGE('',*,*,#150,.T.);
#204=ORIENTED_EDGE('',*,*,#139,.T.);
#205=ORIENTED_EDGE('',*,*,#147,.T.);
#206=ORIENTED_EDGE('',*,*,#142,.T.);
#207=ORIENTED_EDGE('',*,*,#119,.T.);
#208=ORIENTED_EDGE('',*,*,#133,.T.);
#209=ORIENTED_EDGE('',*,*,#144,.T.);
#210=ORIENTED_EDGE('',*,*,#148,.T.);
#211=ORIENTED_EDGE('',*,*,#137,.T.);
#212=ORIENTED_EDGE('',*,*,#149,.T.);
#213=ORIENTED_EDGE('',*,*,#124,.T.);
#214=ORIENTED_EDGE('',*,*,#128,.T.);
#215=CONICAL_SURFACE('',#245,2.1000471967453,0.785398564298593);
#216=CONICAL_SURFACE('',#247,2.10004714132031,0.785398676113413);
#217=CONICAL_SURFACE('',#249,2.10004714876834,0.785398656543086);
#218=CONICAL_SURFACE('',#251,2.10004720419459,0.785398544728273);
#219=ADVANCED_FACE('',(#27),#215,.F.);
#220=ADVANCED_FACE('',(#28),#216,.F.);
#221=ADVANCED_FACE('',(#29),#217,.F.);
#222=ADVANCED_FACE('',(#30),#218,.F.);
#223=ADVANCED_FACE('',(#31),#21,.T.);
#224=ADVANCED_FACE('',(#32),#22,.T.);
#225=ADVANCED_FACE('',(#33),#23,.F.);
#226=ADVANCED_FACE('',(#34),#24,.F.);
#227=ADVANCED_FACE('',(#35),#25,.F.);
#228=ADVANCED_FACE('',(#36),#26,.F.);
#229=ADVANCED_FACE('',(#37,#15,#16),#19,.F.);
#230=ADVANCED_FACE('',(#38,#17,#18),#20,.T.);
#231=CLOSED_SHELL('',(#219,#220,#221,#222,#223,#224,#225,#226,#227,#228,
#229,#230));
#232=DERIVED_UNIT_ELEMENT(#234,1.);
#233=DERIVED_UNIT_ELEMENT(#541,-3.);
#234=(
MASS_UNIT()
NAMED_UNIT(*)
SI_UNIT(.KILO.,.GRAM.)
);
#235=DERIVED_UNIT((#232,#233));
#236=MEASURE_REPRESENTATION_ITEM('density measure',
POSITIVE_RATIO_MEASURE(7850.),#235);
#237=PROPERTY_DEFINITION_REPRESENTATION(#242,#239);
#238=PROPERTY_DEFINITION_REPRESENTATION(#243,#240);
#239=REPRESENTATION('material name',(#241),#538);
#240=REPRESENTATION('density',(#236),#538);
#241=DESCRIPTIVE_REPRESENTATION_ITEM('Steel','Steel');
#242=PROPERTY_DEFINITION('material property','material name',#548);
#243=PROPERTY_DEFINITION('material property','density of part',#548);
#244=AXIS2_PLACEMENT_3D('',#329,#269,#270);
#245=AXIS2_PLACEMENT_3D('',#330,#271,#272);
#246=AXIS2_PLACEMENT_3D('',#332,#273,#274);
#247=AXIS2_PLACEMENT_3D('',#375,#276,#277);
#248=AXIS2_PLACEMENT_3D('',#377,#278,#279);
#249=AXIS2_PLACEMENT_3D('',#418,#281,#282);
#250=AXIS2_PLACEMENT_3D('',#420,#283,#284);
#251=AXIS2_PLACEMENT_3D('',#463,#286,#287);
#252=AXIS2_PLACEMENT_3D('',#465,#288,#289);
#253=AXIS2_PLACEMENT_3D('',#506,#291,#292);
#254=AXIS2_PLACEMENT_3D('',#509,#293,#294);
#255=AXIS2_PLACEMENT_3D('',#513,#296,#297);
#256=AXIS2_PLACEMENT_3D('',#515,#299,#300);
#257=AXIS2_PLACEMENT_3D('',#520,#302,#303);
#258=AXIS2_PLACEMENT_3D('',#523,#305,#306);
#259=AXIS2_PLACEMENT_3D('',#524,#307,#308);
#260=AXIS2_PLACEMENT_3D('',#526,#310,#311);
#261=AXIS2_PLACEMENT_3D('',#528,#313,#314);
#262=AXIS2_PLACEMENT_3D('',#529,#315,#316);
#263=AXIS2_PLACEMENT_3D('',#530,#317,#318);
#264=AXIS2_PLACEMENT_3D('',#531,#319,#320);
#265=AXIS2_PLACEMENT_3D('',#532,#321,#322);
#266=AXIS2_PLACEMENT_3D('',#533,#323,#324);
#267=AXIS2_PLACEMENT_3D('',#534,#325,#326);
#268=AXIS2_PLACEMENT_3D('',#535,#327,#328);
#269=DIRECTION('axis',(0.,0.,1.));
#270=DIRECTION('refdir',(1.,0.,0.));
#271=DIRECTION('center_axis',(-2.33829779133425E-8,1.,1.50487350016323E-8));
#272=DIRECTION('ref_axis',(0.,-1.50487350016323E-8,1.));
#273=DIRECTION('center_axis',(0.,-1.,0.));
#274=DIRECTION('ref_axis',(2.33829959855946E-8,0.,1.));
#275=DIRECTION('',(1.65342555316581E-8,-0.707106508347639,0.70710705402535));
#276=DIRECTION('center_axis',(-2.33829375709402E-8,-1.,1.41793225354346E-8));
#277=DIRECTION('ref_axis',(0.,-1.41793225354346E-8,-1.));
#278=DIRECTION('center_axis',(0.,1.,0.));
#279=DIRECTION('ref_axis',(2.33829617923166E-8,0.,-1.));
#280=DIRECTION('',(1.65342251565101E-8,0.707106408615219,-0.70710715375768));
#281=DIRECTION('center_axis',(-9.26869030060328E-8,-0.999999999999994,5.9681059786078E-8));
#282=DIRECTION('ref_axis',(0.,-5.96810597860782E-8,-0.999999999999998));
#283=DIRECTION('center_axis',(0.,1.,0.));
#284=DIRECTION('ref_axis',(9.26869997865881E-8,0.,-0.999999999999996));
#285=DIRECTION('',(6.55395052356049E-8,0.70710639027893,-0.707107172093946));
#286=DIRECTION('center_axis',(-9.26866414846884E-8,0.999999999999994,5.88117008002911E-8));
#287=DIRECTION('ref_axis',(0.,-5.88117008002914E-8,0.999999999999998));
#288=DIRECTION('center_axis',(0.,-1.,0.));
#289=DIRECTION('ref_axis',(9.26867067895965E-8,0.,0.999999999999996));
#290=DIRECTION('',(6.55393276404537E-8,-0.707106553131048,0.70710700924197));
#291=DIRECTION('center_axis',(0.,-1.,0.));
#292=DIRECTION('ref_axis',(0.,0.,1.));
#293=DIRECTION('center_axis',(0.,-1.,0.));
#294=DIRECTION('ref_axis',(0.,0.,1.));
#295=DIRECTION('',(-3.0998883159867E-15,-1.,-4.16018873199707E-17));
#296=DIRECTION('center_axis',(0.,1.,0.));
#297=DIRECTION('ref_axis',(0.,0.,1.));
#298=DIRECTION('',(-1.73576124442295E-14,1.,8.48947020969062E-18));
#299=DIRECTION('center_axis',(-1.97100704264198E-17,-1.,-1.61068880933124E-15));
#300=DIRECTION('ref_axis',(-1.01064309961486E-15,1.61068880933124E-15,-1.));
#301=DIRECTION('',(1.73576124442295E-14,-1.,-8.48947020969062E-18));
#302=DIRECTION('center_axis',(0.,1.,0.));
#303=DIRECTION('ref_axis',(0.,-1.61068880933124E-15,1.));
#304=DIRECTION('',(3.0998883159867E-15,1.,4.16018873199707E-17));
#305=DIRECTION('center_axis',(0.,-1.,0.));
#306=DIRECTION('ref_axis',(0.,-1.61068880933124E-15,1.));
#307=DIRECTION('center_axis',(0.,1.,0.));
#308=DIRECTION('ref_axis',(0.,0.,-1.));
#309=DIRECTION('',(0.,1.,0.));
#310=DIRECTION('center_axis',(0.,-1.,0.));
#311=DIRECTION('ref_axis',(0.,0.,1.));
#312=DIRECTION('',(0.,-1.,0.));
#313=DIRECTION('center_axis',(-3.0998883159867E-15,-1.,-4.16018873199707E-17));
#314=DIRECTION('ref_axis',(0.,-4.16018873199707E-17,1.));
#315=DIRECTION('center_axis',(0.,-1.,0.));
#316=DIRECTION('ref_axis',(0.,-4.16018873199707E-17,1.));
#317=DIRECTION('center_axis',(0.,1.,0.));
#318=DIRECTION('ref_axis',(0.,-4.16018873199707E-17,1.));
#319=DIRECTION('center_axis',(1.73576124442295E-14,-1.,-8.48947020969062E-18));
#320=DIRECTION('ref_axis',(0.,-8.48947020969062E-18,1.));
#321=DIRECTION('center_axis',(0.,1.,0.));
#322=DIRECTION('ref_axis',(0.,-8.48947020969062E-18,1.));
#323=DIRECTION('center_axis',(0.,-1.,0.));
#324=DIRECTION('ref_axis',(0.,-8.48947020969062E-18,1.));
#325=DIRECTION('center_axis',(0.,-1.,0.));
#326=DIRECTION('ref_axis',(0.,0.,-1.));
#327=DIRECTION('center_axis',(0.,-1.,0.));
#328=DIRECTION('ref_axis',(0.,0.,-1.));
#329=CARTESIAN_POINT('',(0.,0.,0.));
#330=CARTESIAN_POINT('Origin',(9.17450402058343E-8,4.00004674466406,-23.1000018360849));
#331=CARTESIAN_POINT('',(9.17461305636023E-8,4.00000015685822,-25.2000024133853));
#332=CARTESIAN_POINT('Origin',(4.26418275689677E-8,4.00000005960464,-23.1000018044832));
#333=CARTESIAN_POINT('',(1.03437622568756E-7,3.5000000163433,-24.7000018870177));
#334=CARTESIAN_POINT('',(9.17450404630159E-8,4.00004677626711,-25.2000490328302));
#335=CARTESIAN_POINT('',(1.08856490406695E-7,3.50000006835418,-21.5000017362643));
#336=CARTESIAN_POINT('Ctrl Pts',(1.03437620864455E-7,3.5000000321252,-21.5000017362643));
#337=CARTESIAN_POINT('Ctrl Pts',(0.200899688973114,3.50000003750324,-21.5000017355839));
#338=CARTESIAN_POINT('Ctrl Pts',(0.415190165973644,3.50000004305027,-21.540151561232));
#339=CARTESIAN_POINT('Ctrl Pts',(0.809397105374906,3.50000005283252,-21.7034374238063));
#340=CARTESIAN_POINT('Ctrl Pts',(0.989313567775636,3.50000005706773,-21.8265734607325));
#341=CARTESIAN_POINT('Ctrl Pts',(1.27342848173953,3.50000006333262,-22.1106883812783));
#342=CARTESIAN_POINT('Ctrl Pts',(1.39656451372463,3.50000006577988,-22.29060484474));
#343=CARTESIAN_POINT('Ctrl Pts',(1.55985036712726,3.50000006829066,-22.6848117840464));
#344=CARTESIAN_POINT('Ctrl Pts',(1.6000001885448,3.50000006835418,-22.8991022598911));
#345=CARTESIAN_POINT('Ctrl Pts',(1.60000018060205,3.500000066458,-23.3009014242285));
#346=CARTESIAN_POINT('Ctrl Pts',(1.5598503519415,3.50000006437191,-23.5151918953908));
#347=CARTESIAN_POINT('Ctrl Pts',(1.39656448758544,3.50000005814044,-23.9093988235148));
#348=CARTESIAN_POINT('Ctrl Pts',(1.27342845188992,3.50000005399505,-24.0893152804764));
#349=CARTESIAN_POINT('Ctrl Pts',(0.989313537468042,3.50000004504856,-24.3734301855947));
#350=CARTESIAN_POINT('Ctrl Pts',(0.809397079006724,3.50000003965113,-24.496566214306));
#351=CARTESIAN_POINT('Ctrl Pts',(0.415190151016874,3.50000002832772,-24.6598520656979));
#352=CARTESIAN_POINT('Ctrl Pts',(0.200899681488348,3.50000002240174,-24.7000018883785));
#353=CARTESIAN_POINT('Ctrl Pts',(1.03437622182845E-7,3.50000001702371,-24.7000018876981));
#354=CARTESIAN_POINT('',(-1.59999996686045,3.49999998174283,-23.1000018119812));
#355=CARTESIAN_POINT('Ctrl Pts',(-1.59999996686045,3.49999998174283,-23.1000018119812));
#356=CARTESIAN_POINT('Ctrl Pts',(-1.59999996686045,3.49999998269091,-22.8991022295447));
#357=CARTESIAN_POINT('Ctrl Pts',(-1.55985014992269,3.499999984777,-22.6848117866089));
#358=CARTESIAN_POINT('Ctrl Pts',(-1.39656429843591,3.49999999100847,-22.2906048492576));
#359=CARTESIAN_POINT('Ctrl Pts',(-1.27342826785826,3.49999999515386,-22.1106883864709));
#360=CARTESIAN_POINT('Ctrl Pts',(-0.989313356537521,3.50000000410035,-21.8265734658466));
#361=CARTESIAN_POINT('Ctrl Pts',(-0.809396895250425,3.50000000949777,-21.7034374282847));
#362=CARTESIAN_POINT('Ctrl Pts',(-0.415189957765019,3.50000002082118,-21.5401515638337));
#363=CARTESIAN_POINT('Ctrl Pts',(-0.200899481566707,3.50000002674717,-21.5000017369447));
#364=CARTESIAN_POINT('Ctrl Pts',(1.03437620968538E-7,3.5000000321252,-21.5000017362643));
#365=CARTESIAN_POINT('Ctrl Pts',(1.03437622529789E-7,3.50000001702371,-24.7000018876981));
#366=CARTESIAN_POINT('Ctrl Pts',(-0.200899474081937,3.50000001164567,-24.7000018870177));
#367=CARTESIAN_POINT('Ctrl Pts',(-0.415189942808249,3.50000000609864,-24.6598520630962));
#368=CARTESIAN_POINT('Ctrl Pts',(-0.809396868882242,3.4999999963164,-24.4965662098276));
#369=CARTESIAN_POINT('Ctrl Pts',(-0.989313326229924,3.49999999208118,-24.3734301804807));
#370=CARTESIAN_POINT('Ctrl Pts',(-1.27342823800865,3.49999998581629,-24.0893152752839));
#371=CARTESIAN_POINT('Ctrl Pts',(-1.39656427229672,3.49999998336903,-23.9093988189972));
#372=CARTESIAN_POINT('Ctrl Pts',(-1.55985013473693,3.49999998085826,-23.5151918928283));
#373=CARTESIAN_POINT('Ctrl Pts',(-1.59999996288907,3.49999998079474,-23.3009014229462));
#374=CARTESIAN_POINT('Ctrl Pts',(-1.59999996686044,3.49999998174283,-23.10000184361));
#375=CARTESIAN_POINT('Origin',(9.1748716654518E-8,-4.66295985019077E-5,
-23.1000018347151));
#376=CARTESIAN_POINT('',(9.17498057359217E-8,-3.4918578303528E-8,-21.0000012583465));
#377=CARTESIAN_POINT('Origin',(4.26455759594546E-8,0.,-23.1000018049391));
#378=CARTESIAN_POINT('',(1.03441274891345E-7,0.499999976431935,-21.5000017965926));
#379=CARTESIAN_POINT('',(9.17487169116996E-8,-4.65998212561513E-5,-20.9999546933948));
#380=CARTESIAN_POINT('',(-1.59999996686045,0.499999966068817,-23.1000018119812));
#381=CARTESIAN_POINT('Ctrl Pts',(-1.59999996686044,0.499999966068818,-23.1000018119812));
#382=CARTESIAN_POINT('Ctrl Pts',(-1.59999996686044,0.499999966964987,-23.3009013935087));
#383=CARTESIAN_POINT('Ctrl Pts',(-1.55985014207561,0.499999966846181,-23.5151918663721));
#384=CARTESIAN_POINT('Ctrl Pts',(-1.39656428415418,0.499999964233907,-23.9093987991098));
#385=CARTESIAN_POINT('Ctrl Pts',(-1.2734282510176,0.499999961740437,-24.089315258984));
#386=CARTESIAN_POINT('Ctrl Pts',(-0.989313338146291,0.499999955402782,-24.3734301718553));
#387=CARTESIAN_POINT('Ctrl Pts',(-0.809396878272085,0.499999951136163,-24.4965662049919));
#388=CARTESIAN_POINT('Ctrl Pts',(-0.415189945534458,0.499999941312634,-24.6598520629133));
#389=CARTESIAN_POINT('Ctrl Pts',(-0.200899472671036,0.499999935755722,-24.7000018876981));
#390=CARTESIAN_POINT('Ctrl Pts',(1.08856490210751E-7,0.499999930378154,
-24.7000018876981));
#391=CARTESIAN_POINT('Ctrl Pts',(0.200899690384017,0.499999925000585,-24.7000018876981));
#392=CARTESIAN_POINT('Ctrl Pts',(0.415190163247436,0.49999991908548,-24.6598520629133));
#393=CARTESIAN_POINT('Ctrl Pts',(0.809397095985064,0.499999907805185,-24.4965662049919));
#394=CARTESIAN_POINT('Ctrl Pts',(0.989313555859271,0.499999902439997,-24.3734301718553));
#395=CARTESIAN_POINT('Ctrl Pts',(1.27342846873058,0.499999893567592,-24.089315258984));
#396=CARTESIAN_POINT('Ctrl Pts',(1.39656450186716,0.499999889468989,-23.9093987991098));
#397=CARTESIAN_POINT('Ctrl Pts',(1.55985035978859,0.499999883339773,-23.5151918663721));
#398=CARTESIAN_POINT('Ctrl Pts',(1.60000018457343,0.499999881309161,-23.3009013935087));
#399=CARTESIAN_POINT('Ctrl Pts',(1.60000018457343,0.499999879516822,-22.8991022304537));
#400=CARTESIAN_POINT('Ctrl Pts',(1.55985035978859,0.499999879635629,-22.6848117575903));
#401=CARTESIAN_POINT('Ctrl Pts',(1.39656450186716,0.499999882247903,-22.2906048248526));
#402=CARTESIAN_POINT('Ctrl Pts',(1.27342846873058,0.499999884741372,-22.1106883649784));
#403=CARTESIAN_POINT('Ctrl Pts',(0.98931355585927,0.499999891079028,-21.8265734521071));
#404=CARTESIAN_POINT('Ctrl Pts',(0.809397095985065,0.499999895345647,-21.7034374189705));
#405=CARTESIAN_POINT('Ctrl Pts',(0.415190163247439,0.499999905169177,-21.5401515610491));
#406=CARTESIAN_POINT('Ctrl Pts',(0.200899690384017,0.499999910726086,-21.5000017362643));
#407=CARTESIAN_POINT('Ctrl Pts',(1.08856490921988E-7,0.499999916103654,
-21.5000017362643));
#408=CARTESIAN_POINT('Ctrl Pts',(1.08856491043419E-7,0.499999916103655,
-21.5000017362643));
#409=CARTESIAN_POINT('Ctrl Pts',(-0.200899472671036,0.499999921481223,-21.5000017362643));
#410=CARTESIAN_POINT('Ctrl Pts',(-0.415189945534456,0.49999992739633,-21.5401515610491));
#411=CARTESIAN_POINT('Ctrl Pts',(-0.809396878272084,0.499999938676624,-21.7034374189705));
#412=CARTESIAN_POINT('Ctrl Pts',(-0.989313338146291,0.49999994404181,-21.8265734521071));
#413=CARTESIAN_POINT('Ctrl Pts',(-1.2734282510176,0.499999952914215,-22.1106883649784));
#414=CARTESIAN_POINT('Ctrl Pts',(-1.39656428415418,0.499999957012822,-22.2906048248526));
#415=CARTESIAN_POINT('Ctrl Pts',(-1.55985014207561,0.499999963142037,-22.6848117575902));
#416=CARTESIAN_POINT('Ctrl Pts',(-1.59999996686044,0.499999965172648,-22.8991022304537));
#417=CARTESIAN_POINT('Ctrl Pts',(-1.59999996686044,0.499999966068818,-23.1000018119812));
#418=CARTESIAN_POINT('Origin',(2.3745744372549E-7,-4.68935700688345E-5,
23.0999990303486));
#419=CARTESIAN_POINT('',(2.3746176627926E-7,-1.3493506739236E-7,25.1999995457634));
#420=CARTESIAN_POINT('Origin',(4.28190785606297E-8,0.,23.0999991556761));
#421=CARTESIAN_POINT('',(2.83805247539543E-7,0.500000156936459,24.6999987010645));
#422=CARTESIAN_POINT('',(2.37457443982672E-7,-4.67682370293953E-5,25.2000461791169));
#423=CARTESIAN_POINT('',(1.78451054684825E-7,0.499999879206046,21.4999992497548));
#424=CARTESIAN_POINT('Ctrl Pts',(2.83805242501378E-7,0.499999915766047,
21.4999992497548));
#425=CARTESIAN_POINT('Ctrl Pts',(0.200899820004248,0.499999910373785,21.4999992629833));
#426=CARTESIAN_POINT('Ctrl Pts',(0.415190242940361,0.499999904805333,21.5401490897527));
#427=CARTESIAN_POINT('Ctrl Pts',(0.809397082807758,0.49999989496976,21.7034349261632));
#428=CARTESIAN_POINT('Ctrl Pts',(0.989313499739042,0.49999989070264,21.8265709358043));
#429=CARTESIAN_POINT('Ctrl Pts',(1.27342834550939,0.499999884373417,22.1106857858855));
#430=CARTESIAN_POINT('Ctrl Pts',(1.39656435191438,0.499999881889441,22.2906022035117));
#431=CARTESIAN_POINT('Ctrl Pts',(1.55985018231787,0.499999879305756,22.6848090433169));
#432=CARTESIAN_POINT('Ctrl Pts',(1.60000000631638,0.499999879206046,22.899099465496));
#433=CARTESIAN_POINT('Ctrl Pts',(1.60000002846254,0.499999881039696,23.3008985441587));
#434=CARTESIAN_POINT('Ctrl Pts',(1.55985022465916,0.499999883095275,23.5151889793933));
#435=CARTESIAN_POINT('Ctrl Pts',(1.39656442479626,0.499999889276968,23.9093958503776));
#436=CARTESIAN_POINT('Ctrl Pts',(1.27342842873674,0.49999989340308,24.0893122861274));
#437=CARTESIAN_POINT('Ctrl Pts',(0.989313584243358,0.499999902325482,24.373427179224));
#438=CARTESIAN_POINT('Ctrl Pts',(0.809397156328111,0.499999907716496,24.4965632117703));
#439=CARTESIAN_POINT('Ctrl Pts',(0.41519028464315,0.499999919042419,24.6598490793598));
#440=CARTESIAN_POINT('Ctrl Pts',(0.200899840873433,0.499999924977328,24.6999989144031));
#441=CARTESIAN_POINT('Ctrl Pts',(2.83805226541922E-7,0.499999930369594,
24.6999989276316));
#442=CARTESIAN_POINT('',(-1.59999966048503,0.499999966012792,23.1000018119804));
#443=CARTESIAN_POINT('Ctrl Pts',(-1.59999966048735,0.499999966012779,23.0999990005052));
#444=CARTESIAN_POINT('Ctrl Pts',(-1.59999964941427,0.49999996509595,22.8990994405645));
#445=CARTESIAN_POINT('Ctrl Pts',(-1.55984981553124,0.499999963040365,22.6848089934965));
#446=CARTESIAN_POINT('Ctrl Pts',(-1.39656394787952,0.499999956858666,22.2906021156803));
#447=CARTESIAN_POINT('Ctrl Pts',(-1.27342791411082,0.499999952732549,22.1106856849321));
#448=CARTESIAN_POINT('Ctrl Pts',(-0.989313016951973,0.499999943810146,21.8265708363764));
#449=CARTESIAN_POINT('Ctrl Pts',(-0.809396578369244,0.49999993841914,21.7034348390945));
#450=CARTESIAN_POINT('Ctrl Pts',(-0.415189701253619,0.49999992709322,21.5401490391694));
#451=CARTESIAN_POINT('Ctrl Pts',(-0.200899368074909,0.499999921158313,21.4999992497548));
#452=CARTESIAN_POINT('Ctrl Pts',(1.78451055390938E-7,0.499999915766051,
21.4999992497548));
#453=CARTESIAN_POINT('Ctrl Pts',(2.83805226784783E-7,0.499999930369595,
24.6999989276316));
#454=CARTESIAN_POINT('Ctrl Pts',(-0.200899283589938,0.499999935761861,24.6999989408601));
#455=CARTESIAN_POINT('Ctrl Pts',(-0.415189742956437,0.499999941330322,24.6598491299431));
#456=CARTESIAN_POINT('Ctrl Pts',(-0.809396651889626,0.499999951165902,24.4965632988389));
#457=CARTESIAN_POINT('Ctrl Pts',(-0.989313101456314,0.499999955433015,24.3734272786519));
#458=CARTESIAN_POINT('Ctrl Pts',(-1.27342799733819,0.49999996176224,24.0893123870809));
#459=CARTESIAN_POINT('Ctrl Pts',(-1.39656402076141,0.49999996424622,23.9093959382091));
#460=CARTESIAN_POINT('Ctrl Pts',(-1.55984985787253,0.499999966829901,23.5151890292137));
#461=CARTESIAN_POINT('Ctrl Pts',(-1.59999931854298,0.499999966929611,23.3009013805651));
#462=CARTESIAN_POINT('Ctrl Pts',(-1.59999966048503,0.499999966012792,23.1000018119804));
#463=CARTESIAN_POINT('Origin',(2.37453207608765E-7,4.00004700863689,23.0999990317181));
#464=CARTESIAN_POINT('',(2.37457535379593E-7,4.00000044241811,20.9999985172798));
#465=CARTESIAN_POINT('Origin',(4.28154398046665E-8,4.00000005960464,23.09999915522));
#466=CARTESIAN_POINT('',(2.83800896048125E-7,3.49999998158629,21.4999993006311));
#467=CARTESIAN_POINT('',(2.37453207865947E-7,4.00004713214424,20.9999518275235));
#468=CARTESIAN_POINT('',(-1.59999966048503,3.49999998179862,23.1000018119804));
#469=CARTESIAN_POINT('Ctrl Pts',(-1.59999966048503,3.49999998179862,23.1000018119804));
#470=CARTESIAN_POINT('Ctrl Pts',(-1.59999931854301,3.49999998082991,23.3009013637772));
#471=CARTESIAN_POINT('Ctrl Pts',(-1.55984984164415,3.49999998087437,23.5151890816416));
#472=CARTESIAN_POINT('Ctrl Pts',(-1.39656400788684,3.49999998335663,23.9093959560419));
#473=CARTESIAN_POINT('Ctrl Pts',(-1.27342799297273,3.49999998579444,24.0893123892909));
#474=CARTESIAN_POINT('Ctrl Pts',(-0.989313122146619,3.49999999205097,24.373427260117));
#475=CARTESIAN_POINT('Ctrl Pts',(-0.809396688897632,3.49999999628673,24.4965632750311));
#476=CARTESIAN_POINT('Ctrl Pts',(-0.415189814497337,3.50000000608109,24.6598491087884));
#477=CARTESIAN_POINT('Ctrl Pts',(-0.200899373346031,3.50000001163971,24.6999989276316));
#478=CARTESIAN_POINT('Ctrl Pts',(1.78451054488882E-7,3.50000001703246,24.6999989276316));
#479=CARTESIAN_POINT('Ctrl Pts',(0.20089973024814,3.50000002242522,24.6999989276316));
#480=CARTESIAN_POINT('Ctrl Pts',(0.415190171399447,3.50000002837103,24.6598491087884));
#481=CARTESIAN_POINT('Ctrl Pts',(0.809397045799742,3.50000003974009,24.4965632750311));
#482=CARTESIAN_POINT('Ctrl Pts',(0.989313479048727,3.50000004516334,24.373427260117));
#483=CARTESIAN_POINT('Ctrl Pts',(1.27342834987484,3.50000005415982,24.0893123892909));
#484=CARTESIAN_POINT('Ctrl Pts',(1.39656436478895,3.50000005833271,23.9093959560419));
#485=CARTESIAN_POINT('Ctrl Pts',(1.55985019854626,3.50000006461662,23.5151890816416));
#486=CARTESIAN_POINT('Ctrl Pts',(1.60000001738946,3.50000006672765,23.3008986404903));
#487=CARTESIAN_POINT('Ctrl Pts',(1.60000001738946,3.50000006866508,22.8990995368961));
#488=CARTESIAN_POINT('Ctrl Pts',(1.55985019854626,3.50000006862062,22.6848090957448));
#489=CARTESIAN_POINT('Ctrl Pts',(1.39656436478895,3.50000006613836,22.2906022213445));
#490=CARTESIAN_POINT('Ctrl Pts',(1.27342834987484,3.50000006370055,22.1106857880956));
#491=CARTESIAN_POINT('Ctrl Pts',(0.989313479048727,3.50000005744401,21.8265709172694));
#492=CARTESIAN_POINT('Ctrl Pts',(0.809397045799742,3.50000005320826,21.7034349023553));
#493=CARTESIAN_POINT('Ctrl Pts',(0.415190171399447,3.5000000434139,21.540149068598));
#494=CARTESIAN_POINT('Ctrl Pts',(0.200899835597985,3.50000003785529,21.4999992629828));
#495=CARTESIAN_POINT('Ctrl Pts',(2.8380090003749E-7,3.50000003246254,21.4999992497548));
#496=CARTESIAN_POINT('Ctrl Pts',(1.78451055182771E-7,3.50000003246254,21.4999992497548));
#497=CARTESIAN_POINT('Ctrl Pts',(-0.20089937334603,3.50000002706978,21.4999992497548));
#498=CARTESIAN_POINT('Ctrl Pts',(-0.415189814497336,3.50000002112398,21.540149068598));
#499=CARTESIAN_POINT('Ctrl Pts',(-0.809396688897631,3.50000000975492,21.7034349023553));
#500=CARTESIAN_POINT('Ctrl Pts',(-0.989313122146618,3.50000000433167,21.8265709172694));
#501=CARTESIAN_POINT('Ctrl Pts',(-1.27342799297273,3.49999999533519,22.1106857880956));
#502=CARTESIAN_POINT('Ctrl Pts',(-1.39656400788684,3.4999999911623,22.2906022213445));
#503=CARTESIAN_POINT('Ctrl Pts',(-1.55984984164415,3.49999998487839,22.6848090957448));
#504=CARTESIAN_POINT('Ctrl Pts',(-1.59999966048735,3.49999998276735,22.8990995368961));
#505=CARTESIAN_POINT('Ctrl Pts',(-1.59999966048735,3.49999998179864,23.0999990886932));
#506=CARTESIAN_POINT('Origin',(-1.11022302462516E-15,4.00000005960464,23.0999978258752));
#507=CARTESIAN_POINT('',(3.25000031564375,-2.48500835844885E-13,23.100001801474));
#508=CARTESIAN_POINT('',(-3.25000031564375,-1.39146342086564E-12,23.100001801474));
#509=CARTESIAN_POINT('Origin',(-1.11022302462516E-15,0.,23.0999978258752));
#510=CARTESIAN_POINT('',(3.25000031564375,4.0000000596044,23.100001801474));
#511=CARTESIAN_POINT('',(3.25000029196268,5.4809123895615E-13,23.1000017972243));
#512=CARTESIAN_POINT('',(-3.2500003156438,4.00000005960325,23.100001801474));
#513=CARTESIAN_POINT('Origin',(-1.11022302462516E-15,4.00000005960464,23.0999978258752));
#514=CARTESIAN_POINT('',(-3.25000029196268,3.07418434446018E-12,23.1000017972243));
#515=CARTESIAN_POINT('Origin',(7.04408790378092E-17,4.00000005960464,-23.1000022763914));
#516=CARTESIAN_POINT('',(-3.25000007231887,4.00000005960327,-23.1000018185864));
#517=CARTESIAN_POINT('',(-3.25000007231883,-1.37493343354607E-12,-23.1000018185864));
#518=CARTESIAN_POINT('',(-3.25000010165063,3.07457656131796E-12,-23.1000018220448));
#519=CARTESIAN_POINT('',(3.25000007231884,4.00000005960441,-23.1000018185864));
#520=CARTESIAN_POINT('Origin',(7.044087903781E-17,4.00000005960468,-23.1000022763914));
#521=CARTESIAN_POINT('',(3.25000007231884,-2.3197084857796E-13,-23.1000018185864));
#522=CARTESIAN_POINT('',(3.25000010165066,5.50013246890848E-13,-23.1000018220448));
#523=CARTESIAN_POINT('Origin',(-8.39940384268105E-18,3.71924713249427E-14,
-23.1000022763914));
#524=CARTESIAN_POINT('Origin',(1.08856490210751E-7,3.49999994039536,-23.1000018119812));
#525=CARTESIAN_POINT('',(1.08856490406695E-7,3.49999994039536,-21.5000017362643));
#526=CARTESIAN_POINT('Origin',(1.78451054488882E-7,0.500000007450581,23.0999990886932));
#527=CARTESIAN_POINT('',(1.78451054684825E-7,0.500000007450581,21.4999992497548));
#528=CARTESIAN_POINT('Origin',(180.370008076538,0.,-7.42022117286721E-7));
#529=CARTESIAN_POINT('Origin',(180.370008076538,4.00000005960409,-7.42022117120314E-7));
#530=CARTESIAN_POINT('Origin',(180.370008076538,-5.59126880617877E-13,-7.42022117286721E-7));
#531=CARTESIAN_POINT('Origin',(-180.370008076538,0.,-7.42022158269056E-7));
#532=CARTESIAN_POINT('Origin',(-180.370008076538,-3.13079269676061E-12,
-7.42022158269056E-7));
#533=CARTESIAN_POINT('Origin',(-180.370008076538,4.00000005960151,-7.42022158235098E-7));
#534=CARTESIAN_POINT('Origin',(7.09773761604674E-14,4.00000005960464,-1.39077504475911E-6));
#535=CARTESIAN_POINT('Origin',(7.09948694706704E-14,0.,-1.39077504475911E-6));
#536=UNCERTAINTY_MEASURE_WITH_UNIT(LENGTH_MEASURE(0.01),#540,
'DISTANCE_ACCURACY_VALUE',
'Maximum model space distance between geometric entities at asserted c
onnectivities');
#537=UNCERTAINTY_MEASURE_WITH_UNIT(LENGTH_MEASURE(0.01),#540,
'DISTANCE_ACCURACY_VALUE',
'Maximum model space distance between geometric entities at asserted c
onnectivities');
#538=(
GEOMETRIC_REPRESENTATION_CONTEXT(3)
GLOBAL_UNCERTAINTY_ASSIGNED_CONTEXT((#536))
GLOBAL_UNIT_ASSIGNED_CONTEXT((#540,#542,#543))
REPRESENTATION_CONTEXT('','3D')
);
#539=(
GEOMETRIC_REPRESENTATION_CONTEXT(3)
GLOBAL_UNCERTAINTY_ASSIGNED_CONTEXT((#537))
GLOBAL_UNIT_ASSIGNED_CONTEXT((#540,#542,#543))
REPRESENTATION_CONTEXT('','3D')
);
#540=(
LENGTH_UNIT()
NAMED_UNIT(*)
SI_UNIT(.MILLI.,.METRE.)
);
#541=(
LENGTH_UNIT()
NAMED_UNIT(*)
SI_UNIT($,.METRE.)
);
#542=(
NAMED_UNIT(*)
PLANE_ANGLE_UNIT()
SI_UNIT($,.RADIAN.)
);
#543=(
NAMED_UNIT(*)
SI_UNIT($,.STERADIAN.)
SOLID_ANGLE_UNIT()
);
#544=SHAPE_DEFINITION_REPRESENTATION(#545,#546);
#545=PRODUCT_DEFINITION_SHAPE('',$,#548);
#546=SHAPE_REPRESENTATION('',(#244),#538);
#547=PRODUCT_DEFINITION_CONTEXT('part definition',#552,'design');
#548=PRODUCT_DEFINITION('Wishbone','Wishbone v3',#549,#547);
#549=PRODUCT_DEFINITION_FORMATION('',$,#554);
#550=PRODUCT_RELATED_PRODUCT_CATEGORY('Wishbone v3','Wishbone v3',(#554));
#551=APPLICATION_PROTOCOL_DEFINITION('international standard',
'automotive_design',2009,#552);
#552=APPLICATION_CONTEXT(
'Core Data for Automotive Mechanical Design Process');
#553=PRODUCT_CONTEXT('part definition',#552,'mechanical');
#554=PRODUCT('Wishbone','Wishbone v3',$,(#553));
#555=PRESENTATION_STYLE_ASSIGNMENT((#557));
#556=PRESENTATION_STYLE_ASSIGNMENT((#558));
#557=SURFACE_STYLE_USAGE(.BOTH.,#559);
#558=SURFACE_STYLE_USAGE(.BOTH.,#560);
#559=SURFACE_SIDE_STYLE('',(#561));
#560=SURFACE_SIDE_STYLE('',(#562));
#561=SURFACE_STYLE_FILL_AREA(#563);
#562=SURFACE_STYLE_FILL_AREA(#564);
#563=FILL_AREA_STYLE('Steel - Satin',(#565));
#564=FILL_AREA_STYLE('Plastic - Glossy (Black)',(#566));
#565=FILL_AREA_STYLE_COLOUR('Steel - Satin',#567);
#566=FILL_AREA_STYLE_COLOUR('Plastic - Glossy (Black)',#568);
#567=COLOUR_RGB('Steel - Satin',0.627450980392157,0.627450980392157,0.627450980392157);
#568=COLOUR_RGB('Plastic - Glossy (Black)',0.0980392156862745,0.0980392156862745,
0.0980392156862745);
ENDSEC;
END-ISO-10303-21;
