<?xml version="1.0" encoding="utf-8"?>
<svg viewBox="453.906 32.558 406.478 597.547" style="enable-background:new 0 0 1366 768;" xmlns="http://www.w3.org/2000/svg">
  <g>
    <path d="M537.8,529.3c1.7-1.2,3-2,3.9-2.5c-2-6.4-4.1-12.2-5.6-18.1c-0.5-1.9-0.3-5.2,0.8-6.3c3.8-3.7,3.6-7.5,2.8-12.4 c-0.7-4.5,0.2-9.4,1-14c0.3-1.5,2.4-3.2,4-3.6c7.8-2,15.7-3.6,24.3-5.6c-1.1-4.3-2.4-9.5-3.7-14.7c-0.3-1.1-1-2.3-0.7-3.3 c2.8-10.8-1.9-20.2-4.2-30.1c-0.8-3.3-1.5-6.8-1.6-10.2c0-2.2,0.8-5.4,2.2-6.3c1.3-0.8,3.9,0.9,5.9,1.6c0.6,0.2,1.1,1,2,1.9 c4.7-10.3,11.3-17,22.8-12.7c4-12.1,7.9-24.1,11.9-36c0.9,0.1,1.8,0.2,2.7,0.4c0.1,2.2,0.8,4.6,0.3,6.6 c-3.1,10.7-6.8,21.3-9.7,32.1c-0.8,3,1,6.7,0.9,10c-0.1,2.9-1,5.9-1.9,8.7c-1,3.2-2.7,6.3-3.4,9.6c-0.5,2.5-0.6,5.6,0.2,8 c1.2,3.5,3.2,6.8,5.3,9.8c1.6,2.3,3.9,3.9,6.2,6.1c-1.3,0.9-1.7,1.4-2.2,1.4c-10.6,0.1-18.4-9.7-16.8-20.9c1-6.8,2-13.6,3.2-20.4 c0.6-3.2,0.1-6.6-2.8-6.8c-2.4-0.2-6.7,1.4-7.4,3.3c-2.1,6.3-4.6,13.4-3.9,19.8c0.9,9.1,4.5,17.9,6.9,26.8c0.6,2.4,1.8,4.9,1.4,7.1 c-1.3,8,3.9,13.9,5.5,21c0.2,0.8,2.8,1.3,4.4,1.4c1.2,0.1,2.5-1.1,3.6-0.7c1.8,0.5,3.4,1.8,5.1,2.7c-1.5,1.2-3,2.7-4.7,3.6 c-1,0.6-2.7-0.2-3.6,0.5c-2,1.4-3.6,3.3-5.4,5.1c1.4,1.6,2.8,3.3,4.2,4.9c0.4-0.3,0.8-0.6,1.2-0.9c0,2.7,0,5.4,0,9.6 c8.4-7.3,14.2-14.6,14.2-26.7c-4.2-3.9-9.3-9-14.7-13.8c-4-3.5-4.8-6.6-1.8-10.7c1-1.4,3.5-3,4.5-2.5c1.5,0.7,3,3.1,3.2,5 c0.6,5.5,10.1,17.1,14.7,17.7c6.2,0.9,9.2-3.6,11.2-8.5c2-5,3.3-10.5,4.2-15.9c0.7-4.2,2.5-6.5,6.3-7.4c3.7-0.9,4.8,2,6.4,4.7 c0.7,1.1,1.8,1.9,2.8,2.8c0.9-1.4,2.2-2.6,2.5-4.1c1.5-8.2,2.6-16.4,4.2-24.6c0.4-2,1.8-3.8,2.7-5.7c1.4,1.5,2.6,3.1,4.1,4.4 c3.7,3.3,7.6,6.6,11.4,9.7c0.2,0.2,1.1-0.6,0.6-0.3c-4.1-10.7-8-21-12.3-32.2c-1.8,2.3-3.2,4.2-4.8,5.9c-1.9,1.9-4.3,5.2-5.9,4.9 c-2.6-0.6-5.1-3.4-7.1-5.7c-1.3-1.6-2.3-3.9-2.6-6c-0.4-2.7-1-6.7,0.3-8c2.5-2.4,5.2-0.8,6.5,2.8c0.4,0.9,1.3,1.6,2.4,2.9 c1.8-4.9,1.6-8.1-1.9-12c-8.2-9.2-15.6-19.2-23.4-28.8c-1.1-1.4-2.3-2.8-4.6-3.7c0.5,1.8,0.6,3.9,1.4,5.4 c6.2,11.5,6.1,24.7,7.6,37.3c0.7,6.1-1.6,12.7-2.7,19c-1.2,7.3-2.8,14.6-3.8,22c-0.3,1.9,1.2,4.1,1.6,6.2c0.7,3.4,1.5,6.8,1.6,10.3 c0,1.2-2.2,3.6-3.1,3.4c-1.5-0.3-3.2-1.9-4.1-3.4c-4.8-8.4-0.6-16.8,0.3-25.3c1.2-11.4,1.6-22.8,2.7-34.2 c1.5-15.2-4.8-27.3-12.5-39c-3.9-5.9-7.1-12.3-10.4-18.6c-1.8-3.4-4.3-7.1-0.3-10.7c2.7-2.4,8.3-0.3,11,3.8c3.8,5.9,4.2,6,8.3,0.2 c8.1-11.6,14.8-24.2,18-38.5c0.6-2.8,0-6,0.2-8.9c0.2-2.3,0.9-4.5,2.3-6.7c4.3,5.8,3.2,12.1,2.3,18.1c-2.3,15.8-10.3,29-17.1,42.7 c-1.1,2.2-1.6,6.3-0.4,8.2c4.3,6.9,9.3,13.4,14.2,19.8c1.8,2.4,3.7,4.6,5.9,6.5c4.3,3.7,8.8,7,13.4,10.6c0.3-0.9,0.8-1.5,0.7-1.9 c-2.5-10.1,2-19.6,2.1-29.4c0.1-6.1-1.6-11.1-5.7-15.9c-3.6,7.2-5.8,14.3-5.7,22.1c0.1,4-0.5,8.3-4.6,7.6c-1.7-0.3-4.2-6.1-3.6-8.8 c2.1-10.6,4.9-21.1,8.3-31.3c1.4-4.1,4-8.4,9.3-8.3c1,0,2.4-1,2.9-2c4.4-8.1,5.4-16.7,3.5-26c-1.9-9.4-3.2-19-4.5-28.6 c-0.2-1.8,0.2-3.9,1-5.6c0.5-1,2.1-1.4,3.3-2.1c0.5,1.1,1.3,2.1,1.5,3.2c1,5.3,3.6,11,2.5,15.8c-2.3,10.6,4.2,19.1,4.1,28.9 c-0.1,3.3-0.6,7-2.1,9.8c-4.6,8.3-5.6,16.6-1.5,25.7c7.2-0.8,10.7-6.5,13.4-12.7c1.9-4.1,4.9-4.2,8-3.6c1.6,0.3,3.2,2.4,4,4.1 c0.5,1-0.2,3.5-1.1,4.2c-4.4,3.5-4.7,7.9-3.7,13.1c1.2,6.7,2.2,13.4,2.9,20.2c1,9.8,1.7,19.7,2.5,29.5c0,0.3,0.4,0.5,0.9,1.1 c1.9-3.9,3.6-7.8,5.8-11.4c1.9-3.2,3.4-8,8.2-6.2c4.7,1.8,7.6,10.1,6.2,15.1c-0.8,3-0.8,6.2-1.1,9.3c-0.8,7.2-1.6,14.3-2.4,21.5 c-0.4,3.8-0.6,7.7-0.9,11.5c0.5,0,1,0.1,1.4,0.1c0.1-1.8,0.2-3.6,0.5-5.3c0.9-5.5,3.7-7.3,8.8-5.7c17.9,5.7,16.9,11.4,9,28.2 c-0.6,1.3-1.5,2.4-2.6,4.2c8,3.4,15.6,6.4,23,9.9c3,1.4,5.3,4.5,8.3,6c5.4,2.7,11.3,4.5,16.7,7.2c8.1,4.1,16,8.4,23.8,13.1 c3.3,2,5.1,1.9,5.1-2.4c-0.1-6.1,0.8-12.5-5.5-16.8c-1.8-1.2-3.1-6.7-2.1-8.9c1-2.3,6.3-4.9,7.6-3.9c6.5,4.6,12.9,1.8,19,0.6 c4.5-0.8,7.2,0.5,9.5,4c2.4,3.6,5.3,4.6,9.2,3.6c4.8-1.3,10.1,2.3,10.4,7.3c0.1,1.7-1.7,4.3-3.3,5.3c-3.9,2.4-5.1,5.7-4.2,10.1 c1,4.8-0.3,7.9-4.3,10.4c-1.7,1-2.1,4.1-3.5,5.9c-3.9,5.1-8.5,9.7-11.9,15.2c-3.3,5.4-8.8,8.8-11.7,13.8 c-5,8.6-13.3,13.9-17.5,23.1c-1.6,3.5-5.9,3.1-9.1,0c-2.9-2.8-4.3-5.5-0.5-9c1.9-1.8,3.5-4.1,5.2-6.1c-0.4-0.4-0.7-0.7-1.1-1.1 c-2.5,3.1-4.7,6.5-7.5,9.3c-2.7,2.7-5.8,4.8-9,6.8c-0.5,0.3-2.8-1.2-2.8-1.7c0.1-1.7,0.5-3.8,1.5-5.1c2.8-3.7,6-6.9,8.7-10.6 c0.5-0.7-0.8-4.1-1.3-4.1c-11.4-0.2-22.7-0.2-34.1-0.2c0,2.7-0.8,5.6-5.2,7c-5.8,1.7-11.2,4.1-11.8,12.5c-0.2,3.6-3.3,6.3-7.2,6 c-3.3-0.3-5.4-2-6.4-5.7c-2.6-9.3-5.4-18.6-14.5-23.2c-1.1-0.5-1.7-2.4-3.2-3.2c-1.6,4.5-2.1,8.5,1,12.3c1.3,1.6,3.1,4.6,2.6,5.6 c-1,1.9-3.4,3.4-5.5,3.9c-6.9,1.6-13.8,1.9-20.2-2.5c-2.9-2-6.4-2.1-7.8,1.4c-1.2,2.9-1.1,6.8,2.7,8.8c1.7,0.9,3.2,2.4,5.7,4.3 c-3.6,3.2-6.8,5.9-11.5,9.9c3.4,0,5.6,0.3,7.7-0.1c6.6-1.1,13.1-2.6,19.6-3.5c9.4-1.3,18.8-2.2,28.2-3.3c1.6-0.2,3.3-0.1,4.6-0.8 c4-2.2,7.1-1.5,8.8,1.4c6.7-3,12.7-6.3,19-8.4c7.3-2.5,14,1.1,20.4,4.4c1.2,0.6,1.6,4.2,1.4,6.2c-0.3,3.1-1.3,6.2-2.2,9.2 c-0.5,1.7-0.9,4-2.1,4.8c-9.6,6.7-20.4,9.7-31.3,12.7c-1.5,0.4-3.2,0.4-4.7,0.2c-5.5-0.5-6.7-2.9-4.5-8.4c1.1-2.6,3.4-5.4-0.1-7.9 c-1.5,0.9-2.8,2.2-4.4,2.7c-11.4,3.4-22.9,6.9-34.4,9.7c-8.4,2-17,2.9-25.5,4.6c-3.7,0.7-7.3,2.7-11,3c-7.5,0.6-10.5-5-7.1-12.1 c-1.8-1-4.3-1.5-5-3.1c-0.6-1.3,1.1-3.7,2.1-6.3c-2.6-0.5-5.7-2.1-8.5-1.5c-7.3,1.7-10.5-3.7-14.5-8.4c-3.9-4.7-7.2-9.7-8.4-16.1 c-0.3-1.8-1.9-3.3-2.9-4.9c-6.5,5.7-9.7,3.8-11.6-7.6c-1.9,0.7-4.1,0.9-5.5,2.2c-4.9,4.6-9.4,9.8-14.3,14.4 c-2.3,2.2-5.2,3.6-7.8,5.3c1.3,5.8,2.8,9.9,9.7,10c3.1,0.1,5.9,5.3,9.2,7.8c1.8,1.4,4.1,2.4,6.3,2.6c6.9,0.6,13.9,0.9,20.9,1.1 c2,0.1,4.1-0.6,6.1-1.2c5.3-1.5,8.3,0.8,8.4,6.7c0.1,2.5-0.5,5-0.1,7.4c0.3,1.8,1.7,3.5,2.7,5.1c1.2,1.9,3.8,3.9,3.5,5.4 c-0.3,2-2.6,4-4.5,5.1c-5.2,3.1-10.5,6.1-16.1,8.3c-2.5,1-6,0.5-8.7-0.4c-2.9-1-5.7-2.9-8.1-4.9c-6.8-5.7-13.5-11.5-11.9-22.6 c0.4-2.8-1.1-4.2-4-4.8c-11.1-2.2-23.1-2.8-33.1-7.8c-10.1-5.1-20.3-2.8-30.2-5.5c-1-0.3-2.4,0.3-3.5,0.8 c-6.8,2.7-13.5,5.7-20.3,8.3c-3.2,1.2-5-0.9-6.6-3.9c-4.2-7.8-9-15.2-13.3-22.9c-1.3-2.2-2.5-4.9-2.5-7.4c0-1.1,3-3.1,4.7-3.2 c5.7-0.3,6.6-6.5,10.3-9.2c1.1-0.8,2.1-2.4,3.3-2.5c5.5-0.5,7.3-4.6,9.4-9.3c2.7-5.9,6.4-11.3,9.7-17c0.8,0.5,1.7,1,2.5,1.6 c-2.2,9.4-9,16.5-12.9,25.5c4.6,0,8.7,0.4,12.8-0.1c3.1-0.4,6.6-1.3,7.8,2.4c0.6,1.9-1.4,4.9-2.2,7.3c-0.5,0.1-1,0.3-1.5,0.4 c3.2,4.4,6.4,8.9,9.6,13.3c0.3,0.4,1.1,0.8,1.4,0.6c8.1-4.1,14.8,3.2,22.4,3c1.2,0,2.4,0,5.2,0c-2.2-1.9-3.3-2.8-4.4-3.7 c-2.7-2.2-6-3.8-7.8-6.7c-1.8-3-3.6-4.3-6.7-4.1c-3.6,0.3-4.2-2.2-4.3-5.5c-0.2-5.1-0.9-10.2-0.9-15.2c0-0.9,2.3-2.7,3.3-2.6 c1.1,0.1,2.3,2,2.9,3.3C536.2,523.3,536.8,526.1,537.8,529.3z M680.8,474.6c-3.5-4.6-7.1-9.2-11.1-14.4c-0.8,1.9-1.5,2.8-1.5,3.7 c-0.1,6.2,4.3,9.9,12.7,10.5c-1.6,4.2-2.2,9-7.7,9.7c-1.7,0.2-3.2,1.8-4.8,2.8c1.7,0.6,3.5,1.7,5.2,1.8c5.5,0.1,11.4-1.7,15.7,4.1 c4.2,5.8,9.9,9.9,12.6,17.4c3.2,8.5,8.5,16.1,12.8,24.2c1.4,2.7,2.7,2.7,5.1,1.1c4.7-3.2,9.7-5.9,14.9-9c-2.8-4.3,1.8-5.3,2.6-6.7 c-12.3-16.6-24.6-33.2-37.1-49.9C693.5,479.4,688.3,480.5,680.8,474.6z M653.1,559.1c-0.9-3.2-2.3-6-2.4-8.9 c-0.2-7.7,0.2-15.3,0.2-23c0-5,0.3-10-0.4-14.9c-0.4-2.7-2.4-6.8-4.2-7.1c-6.9-1.4-4.2-7.2-4.6-10.9c-0.2-2.1,2.4-4.9,4.3-6.9 c3.8-4,7.9-7.6,11.8-11.6c0.7-0.8,0.7-2.5,0.8-3.8c0.6-6.7,1.3-13.3,1.6-20c0.3-6.6,0.9-13.4-5.1-20c-0.7,5.8-1.2,10.1-1.7,14.4 c-1.2,10.3-3.2,20.2-12.6,25.6c-12.2,7.1-14.9,21.7-6.2,32.3c-0.2,2.8-0.8,5.2-0.6,7.5c0.4,4.1,2,8.3,1.6,12.4 c-0.8,8.6-2.7,17-3.7,25.6c-0.3,3-0.2,8.1,1.3,9C639.4,562.3,646.3,562.9,653.1,559.1z M676.6,337c-0.5-0.2-1-0.4-1.5-0.6 c-0.9,1-2.3,2-2.5,3.1c-3.4,19.5-11.8,38.5-6.5,59.1c1.8,6.8,2.4,14.1,7.4,21.3c1.3-4.1,2.5-6.8,3.1-9.6c2-8.3,5.5-16.8,5.2-25 C681.3,369.1,678.5,353.1,676.6,337z M595.5,508.9c-0.4-0.6-0.7-1.2-1.1-1.8c-9.3,0.2-7.2-10.2-13-15.3 c-9.1,8.1-18.4,16.4-27.7,24.6c0.3,0.4,0.5,0.8,0.8,1.2c4.1-2.3,8.2-4.7,12.3-6.9c4.2-2.2,8.4-4.2,12.7-6.3 c0.4,0.9,0.9,1.7,1.3,2.6c-2.1,1.7-4.2,3.4-6.4,4.9c-4.1,3-10.4,5-11.7,9c-2.1,6.2-5.8,9.6-9.8,13.5c-0.8,0.8-1,3.5-0.4,4.6 c2.5,4.3,8,5.1,12.1,1.5c7.9-7,15.7-14.1,23.3-21.5C590.9,516.2,593,512.3,595.5,508.9z M754.2,493.9c2.4,1,5.6,1.7,7.9,3.5 c6.8,5.5,13.6,7.7,21.4,2.5c3.3-2.1,5.3-8.3,2.7-10.5c-3-2.5-6.2-5.5-9.7-6.4c-10.4-2.9-21-4.9-31.5-7.4c-1.4-0.3-3-1.2-4-2.3 c-3.1-3.3-3-3.4-7.1-0.8C740.7,479.4,749.9,483.9,754.2,493.9z M696.7,466c7.7-4.7,9.9,1.8,12.9,5.2c8.7,9.9,16.8,20.4,25.4,30.4 c1.9,2.2,4.8,6.5,7.6,2.9c2.9-3.8-1.8-5.6-3.9-7.8c-3.2-3.5-6.3-7-5.8-12.8c2,0.1,3.6,0.2,5.2,0.3c-15.3-8.8-29.7-18.8-43.3-31.5 C695.4,457,696,461,696.7,466z M679.6,430.9c8.9-0.1,11.8,6.1,14.9,13.9c2.2-7,5.2-11.4,3.3-17.5c-3.3-10.7-6.2-21.5-9.4-32.7 C685.7,406.2,682.8,417.9,679.6,430.9z M563.4,479.7c0-0.6-0.1-1.2-0.1-1.8c-2.4,0.4-5.2,0.3-7.1,1.5c-1.6,1-2.2,3.7-3.3,5.7 c1.6,0.4,3.4,1.5,4.8,1.1c5.3-1.3,7.3-0.2,9.3,6.5c-4.6,2.1-9.3,4.2-13.9,6.3c2.4,5.9-8.3,7.3-4.5,14c9.7-8.7,19-17.2,28.4-25.7 c-0.8-3.2-1.8-6.1-6.3-5.5C568.3,482.2,565.8,480.5,563.4,479.7z M688.2,467.9c-1.5-8.5-2.7-16.1-4.4-23.4 c-0.4-1.6-3.3-3.5-4.9-3.3c-3.4,0.3-7.2,1.2-9.9,3.4c-1.4,1.1-0.8,5.2-1,8c0,0.5,0.2,1.1,0.4,2.1 C678.7,451.2,679,465.4,688.2,467.9z M661.2,500.6c0.4,3.5,0.6,5,0.7,6.5c0.2,4.1,0.2,8.3,0.6,12.3c0.1,1,1.3,2,2.1,2.9 c0.9-0.9,2.2-1.6,2.7-2.7c1.7-3.6,3.4-7.4,4.7-11.2c0.4-1.2-0.4-3.8-1.3-4.3C668,502.6,665,501.9,661.2,500.6z M714.4,459 c-5.8-10.2-5.4-13.3,3.3-21c3.2-2.8,4.4-7.2,3.4-9.4c-5.3,5.4-10.8,11-16.3,16.5c-2.1,2.1-3.2,4.4-0.3,6.6 C707.7,454.4,711.1,456.6,714.4,459z M832.7,476.3c-0.7-4.7-1.9-6.5-5.7-6.1c-1.8,0.2-4.7,1.6-5,3.1c-0.8,3.3,4.8,11.5,6.3,10.3 C830.3,482,831.3,478.8,832.7,476.3z M799.6,489.2c-1,5.5-1.8,10.1-2.6,14.7c0.5,0.3,0.9,0.6,1.4,0.8c2.9-3.3,5.8-6.6,9-10.2 C804.1,492.4,802.1,491,799.6,489.2z M611.1,522.6c2.7-6.6,5.5-12.6,7.7-19c0.6-1.9-0.6-4.5-1-6.8c-1.4,3.4-1.1,7.3-2.7,8.7 C609.6,510.2,609.4,515.7,611.1,522.6z M613.6,588.1c-7-4.5-10.1-3.8-13.3,3.4C605.1,590.2,609,589.2,613.6,588.1z M780.1,516.2 c-0.2-0.5-0.4-1.1-0.6-1.6c-4.5,2-9,4.1-14.9,6.8C771.6,521.9,776.5,521,780.1,516.2z M725.1,565.7c-0.1-0.6-0.2-1.2-0.2-1.9 c-3.8,0.4-7.7,0.8-11.5,1.2C717.2,565.8,721.2,570.7,725.1,565.7z M763.1,512.9c0.1-0.9,0.3-1.8,0.4-2.7c-2.5-0.6-5-1.2-7.5-1.8 c0,1.4-0.2,3.9,0,3.9C758.4,512.7,760.8,512.7,763.1,512.9z M499.7,559.7c-2.6-1.2-3.7-2.2-4.6-2c-1.1,0.2-2,1.4-2.9,2.2 c0.9,1,1.7,2.7,2.6,2.7C495.9,562.6,497.1,561.3,499.7,559.7z"/>
    <path d="M613.7,194c0.9-3.8,1.3-7.1,2.5-10c0.8-2,2.8-3.4,4.3-5.1c0.7,1.7,1.2,3.5,2.1,4.9c4,5.8,5.1,12.5,5.6,19.3 c0.5,7.8,0,15.7,0.8,23.4c0.9,9.7,2.8,19.3,4.1,29c0.2,1.5-0.7,3.1-1,4.6c-0.9-1.1-2.3-2-2.6-3.2c-2.5-12.6-4.8-25.2-7.1-37.9 c-0.9-5.2-1.2-10.5-2.2-15.7c-0.4-2.3-1.8-4.3-3.6-5.9c0.6,11.7,1,23.5,1.7,35.2c0.1,2.1,1.4,4.2,1.7,6.3c0.2,1.9,0.5,4.7-0.5,5.7 c-2.3,2.5-4.6,0.4-5.3-2c-1.6-5.2-2.7-10.6-3.9-16c-2-9.7-4-19.4-5.8-29.1c-0.4-2,0.3-4.3,0.4-6.4c2,0.3,4,0.5,6,1 C611.7,192.6,612.4,193.2,613.7,194z"/>
    <path d="M583.5,250.4c-1-3.6-2.5-6-1.9-7.4c2.4-5.9,5.4-11.6,8.1-17.3c0.7-1.5,1-3.6,2.1-4.5c1.3-1,3.4-1.4,5-1.1 c0.8,0.2,1.9,3,1.6,3.9c-2.6,6.7-5.3,13.3-8.4,19.7C588.9,245.8,586.6,247.2,583.5,250.4z"/>
    <path d="M594.4,279.9c5.3-2.2,6.8-1.2,5.9,4.7c-1.1,7.4-2.3,14.7-3.7,22c-0.3,1.5-1.6,2.7-2.4,4c-1.1-1.3-3.1-2.7-3-4 c0.4-6.2,1.3-12.4,2.1-18.6C593.6,285.6,594,283.1,594.4,279.9z"/>
    <path d="M610.8,114.6c-4.1,4.9-5,9.7-3.1,15.3c0.6,1.6,0.3,3.9-0.3,5.6c-0.5,1.3-2,2.8-3.2,2.9c-1.2,0.1-3.2-1.3-3.5-2.4 c-1.4-6.8-3-13.7-3.4-20.7c-0.3-5.1,4.8-7.2,8.6-4.2C607.3,112.1,608.8,113.1,610.8,114.6z"/>
    <path d="M664.1,164.7c-2.9,11.4-1.8,21.4,2.1,31.1c0.3,0.8-0.7,3.4-1.3,3.5c-1.5,0.3-4.4,0-4.6-0.8c-3.1-11.1-8.6-21.7-5.4-34.1 c1-3.9,3.6-4.8,6.2-4.5C662.3,160.2,663.3,163.3,664.1,164.7z"/>
    <path d="M629.3,57.1c-0.3,3.1-0.5,6.2-0.9,9.3c-1.6,11.6,1,22.7,3.2,33.9c0.5,2.7,1.3,5.5-1.9,5.6c-1.7,0.1-4.9-2.4-5.1-4 c-1.3-9.7-2.1-19.6-2.5-29.4c-0.2-3.5,0.8-7.2,1.7-10.6c0.5-2.1,1.8-3.9,2.8-5.9C627.5,56.4,628.4,56.7,629.3,57.1z"/>
  </g>
</svg>