<?xml version="1.0" encoding="utf-8"?>
<svg viewBox="136.792 142.156 1132.649 278.054" style="enable-background:new 0 0 1366 768;" xmlns="http://www.w3.org/2000/svg">
  <defs>
    <style type="text/css">
	.st0{stroke:#000000;stroke-miterlimit:10;}
	.st1{stroke:#000000;stroke-width:0.5;stroke-miterlimit:10;}
</style>
  </defs>
  <g>
    <path class="st0" d="M561.2,316.1c10.9-19.3,30-35.7,51-50.5C594.9,282.7,577.4,300.1,561.2,316.1z"/>
    <path class="st0" d="M598.1,267c-8.5,7.8-17.1,15.5-25.6,23.3c0,0-0.1,0-0.1-0.1c8.6-7.8,17.2-15.6,25.7-23.5 C598.2,266.8,598.1,266.9,598.1,267z"/>
    <path class="st0" d="M841.2,317.9c-3.8-7.5-7.7-15.1-11.5-22.6c0.6-0.2,1.1-0.4,1.7-0.5c3.7,7.6,7.5,15.2,11.2,22.7 C842.1,317.7,841.7,317.8,841.2,317.9z"/>
    <g>
      <path d="M704.6,378.2c-2-0.1-3.9-0.2-5.9-0.3c-0.3,0-0.7,0-0.9-0.1c-0.3-0.2-0.5-0.5-0.8-0.7c0.4,0,0.8,0,1.2,0 c0.7,0.1,1.5,0.2,2.2,0.3c0-0.1,0.1-0.1,0.1-0.2c-0.5-0.1-1.1-0.3-1.6-0.4c-1.2-0.3-1.6-0.9-1.6-1.5c-0.1-0.6-0.1-1.2-0.2-1.7 c-0.1-0.3-0.2-0.6,0.6-0.7c0.1,0,0.2,0,0.3,0c2.6-1.3,2.6-1.3,5.8-1.8c1.9-0.3,2.6-1,2.8-2c0.3-1.4-0.3-2.7-1-4.1 c-0.6-1,0.2-2.6,1.8-3.3c0.2-0.1,0.5-0.3,0.5-0.5c-0.2-0.6,0.4-0.8,1.3-1c5-1.1,10-2.2,15.1-3.3c0.4-0.1,0.8-0.1,1.2,0 c-5.4,1.3-10.7,2.6-16.1,4c0.1,0.1,0.1,0.2,0.2,0.2c3.4-0.8,6.8-1.6,10.2-2.4c0.1,0.1,0.1,0.1,0.2,0.2c-0.3,0.1-0.6,0.3-0.9,0.4 c0.1,0.1,0.3,0.3,0.4,0.4c-0.1,0.1-0.2,0.1-0.3,0.2c-1.5,0.5-3.1,1-4.6,1.5c-0.6,0.2-1.2,0.4-1.7-0.1c-0.1-0.1-0.5-0.1-1-0.2 c0.8,0.9,1.6,1,2.8,0.7c2.7-0.7,5.5-1.4,8.2-2c1.3-0.3,2.7-0.4,4.1-0.6c0,0.1,0.1,0.1,0.1,0.2c-1.2,0.3-2.4,0.5-3.6,0.8 c-2.9,0.8-5.9,1.6-8.8,2.4c-1.5,0.4-1.7,1.2-0.9,2c0.2,0.1,0.4,0.3,0.4,0.5c0,1.9,2.2,3.1,4.4,4.3c0.6,0.3,1.5,0.6,0.1,1.2 c0.6,0.1,1.1,0.1,1.5,0.2c1,0.2,1.9,0.4,2.9,0.6c0.6,0.1,1.3,0.1,2,0.2c0.4,0,1,0.1,1.1,0.3c0.4,0.5,0.8,1,0.8,1.5 c0.2,1.4,0.4,2.9-0.4,4.3c-0.3,0.5-0.3,1.1-0.8,1.6c0.4-1.9,0.7-3.9,0.1-5.8c-0.7,0.9-1.1,2.9-0.7,4c0.1,0.3-1.1,1.7-1.6,1.8 c-0.2,0-0.4,0-0.5,0c-0.9-0.6-1.9-0.3-3-0.3c-0.8,0-1.5-0.2-2.3-0.2c-4,0.2-8,0.4-11.9,0.6c-0.4,0-0.8,0-1.2,0.1 C704.5,378.8,704.5,378.6,704.6,378.2z M708.8,375.7c-0.9-0.1-1.6-0.4-2.1-0.3c-0.4,0.1-0.8,0.5-0.9,0.9c-0.5,1.3-0.4,1.3,1.8,1.2 c1.9-0.1,3.7-0.1,5.6-0.1c0.3,0,0.6,0,0.9,0.1c0.7,0.1,1.3,0.3,2,0.3c1.6,0,3.3,0,4.9,0c1.7,0,2-0.2,1.8-1.1 c-0.1-0.3-0.4-0.7-0.5-1c-0.2-0.5-0.5-1-0.5-1.5c0-0.6,0.2-1.2,0.5-1.7c0.5-0.9,0.2-1.2-1.4-1.2c-1.5,0-3,0.1-4.5,0.2 c-0.5,0-1.1,0.4-1.4,0.3c-1.5-0.4-1.5,0.3-2,0.8c1.9,0.1,3.7,0.1,5.5,0.2c0,0.1,0,0.2,0,0.3c-1.6,0-3.2,0-4.8,0 c-1.8,0-2.3,0.3-2,1.4c-0.7,0-1.4,0.1-2.1,0.1C709.3,375.1,709,375.5,708.8,375.7z M703.5,372.2c-1.2,0-2.2,0-3,0.1 c-0.5,0.1-1,0.5-1.2,0.8c-0.3,0.7-0.2,1.4-0.4,2.1c-0.2,0.7,0.3,1,1.6,1.2c0.2-0.6,0.4-1.1,0.6-1.7c-1.2-0.4-1.1-0.4-0.2-1.1 c0.5-0.4,0.8-0.7,1.7-0.7C702.9,372.9,703.1,372.5,703.5,372.2z M708.1,372.8c3,0.2,4.3-0.1,4.3-1.1c-1,0-1.9,0.1-2.9,0.1 C708.2,371.8,708,372.2,708.1,372.8z M704.9,375.5c-1.1,0.5-3.1-0.4-3.1,0.9c0,0.7,1.5,0.7,2.2,0.6 C705.2,376.9,704.7,376.2,704.9,375.5z M704.3,372.9c1,0,1.9,0,2.9,0c0.1-0.4,0.2-0.7,0.3-1C705.8,371.7,704.8,372,704.3,372.9z M707.1,373.7c0.1,0.1,0.2,0.3,0.3,0.4c0.6-0.1,1.1-0.2,1.7-0.3c-0.1-0.2-0.3-0.5-0.3-0.5C708.1,373.5,707.6,373.6,707.1,373.7z M705.4,374.9c0-0.1-0.1-0.3-0.1-0.4c-0.9,0-1.7,0.1-2.6,0.1c0,0.1,0,0.2,0.1,0.3C703.7,375,704.5,375,705.4,374.9z M706,373.8 c0-0.1,0-0.1,0-0.2c-0.8,0-1.6,0-2.4,0c0,0.1,0,0.1,0,0.2C704.4,373.8,705.2,373.8,706,373.8z M722.8,375.2c0.1,0,0.1,0,0.2,0 c0-0.6,0-1.2,0-1.8c-0.1,0-0.1,0-0.2,0C722.8,374.1,722.8,374.7,722.8,375.2z"/>
      <path d="M729.9,357.6c-1.2-0.3-2.4-0.5-3.9-0.9C728,356.7,730,357.2,729.9,357.6z"/>
      <path d="M293.6,342.7c0.5-1,3.7-1.4,3-3.8c0-0.1,1.6-0.7,2.4-0.7c5.5,0.1,11.1,0.3,16.6,0.4c6.3,0.1,12.6,1.3,19,0.2 c3.1-0.5,5.5,0.6,7.5,2.5c6.5,6.1,11.4,13,16.8,19.7c0.5,0.6,1.2,1.2,1.6,1.9c0.4,0.8,0.9,1.9,0.6,2.6c-0.2,0.5-1.9,0.5-3,0.7 c-0.4,0.1-0.9,0-1.6,0.1c0,2.5-0.1,5-0.1,7.6c-0.1,2.4,0,4.8-0.3,7.2c-0.2,1.6,0,2.9,2.6,3.4c-0.1,0.2-0.1,0.4-0.2,0.6 c-1.3,0.1-2.6,0.4-3.9,0.4c-5.7,0-11.4-0.1-17.1,0c-8.7,0.2-17.4,0.7-26.2,0.8c-8.6,0-17.1-0.5-25.7-0.5c-5.2,0-10.3,0.5-15.5,0.8 c-4.4,0.3-8.8,0.6-13.3,0.9c-2.5,0.2-5.1-0.2-7.2,1.6c-0.7,0.6-2.7,0.6-4.1,0.6c-15.3-0.6-30.1,1-44.7,4.2 c-7.6,1.7-15.5,1-23.1-0.8c-9-2.1-18-4.2-27-6.4c-2.1-0.5-3.1-0.1-3.2,1.6c0,0.3,0,0.6-0.2,0.8c-0.6,0.4-1.3,0.8-1.9,1.2 c-0.3-0.6-0.9-1.2-0.7-1.7c0.6-2.2,1.5-4.3,2.2-6.4c0.4-1.3,1.3-2.8-0.9-3.8c4.2-2.1,4.2-9.7,3-12.4c1.6-1.6,3.1-2.8,4.4-4.2 c4.3-4.5,8.6-9.1,12.9-13.7c2.4-2.6,4.8-5.1,7.5-8c-1.3-0.1-2-0.2-3.2-0.3c2.9-1,5.2-1.7,8.3-1.4c4.6,0.5,9.3,0.2,13.9,0.4 c10.1,0.4,20.2,0.8,30.2,1.3c0.8,0,1.7,0.1,2.5,0c2.6-0.4,4.5-0.1,5.9,1.8c0.9,1.1,2.6,1.5,4.3,0.8c1.9-0.7,3.9-1.2,5.6-2.1 c5.1-2.5,10.2-4.1,16.7-3.2c9.5,1.4,19.3,2,28.9,3c0.7,0.1,1.5,0.1,2.1,0.3C290.5,341,291.8,341.7,293.6,342.7z M223.3,342.8 c-0.2-0.2-0.4-0.4-0.5-0.6c-0.8-0.1-1.6-0.3-2.4-0.3c-6.8-0.3-13.6-0.6-20.4-0.9c-6.3-0.3-12.5-0.6-18.8-0.7 c-4.9-0.1-5.1,0.2-7,3.9c1-0.6,1.8-1,2.7-1.5c0.2,0.1,0.4,0.2,0.6,0.3c-0.5,0.8-0.9,1.6-1.4,2.4c-1.3,2.1-5.1,3.7-3.1,6.7 c0.1,0.1-0.2,0.4-0.2,0.6c0,0.8-0.1,1.7-0.1,2.5c0.2,0,0.4,0,0.6,0.1c-0.4,0.6-0.9,1.3-1.4,2c0.9-0.1,1.6-0.1,3-0.2 c-1.5,2.8-2.9,5.2-4.2,7.6c6.4,0.1,13,0.4,19.6,0.3c1.5,0,3.3-0.7,4.4-1.5c5.9-4.1,11.7-8.2,17.5-12.4 C215.9,348.2,219.6,345.5,223.3,342.8z M285.3,341.9c0.2,0.1-0.2-0.1-0.6-0.1c-10.9-1-21.8-2-32.8-2.9c-1.9-0.1-3.6,0.2-4.2,2.3 c-0.5,1.9,1.2,2.9,1.8,4.2c-1.9,1.3-3.7,2.6-5.5,3.9c3.7-1.8,3.7-1.8,5-1.2c-0.1,1.8-0.2,3.3-0.2,4.8c0.7,0,1.4,0,1.7,0 c0.4,0.9,0.7,1.7,1.2,2.9c-0.8,0.6-2,1.4-2.9,2.3c-0.4,0.4-0.7,1.2-0.4,1.6c0.9,1.5,2,2.9,3.1,4.2c1.3,1.5,2.9,1.7,4.8,0.5 c2-1.3,3.9-2.6,5.8-3.9c3.6-2.6,7.4-5,10.7-7.7C277.2,349.3,281.2,345.5,285.3,341.9z M310.3,364.1c8-7.5,16-14.9,24.4-22.6 c-1.9-0.3-3.1-0.5-4.4-0.6c-1.6,0-3.3,0.2-4.9,0.2c-7.6-0.3-15.2-0.6-22.8-0.9c-2.2-0.1-3.7,0.4-4.2,2.2c0.7,0.3,1.5,0.6,2.3,1 c-0.6,1.1-1.2,2.1-1.8,3.1c0.2,0.1,0.4,0.1,0.6,0.2c0.4-0.4,0.6-1.1,1.2-1.2c0.6-0.2,1.6-0.1,2.2,0.1c0.6,0.2,1.1,0.8,1.8,1.4 c-0.3,0.5-0.8,1.3-1.3,2.3c1-0.3,1.8-0.5,2.7-0.7c0.2,0.6,0.4,1.1,0.5,1.5c0.4,1.5,0.1,3.5,1.3,4.4c2.3,1.8,0.9,3.6,1.4,5.4 c-0.3,0.1-0.7,0.1-1,0.2c-1-2.5-1.9-5-2.9-7.4c-2.3,3.5-1.8,5.4,1.7,8.2C308.2,361.8,309.1,362.9,310.3,364.1z M230.5,343.5 c-0.5,0.1-0.9,0.2-1.4,0.3c-0.8,2.9-1.9,5.8-2.4,8.7c-0.7,3.9-1,7.8-1.3,11.8c0,0.6,1.1,1.7,1.7,1.7c6.5-0.1,13.1-0.3,19.6-0.5 c1.8-0.1,2.2-0.8,1.3-1.9c-1.7-2.1-3.4-4.2-5.1-6.3c-1.7-2.1-3.5-4.1-5.4-6.2C235.2,348.6,232.8,346.1,230.5,343.5z M338.1,341.2 c-0.4,1.2-0.7,2-0.8,2.8c-0.4,4.9-0.7,9.8-1.1,14.7c-0.3,3.9,0.4,4.4,5.7,4.6c0.2,0,0.4,0,0.5,0c4.9,0.2,9.8,0.3,15.2,0.5 C351.6,355.9,346.9,347.9,338.1,341.2z M150.6,383.3c-0.1,0.2-0.2,0.5-0.2,0.7c3.9,0.5,7.9,1,11.8,1.5c1.4,0.2,2.9,0.3,4.3,0.6 c6.5,1.2,13,2.4,19.6,3.7c1.4,0.3,2.3,0,2.6-1.1c0.6-2.8,1.3-5.6,1.8-8.3c0.1-0.6-0.3-1.5-0.8-1.7c-2.4-0.8-4.8-1.7-7.3-2.1 c-6.3-0.9-12.7-1.6-19.1-2.3c-3.4-0.4-6.9-0.6-10.4-1c-0.1,0.2-0.3,0.5-0.4,0.7c0.9,0.4,1.8,1,2.8,1.1c5.9,0.8,11.9,1.4,17.8,2.1 c5,0.6,10.1,1.2,15.1,1.9c0.5,0.1,1.3,0.5,1.3,0.8c0,0.3-0.6,0.8-1.1,1c-0.6,0.2-1.4,0.2-2.1,0.1c-8.4-1.1-16.8-2.2-25.3-3.3 c-0.6-0.1-1.3-0.2-1.9-0.2c-0.6,0-1.2,0-1.8-0.1c10.2,2.7,21.4,2.1,31.5,5.4c-0.6,1.5-1.5,1.8-3.5,1.3c-3.1-0.8-6.2-1.4-9.4-1.9 c-6.2-1-12.5-1.9-18.7-2.7c-1.5-0.2-3.1-0.4-4.6-0.4c-0.7,0-1.6,0.7-2,1.3c-0.1,0.2,0.8,1,1.4,1.3c0.9,0.3,1.9,0.4,2.9,0.5 c8.3,1.1,16.7,2.2,25,3.5c2.3,0.3,4.5,1.1,6.7,1.7c-0.1,0.3-0.2,0.6-0.3,0.9c-1.9-0.1-3.9-0.2-5.8-0.4c-1.4-0.1-2.8-0.5-4.3-0.7 c-3-0.5-6-0.9-9-1.3C161.6,384.9,156.1,384.1,150.6,383.3z M274.4,379.4c0.1,1.1,0.1,1.6,0.1,2.2c0.2,2.5,0.9,3.1,4.3,3 c2.4-0.1,4.7-0.3,7-0.6c0.7-0.1,1.6-0.7,1.8-1.2c1.2-4.3,2.3-8.5,3.4-12.8c0.3-1.2-0.4-1.6-1.9-1.6c-3.7,0-7.5,0-11.2-0.1 c-2.3-0.1-3,0.7-3.1,2.3C274.8,373.7,274.6,376.8,274.4,379.4z M260.6,364.8c0.2,0.2,0.4,0.3,0.6,0.5c6.4,0.2,12.8,0.4,19.2,0.7 c2.6,0.1,3.3-0.8,3.4-2.5c0.2-3.5,0.4-6.9,0.7-10.4c0.2-2,0.6-4,0.9-6.4C276.8,353,268.7,358.9,260.6,364.8z M223,346.5 c-6.3,3.3-25.3,17.4-26,19.4c5.4,0.1,10.8,0.2,16.1,0.3c1.9,0,3.1-0.5,3.6-1.9c1.8-4.9,3.7-9.8,5.5-14.7 C222.6,348.6,222.7,347.7,223,346.5z M216.2,378.2c-0.1,0-0.2,0-0.3,0c0.1,2.6,0.2,5.2,0.5,7.8c0.1,0.7,0.8,1.8,1.6,2 c3.6,1,7.2-0.9,7.2-3.7c0-3.8-0.3-7.6-0.6-11.4c-0.3-4.4-0.3-4.3-6.2-4.6c-2.4-0.1-2.8,0.6-2.7,2 C215.9,372.9,216,375.6,216.2,378.2z M304.2,365.8c-1.7-6.6-7.8-15.4-12.8-18.8c-0.1,2.6-0.3,5.3-0.4,8c-0.1,3.1-0.3,6.3-0.3,9.4 c0,0.6,0.8,1.7,1.2,1.7C295.9,366.1,300,365.9,304.2,365.8z M334.2,345.8c-0.2-0.1-0.4-0.1-0.6-0.2c-6.4,6-12.9,12.1-19.3,18.1 c0.1,0.2,0.3,0.3,0.4,0.5c4.5-0.1,9.1-0.2,13.6-0.5c0.7,0,1.6-0.9,1.8-1.4C331.5,356.8,332.8,351.3,334.2,345.8z M334.7,374.1 c-0.1,0-0.3,0-0.4,0c-0.1-0.9-0.1-1.9-0.2-2.8c-0.3-5.5-0.6-5.7-7.9-5.3c-1.6,0.1-2.4,0.4-1.8,1.7c0.5,1.3,0.7,2.6,1.2,3.9 c0.5,1.3,1.3,2.6,1.5,3.9c0.3,2-0.1,4.1,0.2,6.1c0.1,0.6,1.4,1.4,2.2,1.4c1.4,0.1,3.6,0.8,4-1.1 C334,379.4,334.3,376.7,334.7,374.1z M228.2,386.2c0.1,0.3,0.2,0.5,0.3,0.8c0.2,0.1,0.5,0.2,0.7,0.2c5.5,0,10.9,0,16.4-0.2 c0.6,0,1.6-0.7,1.7-1.2c0.4-2.2,0.6-4.4,0.7-6.6c0.1-1.3-1-2-2.8-1.8c-5.4,0.5-10.9,1.1-16.9,1.8c6.2,2.1,11.9-1.1,18.1,0 c-1,0.5-1.5,0.7-2.1,1c0.7,0.6,1.2,1,2.1,1.7c-1.1,0.1-1.9,0.2-2.7,0.3c-4.4,0.3-8.7,1.3-13.1,0.1c-0.5-0.1-1.3,0.5-2,0.7 c0.7,0.4,1.3,1.1,2,1.2c1.5,0.2,3.1,0,4.6,0c1,0,2,0.1,3,0.2c0,0.2,0,0.5,0.1,0.7C234.8,385.4,231.5,385.8,228.2,386.2z M212.5,383.3c-1.6,0.6-2.7,1.3-3.9,1.4c-4.8,0.5-9.7,0.8-14.5,1.3c-0.8,0.1-1.4,0.6-2.1,1c0.6,0.5,1.1,1.3,1.7,1.4 c2.4,0.2,4.9,0,7.3,0.1c2,0,4,0.2,6,0.3c0.1,0,0,0.5,0.1,1.3c1.8-0.7,4.2-1,4.8-1.9C212.9,386.9,212.4,385.1,212.5,383.3z M250.8,385.7c3.9,0.1,7.4,0.2,11,0.1c2.9-0.1,5.8-0.4,8.6-0.8c2-0.3,2-1.7,1.6-2.8c-0.1-0.3-1.8-0.5-2.7-0.4 c-6,0.7-11.7,2.5-18.1,1.2C251,384,250.9,384.7,250.8,385.7z M154,366.3c0,0.2,0,0.4,0,0.6c12.6,1.2,25.1,2.5,37.7,3.7 c0.3-1.6-1.2-2.3-3.3-2.5C176.9,367.5,165.5,366.9,154,366.3z M211.8,377.8c0,0.3,0,0.6,0,0.9c-6,0.4-11.9,0.9-17.9,1.3 c1.7,0.7,3.7,1.4,5.6,1.4c3.9-0.1,7.8-0.7,11.6-1.1c2.3-0.2,1.5-1.6,1.6-2.5c0.1-1.2-0.9-1.4-2.3-1.4c-3.4,0-6.7-0.1-10.1-0.1 c-1.4,0-2.8,0.2-4.2,0.3c0,0.2,0,0.5,0.1,0.7C201.3,379.1,206.8,376.2,211.8,377.8z M352.3,370.2c0.1,0.2,0.3,0.5,0.4,0.7 c-0.4,0.1-0.8,0.4-1.2,0.4c-3.8,0.6-7.6,1.2-11.5,1.7c-0.4,0.1-1-0.4-1.4-0.7c-0.5-0.4-1-0.9-1.6-1.4c-0.8,2.1,0.5,2.9,2.6,2.9 c3.4-0.1,6.8-0.5,10.3-0.8c-0.6,0.3-1.1,0.6-2.1,1.1c1.6,0,2.6,0,3.6-0.1c3.3-0.3,2.1-2.2,2.2-3.6c0.1-1.6-1.5-1.7-3-1.4 c-2.6,0.3-5.2,0.8-7.8,1.2c0,0.1,0,0.3,0,0.4C346,370.4,349.2,370.3,352.3,370.2z M292.7,384.2c-0.1-0.2-0.3-0.3-0.4-0.5 c1-0.5,1.8-1.2,2.9-1.4c2.4-0.5,5-0.8,7.4-1.2c1-0.2,1.9-0.7,2.8-1.1c-0.1-0.2-0.2-0.4-0.3-0.6c-4.2,0.4-8.5,0.7-12.7,1.1 c0-0.3-0.1-0.5-0.1-0.8c2.6-0.3,5.2-0.5,7.8-0.8c-2.3-0.4-4.6-0.4-6.8-0.2c-0.6,0.1-1.5,0.5-1.7,1c-0.5,0.9-0.7,1.9-1,2.9 C290.3,383.9,290.9,384.5,292.7,384.2z M336.6,383.1c5.1-0.8,9.9-1.6,14.7-2.3c1.5-0.2,2.6-0.6,1.8-2.2c-4.7,0.9-9.3,1.9-13.9,2.8 c-0.1-0.3-0.2-0.5-0.3-0.8c1.8-0.4,3.7-0.8,5.5-1.2c0-0.1-0.1-0.1-0.1-0.2c-2.4-0.1-4.8-0.1-7.4-0.2 C336.8,380.3,336.7,381.6,336.6,383.1z M314.9,382.9c0,0.1,0,0.3,0.1,0.4c2.5-0.1,5.1-0.1,7.6-0.3c0.8-0.1,2-0.9,1.9-1.3 c-0.2-1.2-0.7-3.1-1.4-3.2c-3.5-0.5-7,0.2-10.3,1c0,0.2,0.1,0.4,0.1,0.6c3.2-0.3,6.5-0.5,9.7-0.8c0.1,0.3,0.1,0.6,0.2,0.9 c-3.1,0.6-6.3,1.1-9.4,1.7c0,0.1,0,0.1,0,0.2c2.3-0.2,4.7-0.4,7-0.5c0,0.2,0,0.4,0,0.5C318.6,382.3,316.7,382.6,314.9,382.9z M292.4,377.4c5.2-0.6,9.8-1.2,14.4-1.7c-0.1-0.3-0.1-0.6-0.2-0.9c-3.2,0.5-6.4,0.9-9.6,1.4c-0.1-0.2-0.1-0.3-0.2-0.5 c0.6-0.2,1.2-0.4,1.7-0.6c-1-0.2-1.9-0.4-2.9-0.6c0-0.2,0-0.4,0-0.7c2.2-0.3,4.4-0.6,7.1-1c-3,0.1-5.6,0.1-8.2,0.3 c-0.5,0-1.2,0.5-1.4,0.9C292.7,375,292.6,376,292.4,377.4z M248,369.8c-6.9,0.6-13.8,1.2-20.6,1.7c0,0.3,0,0.5,0,0.8 c3.3,0.6,6.7-0.2,10-0.4c3.5-0.2,7-0.2,10.5-0.3C248,371.1,248,370.5,248,369.8z M186,373.7c-8.8-2.2-30-3.7-33-2.7 C163.7,371.9,174.5,372.8,186,373.7z M195.8,370.8c0,0.2-0.1,0.4-0.1,0.6c0.6,0.2,1.1,0.4,1.7,0.4c4.3,0.2,8.5,0.4,12.8,0.4 c0.8,0,1.6-0.6,2.4-1c-0.9-0.3-1.7-0.8-2.6-0.8c-3.9,0-7.8,0.2-11.7,0.3C197.5,370.8,196.6,370.8,195.8,370.8z M288.1,345.5 c-0.6,6.9-1.2,13.6-1.8,20.2c0.5,0,1,0,1.5,0.1C287.8,359.1,289.1,352.5,288.1,345.5z M322.4,370.7c-0.4-1.2-0.6-2.3-1.2-3.2 c-0.3-0.5-1.3-1.2-2-1.2c-2.3-0.1-4.6,0.1-6.9,0.2c-0.1,0.2-0.3,0.3-0.4,0.5c0.7,0.3,1.4,0.9,2,0.9c1.2-0.1,2.4-0.7,3.7-0.7 c0.9,0,1.8,0.5,2.7,0.8c-0.4,0.5-0.7,1.1-1.4,1.4c-0.7,0.4-1.7,0.6-2.6,0.8c0.1,0.1,0.1,0.2,0.2,0.3 C318.3,370.6,320.2,370.7,322.4,370.7z M353.1,375.9c0-0.2-0.1-0.4-0.1-0.7c-2.9,0.3-5.8,0.7-8.7,0.8c-1.7,0.1-3.5-0.2-5.2-0.2 c-0.7,0-1.4,0.1-2.2,0.2C342.7,378.7,347.8,376.6,353.1,375.9z M338.3,365.7c0,0.2-0.1,0.5-0.1,0.7c4.5,0.4,9,0.8,13.6,1.1 c0.5,0,1-0.4,1.5-0.6c-0.5-0.3-1-0.9-1.5-0.9C347.3,365.8,342.8,365.8,338.3,365.7z M231.2,376.2c0,0.2,0.1,0.4,0.1,0.5 c5.7,0.1,11.2-0.6,16.7-1.4c-0.1-0.3-0.1-0.7-0.2-1C242.3,375,236.7,375.6,231.2,376.2z M293.4,371.4c3.4-0.4,6.4-0.7,9.3-1.1 c0.1,0.3,0.1,0.6,0.2,0.9c-1.3,0.2-2.5,0.4-3.8,0.6c5.4,0.3,8-0.2,8.6-1.7C303.7,369.4,295,370.1,293.4,371.4z M239.1,347.8 c0.8-1.9,3.7-2.7,3.1-5.3c-2.4,0.9-4.3,1.6-6.6,2.5C236.9,346,237.8,346.7,239.1,347.8z M164,356.5c-0.1-0.1-0.2-0.1-0.3-0.2 c-1.3,1.2-2.7,2.5-4,3.7c-1.3,1.3-2.5,2.7-3.8,4c0.1,0.2,0.2,0.3,0.3,0.5c0.8-0.2,2.1-0.2,2.4-0.5 C160.5,361.6,162.2,359,164,356.5z M220,366.1c2.5-0.5,3.5-4.6,1.9-7.8C221.2,361.2,220.6,363.6,220,366.1z M196.1,373.5 c0,0.1,0,0.2,0,0.4c5.3-0.2,10.5-0.3,15.8-0.5c0-0.1,0-0.2,0-0.4C206.7,373.1,201.4,373.3,196.1,373.5z M343.7,382.9 c5,1.3,9.1,0.6,9.1-1.4C349.7,381.9,346.7,382.4,343.7,382.9z M254.4,368.8c0,0.2-1.4,4.2-1.4,4.3c5-0.2,12.3-1.3,17.3-1.4 c0-0.2,0.6-1.8,0.6-2C265.9,369.8,259.4,368.6,254.4,368.8z M315.9,372.7c2.3,0.5,4.8,1.1,7.4,1.7 C322.9,372,319.5,371.5,315.9,372.7z M228,368.6c0,0.3,0.1,0.6,0.1,0.9c4.7-0.4,9.4-0.7,14.1-1.1c0-0.1,0-0.2,0-0.2 C237.4,368.3,232.7,368.4,228,368.6z M165.4,362.1c-0.1-0.1-0.3-0.2-0.4-0.3c-1.2,0.7-2.4,1.5-3.5,2.2c0.1,0.2,0.3,0.5,0.4,0.7 c1.9,0,3.9,0,5.8,0.1c0-0.2,0-0.4,0-0.5c-0.9,0-1.9,0-3,0C164.9,363.3,165.1,362.7,165.4,362.1z M210.6,368.8c0-0.2,0-0.4,0.1-0.6 c-4.4,0-8.7-0.1-13.1-0.1c0,0.2,0,0.4,0,0.7C202,368.8,206.3,368.8,210.6,368.8z M254.4,374.5c0,0.1,0,5.7,0,5.8 c3.9-0.3,13.4,0.3,17.3,0c0-0.2-0.5-3-0.5-3.2C267.3,377.4,258.3,374.2,254.4,374.5z M212.6,375.4c0-0.2-0.1-0.5-0.1-0.7 c-2.4,0.2-4.9,0.4-7.3,0.5c0,0.1,0,0.3,0.1,0.4C207.7,375.5,210.1,375.5,212.6,375.4z M295.3,368.5c0,0.1,0,0.2,0,0.3 c3.6-0.1,7.1-0.2,10.7-0.3c0-0.1,0-0.2,0-0.3C302.4,368.3,298.9,368.4,295.3,368.5z M234,373.3c0,0.2,0.1,0.3,0.1,0.5 c2.7-0.2,5.5-0.4,8.2-0.6c0-0.2,0-0.3-0.1-0.5C239.6,372.8,236.8,373,234,373.3z M240.7,349.2c0.2,0.1,0.4,0.2,0.6,0.3 c1.1-1.1,2.1-2.1,3.2-3.2c-0.3-0.2-0.7-0.3-1-0.5C242.6,346.9,241.6,348,240.7,349.2z"/>
      <path d="M554.4,335.3c0.8-0.9,1.7-1.8,2.5-2.7c2.8-3.3,6.7-3.2,11.5-2.7c10,1.1,20.1,1.7,30.1,2.2c4.7,0.2,8.3,1.2,11.4,4.1 c5.1,4.7,10.8,9.1,16.1,13.6c2.2,1.9,4.2,4,6.2,6.1c0.3,0.3,0.3,0.9,0.2,1.3c-0.4,1.3-1.1,2.6-1.3,4c-0.4,2.8-0.7,5.6-0.6,8.4 c0,2,0.7,4,1.1,6.2c-2.2,0.1-4.9,0.3-7.7,0.5c-13.3,0.9-26.7,1.7-40,2.7c-2.8,0.2-5.5,1.2-8.3,1.8c-0.3,0.1-0.6,0.1-0.8,0.1 c-5.7-1.2-11.3,0-16.9,0.6c-3.9,0.4-7.8,0.5-11.7,0.8c-1.4,0.1-2.8,0.6-4.4,1c-3.4-1.2-7.3-0.6-11.2-0.2c-0.9,0.1-1.8,0.3-2.7,0.3 c-11-0.7-22-0.6-33,0.4c-4.6,0.4-9.3,0.2-13.9,0.6c-3,0.2-5.9,1.5-8.9,1.5c-9,0-17.9,0.9-26.9,0.3c-8.8-0.6-17.7-0.5-26.5,0.1 c-2.4,0.1-4.1,1.3-5.3-1c-0.1-0.2-1-0.3-1.5-0.3c-5.2-0.4-10.3-0.8-15.5-1.3c-1.7-0.2-3.4-0.6-5-0.9c-6.5-1.3-13-2.6-19.5-4 c-0.6,1.1-1.1,1.8-1.6,2.6c-0.3,0.1-0.5,0.1-0.8,0.2c-0.3-0.6-0.9-1.2-0.9-1.8c0.1-3.1,0.5-6.3,0.7-9.4c0.1-2,0.1-3.9,0.1-5.9 c0-0.5-0.1-1,0.2-1.4c4.7-6.6,9.5-13.3,14.3-19.9c1.5-2.1,2.7-4.2,4.3-6.2c0.4-0.5,1.8-0.9,2.7-0.8c11.4,0.6,22.7,1.3,34.1,1.8 c6.3,0.3,12.6,0.4,18.8,0.5c0.5,0,1.1,0.1,1.3-0.1c3.1-2,5-0.1,7.4,1.4c2.9-1.6,5.9-3.2,8.8-4.9c1.8-1.1,3.5-1.5,6-1.2 c9.2,0.9,18.4,1.7,27.7,2.4c3.6,0.3,7.3,0.2,10.8,0.6c1.7,0.2,3.3,1.3,5,2.1c0.3-0.2,0.8-0.3,1-0.6c1.7-2.7,4.7-2.3,7.9-2.2 c11.6,0.2,23.3,0.3,34.9,0.4C554.6,335.7,554.5,335.5,554.4,335.3z M625.8,359c-1.1,0.3-2.2,0.6-3.3,0.8c-2.4,0.5-4.8,0.8-7.2,1.3 c0.1,0.3,0.1,0.6,0.2,0.8c3.8-0.3,7.6-0.7,11.4-1c2.3-0.2,2.4-1.1,1.2-2.3C627.3,358.8,626.5,358.9,625.8,359 c-0.6-0.2-1.2-0.8-1.7-0.8c-3.6,0.2-7.3,0.5-10.9,0.7c-1.8,0.1-3.6,0.2-5.3,0.3c-0.1,0.2-0.3,0.4-0.4,0.6c0.7,0.4,1.3,1.2,2.1,1.3 c1.3,0.1,2.7-0.1,4-0.3C617.7,360.3,621.8,359.6,625.8,359z M564.5,367.8c-3.6-0.4-4.8,0.2-4.4,2.3 C561.6,369.3,563.1,368.5,564.5,367.8c-0.6,1-0.5,1.6,1.4,1.5c2.6-0.1,5.2,0,7.9,0.1c0.1-1,0.3-2.2,0.3-3.4c0.1-1.8-0.4-2.1-3-1.6 c0.5,0.5,1.1,1.1,1.5,1.6C569.8,366.6,567.2,367.2,564.5,367.8z M496.1,347.5L496.1,347.5c0.4-0.7,0.8-1.5,1.2-2.3 c-0.1,0-0.2-0.1-0.3-0.1c-6.9,5.3-13.9,10.7-21,16.2c0.9,0.1,1.6,0.3,2.3,0.3c4.2,0,8.5,0.1,12.7,0c2.5,0,5-0.2,7.4-0.5 c0.8-0.1,1.8-0.9,1.9-1.4c0.6-3,1-6,1.2-9c0.2-2.4,0.1-4.7,0.2-7.1c-1.3,0.5-2,1.2-2.8,1.8C497.9,346.1,497,346.8,496.1,347.5z M471.1,354.7C471.1,354.7,471,354.7,471.1,354.7c1,1.4,2,2.8,3.3,4.6c9.4-7.2,18.2-14,27.3-21c-1.3-0.3-1.9-0.5-2.5-0.6 c-11.1-0.9-22.2-1.9-33.4-2.7c-1-0.1-2,0.4-3.4,0.8c1.1,0.9,1.7,1.3,2.2,1.8c0.8-0.4,1.5-0.6,1.9-0.8c0.5,0.7,0.8,1.7,1.2,1.7 c3.2,0.4,4.4,1.9,4.7,4.1c0.7-0.1,1.4-0.2,2.8-0.3c-1.2,1.5-2.3,2.6-2.8,3.8c-1.1,2.3-1.9,4.8-2.7,7.2 C469.8,353.7,470.7,354.2,471.1,354.7z M401.7,362.7c5,0.1,9.2,0.1,13.5,0.1c0.6,0,1.3-0.4,1.7-0.8c2.6-2.4,4.8-5,7.7-7.3 c5.1-4.1,10.6-7.9,15.9-11.9c1-0.8,1.9-1.7,3-2.7c-1.1-0.2-1.5-0.3-1.9-0.3c-13.8-0.7-27.6-1.3-41.4-2c-9-0.5-9.3-0.6-13.4,5.3 c-4.1,6-7.6,12.2-11.4,18.3c-0.2,0.3-0.1,0.6-0.1,0.9c0.2,0.1,0.5,0.2,0.7,0.3c0.5-0.5,1.1-1,1.4-1.5c2-3.5,3.9-6.9,5.9-10.4 c0.2-0.3,0.8-0.6,1.3-0.8c0.3,0.4,0.9,0.8,0.9,1.3c0,0.6-0.4,1.2-0.7,1.7c-0.9,1.5-1.8,3.1-2.6,4.6c0.2,0.1,0.4,0.2,0.6,0.2 c3.2-3.4,6.3-6.8,9.5-10.2c0.2,0.1,0.5,0.2,0.7,0.3c-0.4,4.5-5.1,7.9-6,12.4c2.3-2.2,4.2-4.5,6.2-6.7c0.5-0.6,1.6-1,2.4-1.4 c0.2,0.8,0.4,1.5,0.5,2.3c0,0.2,0,0.4-0.1,1c0.9-1,1.3-1.8,2.1-2.1c1-0.5,2.2-0.6,3.4-0.8c0.1,0.8,0.4,1.6,0.2,2.3 c-0.6,1.6-1.4,3.1-2.2,4.6c0.2,0.1,0.4,0.2,0.6,0.3c0.7-0.6,1.4-1.3,2.2-1.9c0.7-0.5,1.7-0.8,2.5-1.2c-0.1,0.8,0.1,1.6-0.3,2.3 C403.7,360,402.8,361.1,401.7,362.7z M576.6,355.7c3.7-2.5,7.4-4.7,10.6-7.3c4.6-3.6,8.9-7.4,13.2-11.2c0.8-0.7,1.3-1.6,1.9-2.3 c-1.2-0.3-2.4-0.7-3.7-1c-0.5-0.1-1.1,0-1.6-0.1c-6.6-0.4-13.2-0.6-19.8-1.2c-4.7-0.4-9.2-1.4-13.8-2.1c-0.5-0.1-1.2,0-1.5,0.2 c-1.6,1.1-3.1,2.4-4.7,3.6c1,0.7,1.8,1.2,2.7,1.8c1-1,1.9-1.9,3.2-3.2c0.1,2.2-4.6,4.1-0.1,5.5c1.7-1.1,3.1-2.1,4.6-3.1 c0.2,0.1,0.4,0.2,0.6,0.3c-0.3,1-0.4,2-1,2.8c-1.6,2.6-0.1,4.7,1.5,6.8c0.2,0.3,1.3,0.3,1.9,0.4c-0.1-0.4-0.2-0.9-0.3-1.3 c-0.2-0.6-0.6-1.2-0.6-1.8c0-0.8,0.4-1.7,0.5-2.5c-0.2,0-0.4-0.1-0.6-0.1c-0.5,0.5-1.1,1-1.6,1.5c-0.3-0.1-0.5-0.3-0.8-0.4 c1.3-1.4,2.5-2.7,3.8-4.1c0.3,0.1,0.6,0.2,0.8,0.3c-0.1,0.8-0.2,1.7-0.3,2.6c0.6-0.1,1.1-0.2,1.7-0.2c-0.4,1.2-0.8,2.3-1.1,3.4 c0.2,0,0.3,0.1,0.5,0.1c1-1,2-2,2.9-3.1c0.2,0.6,0.1,0.9-0.1,1.3c-1.1,2.4-2.2,4.8-3.3,7.3c-0.2,0.5-0.2,1.1,0.1,1.5 C573.6,352,575,353.7,576.6,355.7z M449.9,340.1c-0.3,0.1-0.7,0.1-1,0.2c-0.8,4.5-1.6,9.1-2.3,13.6c-0.3,2.3-0.5,4.7-0.5,7 c0,0.5,1.2,1.4,1.9,1.4c6.4,0.1,12.7,0.2,19.1,0.2c1.8,0,3.7-0.3,6-0.5C465,354.5,457.4,347.3,449.9,340.1z M608.4,366.6 c0,0.4,0,0.7,0,1c0,0.3-0.1,0.6-0.2,1.6c5.6-0.3,10.9-0.7,16.3-1c0,0.2,0.1,0.4,0.1,0.6c-0.4,0.1-0.7,0.3-1.1,0.4 c-4.1,1-8.2,1.6-12.6,1.2c-1.9-0.2-3.2,0.2-3.2,1.9c0,0.5-0.5,1-1,1.9c-0.4-0.8-0.7-1-0.7-1.2c-0.2-3.9-0.4-7.7-0.4-11.6 c0-1.7-0.8-2.5-3.2-2.4c-2.2,0.1-4.3,0.2-4.1,2.5c0.3,4.6,0.5,9.1,0.8,13.7c0.1,1.4,1.4,1.4,2.7,1.4c8.3-0.4,16.5-0.9,24.8-1.4 c0.8-0.1,2.1-0.8,2.2-1.3c0.4-3.3,0.6-6.6,0.7-9.8c0-0.4-0.6-1.3-0.9-1.3c-3.2,0.1-6.4,0.3-9.6,0.4c0,0.2,0.1,0.5,0.1,0.7 c2.4-0.1,4.8-0.2,7.3-0.3c-0.2,1,0,2-0.5,2.6c-0.5,0.7-1.6,1.1-3,2c0.5-0.9,0.6-1.3,0.9-1.8C618.5,366.2,613.6,366.4,608.4,366.6z M604.9,334.4c0,1.7-0.1,2.7-0.1,3.8c0.1,5.8-1.4,11.6,0.9,17.4c0.7,1.7,2,2.4,4.1,2.2c5.6-0.6,11.1-1.2,16.7-1.9 c0.4-0.1,1.1-1.2,0.9-1.5c-1-1.4-2.1-2.8-3.5-4.1c-5.2-4.6-10.5-9.1-15.8-13.6C607.2,336,606.2,335.4,604.9,334.4z M543.4,359.8 c0.7,6.3,1.3,12.1,2.1,17.8c0.4,3,0.5,3,4.8,2.8c1.2-0.1,2.4-0.2,3.5-0.1c2.7,0.1,3.7-0.9,3.6-2.8c-0.2-5.5-0.2-11-0.4-16.4 c0-0.5-1.2-1.5-1.9-1.5C551.5,359.5,547.9,359.7,543.4,359.8z M507.9,339.6c-0.2,0.1-0.4,0.1-0.7,0.2c0,0.6,0,1.2,0,1.8 c-0.2,3.7-0.4,7.3-0.6,11c-0.1,2-0.2,4-0.4,6c-0.1,1.1,0.6,1.9,2.2,1.8c6.8-0.2,13.7-0.5,21.1-0.8 C523.8,351.6,515.6,345.7,507.9,339.6z M495.1,374.9C495,374.9,495,374.9,495.1,374.9c-0.1,0.9-0.1,1.7-0.1,2.6 c0,3.1,1.3,4.2,5.4,4c2.3-0.1,4.5-0.4,6.8-0.6c2.5-0.2,3.5-1.3,3.4-3c-0.4-4.5-0.8-9.1-1.2-13.6c-0.1-1.3-1-1.9-2.8-1.8 c-2.4,0.2-4.9,0.3-7.3,0.3c-2.1,0-2.9,0.7-3,2.2C495.8,368.4,495.4,371.6,495.1,374.9z M530.8,355.2c7.1-5.7,14-11.3,21-16.8 c-0.1-0.2-0.3-0.4-0.4-0.6c-1.1,0-2.1,0-3.2,0c-10-0.2-20-0.3-30-0.5c-2.3-0.1-3.3,0.4-3.7,2.1c1.3-0.2,2.5-0.4,4.2-0.7 c-0.8,1.6-1.5,2.8-2.1,4c0.3,0.1,0.5,0.2,0.8,0.3c0.7-0.7,1.4-1.4,2-2.2c1.2-1.5,2.4-1.6,4-0.3c-0.8,0.9-1.5,1.8-2.2,2.7 c0.2,0.1,0.3,0.2,0.5,0.3c1.2-0.7,2.4-1.4,3.6-2.1c0.2,0.1,0.4,0.3,0.5,0.4c-0.4,0.6-0.9,1.1-1.2,1.7c-0.3,0.5-0.4,1.1-0.6,1.7 c2.6-0.8,2.4-3.3,5.8-4c-1.3,2.4-2.4,4.3-3.5,6.2c3.5-1.2,3.1-4.7,7.1-5.5c-1.2,1.6-2.9,3-1,4.9c0.2,0.2-0.3,0.9-0.5,1.3 c-0.7,1.1-1.5,2.3-2.3,3.4C528.6,352.8,528.7,353.9,530.8,355.2z M603.1,337.5c-0.4-0.1-0.8-0.2-1.2-0.3 c-6.9,6.6-13.8,13.2-20.7,19.9c0.8,0.2,1.4,0.4,1.9,0.4c5.1,0,10.2-0.1,15.3-0.3c0.6,0,1.5-1,1.6-1.7c1-4.5,1.9-9,2.7-13.5 C602.9,340.7,603,339.1,603.1,337.5z M436.3,378.5c0.1,0,0.1,0,0.2,0c0,0.8,0.1,1.6,0.1,2.4c0,3.1,0,3.1,4.1,3.1 c0.9,0,1.8,0,2.7,0c2.4,0.2,3.5-0.3,3.5-2.3c0.1-3.8,0.5-7.6,0.8-11.4c0.1-1.3,0.3-2.7,0-4c-0.1-0.6-1-1.4-1.7-1.5 c-2.1-0.2-4.3-0.1-6.5-0.1c-1.7,0-2.1,0.6-2,1.8c0.1,1.3,0.1,2.7-0.1,4C437.1,373.2,436.7,375.8,436.3,378.5z M438.6,362.7 c1.5-6.3,2.9-12.3,4.3-18.4c-0.3-0.1-0.6-0.1-0.9-0.2c-7.2,5.8-15,11.2-21.4,18.3C427.1,362.6,432.7,362.7,438.6,362.7z M554,340.3c-0.3-0.1-0.5-0.2-0.8-0.3c-0.7,0.4-1.4,0.7-2,1.2c-6.1,5-12.2,9.9-18.2,15c-1.3,1.1-0.5,2.3,1.6,2.2 c4.3,0,8.6-0.2,12.8-0.5c0.8-0.1,2-0.9,2.2-1.6c1.3-3.9,2.4-7.8,3.5-11.8C553.4,343.2,553.6,341.7,554,340.3z M559,337.8 c-0.3,0.1-0.7,0.2-1,0.4c-0.1,0.4-0.3,0.7-0.3,1.1c0,5.6,0.1,11.2,0.2,16.8c0,1.4,1.3,1.7,2.8,1.5c3.1-0.3,6.1-0.8,9.1-1.1 c2.3-0.3,2.9-1.1,1.8-2.7c-2.2-3.1-4.2-6.4-6.6-9.5C563.3,342.1,561,340,559,337.8z M595,367.6c-3.3,1.8-5.9,3.3-8.7,4.6 c-2.7,1.3-5.7,2.4-8.5,3.6c-0.5,0.2-0.9,0.8-1,1.2c-0.1,0.1,0.7,0.7,1.1,0.6c5.7-0.2,11.4-0.4,17.1-0.8c0.7,0,1.8-1,1.9-1.6 c0.1-2.9-0.1-5.9-0.2-8.8c-0.1-1.8-1.5-2.1-3.5-1.5c-0.8,0.2-1.5,0.6-2.1,0.9C592.4,366.4,593.5,366.9,595,367.6z M475.6,377 c0,0.8,0,1.5,0,2.2c-0.1,2.1,0.9,3,4,2.8c3.9-0.2,7.8-0.2,11.7-0.2c1.4,0,1.8-0.4,1.8-1.5c-0.1-2.5,0-5.1,0.1-7.6 c0-0.6-0.1-1.2-0.2-1.8c-0.2,0-0.5-0.1-0.7-0.1c-1.3,1.2-2.6,2.5-3.9,3.7c0.7,0.3,1.4,0.6,2.6,1.1 C485.4,376.1,480.6,376.6,475.6,377z M425.8,383.3c0.1,0.2,0.2,0.4,0.3,0.6c1.7,0,3.4,0,5.1,0.1c2.2,0.1,2.9-0.6,3-2.1 c0.1-3.4,0.2-6.7,0.4-10.1c0.2-4.8,0.2-4.8-6.3-3.6c-0.3,0.1-0.5,0.2-1.4,0.5c2.7,0.2,4.7,0.4,6.7,0.5c-0.5,0.9-1,1.6-1.8,2.8 c-1.6,0.4-3.9,1-6.2,1.6c0,0.1,0,0.3,0.1,0.4c1.9-0.1,3.8-0.2,5.7-0.3c0,3.3,0,3.3-4.1,3.5c-1,0.1-2,0.3-3,0.4 c0,0.1,0.1,0.3,0.1,0.4c2.9-0.1,5.7-0.3,8.6-0.4c0,0.1,0,0.3,0.1,0.4c-4.2,1.4-8.3,2.9-12.5,4.3c-0.1-0.1-0.2-0.2-0.3-0.2 c0.9-0.7,1.7-1.3,2.7-2.1c-1,0.1-1.8,0.3-2.6,0.2c-1.9-0.1-2.3,0.7-2.3,1.9c0,1.3,0.9,1.9,2.5,1.8c1.3-0.1,2.5-0.5,3.7-0.9 c1.9-0.7,3.7-1.5,5.5-2.3c0.1,0.2,0.2,0.4,0.3,0.5C428.6,381.9,427.2,382.6,425.8,383.3z M471.9,378.9c-0.8,0.1-1.4,0.2-2.1,0.2 c-5.8,0.3-11.6,0.7-17.4,1c-1.9,0.1-2.8,0.6-2.9,2c-0.1,1.5,1,1.8,2.7,1.8c6.2-0.2,12.4-0.4,18.5-0.6c0.7,0,1.9-0.5,2-0.8 c0.2-1.9,0.2-3.8,0.2-5.7c-0.3,0-0.7,0-1,0C472,377.4,472,378.1,471.9,378.9z M541.2,374.5c0.1,0.2,0.2,0.4,0.3,0.6 c-0.8,0.2-1.5,0.5-2.3,0.7c-2.3,0.7-4.8,1.3-7,2.2c-0.7,0.3-1.3,1.3-1.2,1.9c0,0.4,1.3,1,2.1,1c2.3,0.1,4.5,0.1,6.8,0.1 c1.5,0,2.4-0.5,2.4-1.7c-0.1-2.5,0-5-0.3-7.5c-0.4-2.8-2-3.2-5.4-1.6c0.9,0.1,1.8,0.1,2.7,0.2c0.6,0.1,1.1,0.5,1.7,0.8 c-0.5,0.3-0.9,0.7-1.5,0.9c-2.4,0.9-4.9,1.7-7.3,2.6c-0.6,0.3-1,0.9-1.5,1.4C534.5,376.1,537.4,373.7,541.2,374.5z M463,368.2 c0-0.1,0-0.1,0-0.2c-1.9,0-3.9,0-5.8-0.1c-1.2,0-2.4,0.1-3.5-0.1c-0.9-0.2-1.5-0.9-2.3-1.3c0.8-0.2,1.7-0.5,2.5-0.6 c5.9,0,11.8,0,17.7-0.1c0.6,0,1.2-0.7,1.8-1.1c-0.5-0.2-1.1-0.7-1.6-0.7c-6.4,0.1-12.9,0.2-19.3,0.5c-0.8,0-2.1,0.5-2.1,0.8 c-0.3,1.6-0.2,3.2-0.2,5C454.6,369.7,458.8,369,463,368.2z M371.8,373c1.4,1.6,30.7,4.8,40.1,4.2C398.8,374,385.1,374.3,371.8,373 z M558.5,379.6c1.7-0.1,3.6-0.1,5.5-0.2c2.7-0.2,5.4-0.5,8.1-0.8c0.6-0.1,1.1-0.7,1.7-1.1c-0.5-0.3-1-0.6-1.5-0.9 c-0.2-0.2-0.5-0.3-0.9-0.5c0.8-0.5,1.5-0.9,2.5-1.5c-3.2,0.2-6,0.2-8.7,0.4c-1.3,0.1-2.7,0.3-3.9,0.6c-0.5,0.1-1,0.5-1.2,0.9 C559.5,377.3,559.2,378.2,558.5,379.6z M518.5,380.4c0.1,0.2,0.1,0.3,0.2,0.5c2.3,0.3,4.6,0.5,7,0.8c2.1,0.2,2.9-0.5,2.7-1.9 c-0.2-2.1-0.5-4.1-0.7-6.2c-4.5,0.2-5,0.5-5.2,2.6c0.8,0.2,1.6,0.4,2.5,0.7C522.7,378.1,520.6,379.3,518.5,380.4z M516.1,366.6 c0,0.2,0.1,0.3,0.1,0.5c2.2,0.2,4.4,0.5,6.6,0.4c5.7-0.2,5.8-0.3,6.2-3.5c0.1-0.9-0.6-2.5-0.9-2.5c-2.1,0-4.3,0.2-6.2,0.8 c-1.3,0.4-2.1,1.7-3.1,2.5c2.4-0.1,5.1-0.1,7.8-0.2c0.1,0.3,0.1,0.6,0.2,0.9C523.2,365.8,519.6,366.2,516.1,366.6z M380.3,376.5 c-0.1,0.2-0.1,0.3-0.2,0.5c0.6,0.2,1.3,0.4,2,0.5c9.4,1.1,18.8,2.1,28.2,3.2c1.3,0.2,2.5,0.7,3.9,1c0.7-1.5,0.4-1.9-2.4-2.2 c-7.6-0.6-15.1-1.2-22.7-1.9C386.1,377.3,383.2,376.8,380.3,376.5z M389.4,371.6c0,0.2-0.1,0.3-0.1,0.5c1.3,0.1,2.7,0.2,4,0.4 c6.4,0.9,12.8,1.8,19.3,2.6c0.6,0.1,1.3-0.3,2-0.5c-0.5-0.4-1.1-1.1-1.7-1.1C405.1,372.8,397.3,372.2,389.4,371.6z M551.8,357.5 c2.5,0.5,2.8,0.4,3.3-1.2c0.2-0.7,0.4-1.4,0.6-2.2c0.5-2.6,0.4-5.2-1.3-7.8C553.5,350,552.7,353.7,551.8,357.5z M560,359.2 c0,0.3,0,0.6,0.1,0.8c1.2-0.1,2.5-0.2,3.7-0.3c1.8-0.2,3.6-0.4,5.4-0.5c2.1-0.2,2.6,1.1,3.4,2.2c-1,0.4-2,0.8-3,1.1 c-0.9,0.2-1.8,0.3-2.7,0.5c0.1,0.3,0.1,0.6,0.2,0.8c2.4-0.1,4.8-0.3,7.4-0.4c-0.2-1.5-0.1-2.6-0.5-3.7c-0.1-0.4-1-1.1-1.5-1.1 C568.4,358.6,564.2,358.9,560,359.2z M504.8,340.2c-0.2,0-0.4,0-0.7,0c-0.6,6.7-1.1,13.4-0.9,20.2c0.4,0,0.8,0,1.2,0 C504.6,353.7,504.7,346.9,504.8,340.2z M583.1,360.7c6.4,0.6,11.3,0,12.2-1.4c-5.6-0.1-11.1-0.1-16.7-0.2c0,0.3,0,0.5-0.1,0.8 c2.1,0.2,4.3,0.3,7,0.5C584.3,360.6,583.7,360.7,583.1,360.7z M455.5,370c5.6,0.1,10.9,0.1,16.2,0.1c0.5,0,1.1-0.6,1.6-0.9 c-0.6-0.3-1.2-1-1.7-0.9C466.3,368.8,461,369.4,455.5,370z M595.9,363.9c-0.1-2.6-2-2.1-4.4-1.7c1.2,0.2,1.7,0.3,2.3,0.4 c-5.6,0.2-11,0.4-16.5,0.6c0,0.2,0,0.4,0,0.5C583.4,363.7,589.6,363.8,595.9,363.9z M463.9,348.7c2.3-2.4,4.6-4.6,6.9-6.9 c-0.2-0.1-0.4-0.3-0.6-0.4c-2.8,1.3-5.6,2.7-7.5,4.8C461.7,347.3,462,348,463.9,348.7z M562,372c0,0.3,0.1,0.5,0.1,0.8 c3.6,0,7.1,0.1,10.7,0.1c0.5,0,1-0.6,1.5-0.9c-0.6-0.3-1.2-1-1.7-1C569,371.3,565.5,371.7,562,372z M521,375.1 c-2,0.1-4,0.1-5.9,0.5c-0.9,0.1-2.1,0.9-2.2,1.4c-0.2,0.9,0.3,2,0.5,3c1.3-0.3,2.6-0.5,3.9-0.8c-1.6-0.9-3.9-0.3-3.8-2.3 C520.9,376.5,520.9,376.5,521,375.1z M400.2,365.2c0,0.2,0,0.4,0,0.6c4.3,0.2,8.6,0.5,12.9,0.7c0.7,0,1.4-0.5,2.1-0.7 c-0.7-0.3-1.4-0.7-2.2-0.7c-3.7-0.1-7.4-0.1-11.1-0.1C401.3,364.9,400.8,365.1,400.2,365.2z M444.7,351.6c-0.3,0-0.6-0.1-0.9-0.1 c-0.8,3.2-1.7,6.5-2.5,9.8c-0.1,0.3,0.6,0.6,1,1c0.4-0.2,1-0.5,1-0.7C443.8,358.2,444.3,354.9,444.7,351.6z M603,351.3 c-0.2,0-0.5,0-0.7,0c-0.3,1.6-0.8,3.2-0.7,4.8c0,0.5,1.6,0.9,2.4,1.4c0.4-0.4,1.1-0.9,1-1.3C604.4,354.5,603.7,352.9,603,351.3z M585.7,371c-0.1-0.3-0.3-0.5-0.4-0.8c-2.6,0.6-5.3,1.1-7.9,1.7c-0.5,0.1-0.6,0.9-0.9,1.4c0.6,0.1,1.3,0.5,1.7,0.3 C580.7,372.9,583.2,371.9,585.7,371z M527.2,369.6c0.1,0.2,0.1,0.4,0.2,0.6c-1.2,0.5-2.4,1-3.6,1.4c0.1,0.2,0.2,0.5,0.3,0.7 c1.2-0.2,3-0.1,3.5-0.6c0.8-0.9,0.8-2.3,1.2-3.9c-2.8,0.5-4.8,0.8-6.7,1.2c0.1,0.2,0.1,0.5,0.2,0.7 C523.9,369.8,525.5,369.7,527.2,369.6z M576.3,366.8c2.8,0.8,8.9,0,10.9-1.5C583.5,365.6,579.7,364.9,576.3,366.8z M493.7,369.1 c-0.5-0.9-0.8-1.9-1-1.9c-2.6,0.1-5.1,0.5-7.7,0.7c0,0.2,0.1,0.4,0.1,0.5C487.8,368.7,490.5,368.9,493.7,369.1z M477.2,363.7 c0,0.2,0,0.3,0,0.5c5.4,0.1,10.8,0.1,16.4,0.2c-0.2-0.4-0.4-0.9-0.6-0.9C487.8,363.6,482.5,363.7,477.2,363.7z M379.7,362.3 c0.3,0.1,0.5,0.3,0.8,0.4c3.5-1.3,3.5-4.2,5.4-6.3c-0.2-0.1-0.4-0.2-0.6-0.3C383.4,358.2,381.5,360.3,379.7,362.3z M541.7,367.1 c-0.1-0.3-0.2-0.5-0.3-0.8c-3.5-0.5-6.2,0.7-8.6,2.5C535.7,368.3,538.7,367.7,541.7,367.1z M614.1,363.7c-0.1-0.2-0.1-0.4-0.2-0.6 c-1.3-0.1-2.7-0.3-4-0.3c-0.7,0-1.3,0.5-2,0.8c0.6,0.4,1.3,1.3,1.8,1.2C611.3,364.7,612.7,364.1,614.1,363.7z M392.6,362 c0.2,0.2,0.5,0.5,0.7,0.7c0.7-0.4,1.8-0.7,2.2-1.2c0.9-1.5,1.5-3.1,2.3-4.6c-0.1-0.1-0.2-0.1-0.3-0.2 C395.8,358.4,394.2,360.2,392.6,362z M564.2,363.9c-1.2-0.7-2.3-1.4-3.5-2c-0.3-0.1-1.5,0.2-1.6,0.4c-0.1,0.6-0.1,1.3,0.2,1.9 c0.2,0.3,1.3,0.3,1.9,0.2C562.2,364.3,563.2,364.1,564.2,363.9z M402.4,370c0,0.2,0,0.3-0.1,0.5c4,0.3,8,0.7,12.1,1 c0-0.3,0.1-0.6,0.1-1C410.5,370.3,406.5,370.2,402.4,370z M522.3,371.9c-3.3,0.4-6.2,0.8-9.1,1.1 C514.3,374.2,520.1,373.7,522.3,371.9z M398.4,365.8c0-0.3,0-0.6,0.1-0.9c-3.2,0-6.4-0.1-9.7-0.1c0,0.1,0,0.2,0,0.3 C392,365.4,395.2,365.6,398.4,365.8z M542,360.4c-4.2-0.9-7.8-0.3-9,1.5C535.9,361.4,538.6,361,542,360.4z M576.5,369.4 c0.1,0.3,0.3,0.6,0.4,0.9c2.8-0.6,5.6-1.2,8.5-1.9C582.4,368.7,579.1,368,576.5,369.4z M419.1,372c0,0.5,0,1,0,1.8 c2.5-0.5,4.8-1,7-1.4c0-0.1,0-0.2-0.1-0.3C423.7,372.1,421.5,372,419.1,372z M391.7,367.9c0-0.2,0-0.3,0-0.5 c-2.5-0.1-5-0.3-7.6-0.4c-2.4-0.1-4.9-0.1-7.3-0.1c0,0.1,0,0.2,0,0.3C381.8,367.4,386.8,367.7,391.7,367.9z M465.8,375.9 c1.8,0,3.3,0.1,4.8,0c0.7,0,1.4-0.4,2-0.8c0.1-0.1-0.3-0.9-0.5-0.9c-0.7-0.1-1.6-0.1-2.3,0.1C468.5,374.7,467.4,375.3,465.8,375.9 z M454.8,376.9c-0.8-2.1-2.8-1.4-4.2-1.5c-0.3,0-0.7,0.4-1.1,0.6c0.3,0.3,0.6,0.7,1,0.8C451.8,376.9,453.2,376.9,454.8,376.9z M462.1,340.1c-3.8,1.2-4.6,2-4.4,3.9C459.4,342.6,460.7,341.4,462.1,340.1z M476.4,370.5c0,0.3,0,0.5,0,0.8 c1.8,1,3.3,0.1,4.8-0.9C479.6,370.4,478,370.5,476.4,370.5z M449.9,372.8c2.4,0.5,4.8,1,7-0.5 C454.5,372.5,452.2,372.7,449.9,372.8z M541.3,364.4c0.3-0.1,0.5-0.3,0.8-0.4c-0.4-0.5-0.6-1.3-1.2-1.5c-0.5-0.2-1.4,0.4-2.6,0.8 C539.8,363.8,540.6,364.1,541.3,364.4z"/>
      <path d="M677.5,154.1c0.2,2.4,0.5,4.8,0.7,7.6c1.4-0.6,2.2-0.9,3-1.2c6.1-2.8,12.6-4.8,20-4.2c3.9,0.3,7.5,1.1,10.5,3 c4.9,3.1,10.7,3.5,16.7,2.8c3.1-0.4,6.1-1.1,9.6-1.7c0.2,0.6,0.4,1.4,0.5,2.1c0.4,3.1,0.9,6.2,1.1,9.4c0.1,1.5-0.4,2.9-0.6,4.4 c-0.4,2.9-0.8,5.8-1.1,8.7c-0.2,1.2-1.1,1.7-2.8,1.6c-0.9-0.1-1.9-0.1-2.7,0.1c-5,1-9.5,0.1-13.9-1.6c-1.2-0.5-2.8-0.5-4.2-0.5 c-6.8-0.4-13.6-0.8-20.4-1c-4.5-0.1-8.8,0.8-12.7,2.6c-0.6,0.3-1.4,0.5-2,0.5c-2.6-0.2-3.1,0.8-3.2,2.5c-1,13.2-2.4,26.3-3.2,39.5 c-0.5,9.4-0.2,18.9-0.2,28.3c0,10.9,0,21.7,0.1,32.6c0,9.9,0,19.7,0.2,29.6c0.1,7,0.9,14.1,0.8,21.1c-0.1,6-1.1,12-1.7,18 c-0.6,6.8-1.2,13.5-1.8,20.3c0,0.1,0.1,0.3,0,0.4c-0.7,0.9-1.4,1.7-2.1,2.5c-0.5-0.7-1.1-1.3-1.6-2c-3.2,0.1-6.6,0.1-10.2,0.2 c0.1-0.5,0.1-1,0.2-1.7c-0.9-0.5-3.6,0.4-1.8-2.4c-0.4,0.1-0.8,0.3-1.2,0.4c-2.4,1.1-4.8,2.3-7.2,3.4c-0.1-1.3-1-2-3.4-1.6 c-1.2,0.2-3.4-3.5-3-4.8c0.4-1.3,0.9-2.6,1.5-3.8c0.1-0.3,0.8-0.8,1-0.7c0.5,0.1,1.2,0.4,1.4,0.8c0.5,0.7,0.9,1.5,1.3,2.2 c0.4,0.7,0.7,1.4,0.8,1.6c0.7-0.4,1.5-1.1,2.5-1.2c0.8-0.1,1.7,0.5,2.8,0.9c-0.8-2.1-1.6-4.1-2.3-6.2c-0.3-0.8-0.2-1.6-0.4-2.4 c1,0.5,2,0.9,3.4,1.5c1.7-0.9,2,0.2,2.3,1.5c0.6,2.3,1.3,4.5,2,6.7c0.4,0,0.7,0,1.1,0c0.2-1.1,0.5-2.1,0.6-3.2 c0.5-4.2,0.9-8.5,1.5-12.7c0.4-3.3,1.1-6.5,1.5-9.8c0.6-4.1,1.3-8.1,1.6-12.2c0.5-7.7,0.6-15.4,1.1-23c0.3-5.1,1.1-10.3,1.6-15.4 c0.4-3.8,1.2-7.6,1.3-11.4c0.2-10.1-0.1-20.1,0-30.2c0.1-8.2,0.2-16.4,0.7-24.5c0.8-13.2,1.7-26.4,2.8-39.5 c0.4-5.1,1.8-10.1,2.7-15.1c0.4-2.1,0.6-4.1,0.8-6.2c0.4-4.1,0.6-8.1,1.1-12.2c0.2-1.5,0.8-3,1.3-4.5 C676.5,154,677,154.1,677.5,154.1z M680,162.8c2.9,1.8,5.9,2.4,9.9,2.3c3.3,0,6.8,0,9.9,0.7c3.2,0.6,6,2.2,9.1,3.1 c8.1,2.3,16.3,4.2,24.9,5c2,0.2,3.6-0.4,3.6-2c0-2.9-0.2-5.8-0.4-8.6c-0.1-0.9-0.6-1.5-2.2-1.1c-1.8,0.4-3.7,0.7-5.5,1 c-6.4,1.1-12.4,0.6-17.8-2.4c-1.6-0.9-3.3-1.8-5.1-2.3C696.4,155.8,688,158.2,680,162.8z M699.2,174c-3.1,1.4-5.6,2.5-8,3.7 c-0.4,0.2-0.7,0.8-0.7,1.2c0.1,1,0.4,2.1,0.6,3.2c2.2,0.4,2.9-0.4,3-1.9c0.1-1.1,0.3-2.2,0.5-3.2c0.3,0,0.7,0,1,0.1 c0.1,0.6,0.2,1.3,0.2,1.9c0,3.1-0.1,3.1,4.2,3.2c0.8,0,1.6,0.1,2.4,0.2c3.1,0.3,6.1,0.5,9.2,0.7c2,0.1,2.9-0.5,2.9-2.1 c0-2.4,0.4-4.8,0.4-7.2c0-0.6-0.5-1.2-0.8-1.8c-0.3,0.1-0.6,0.1-0.9,0.2c-0.2,2.1-0.5,4.3-0.7,6.4c-0.2,0-0.5,0-0.7,0 c0-0.7-0.1-1.4-0.1-2.2c0-1.3,0.3-2.7,0.2-4c-0.2-1.7-2.2-1.8-3.9-1.8c-0.8,0-2.1,0.8-2.2,1.3c-0.4,2.2-0.5,4.5-0.7,6.8 c-0.1,0.7-0.4,1.3-0.6,2c-0.3,0-0.7-0.1-1-0.1c0.2-2.7,0.4-5.4,0.7-8.1c-3.1,0.7-3.3,0.9-3.4,2.9c-0.1,1.9-0.4,3.7-0.6,5.6 c-0.3,0-0.6,0-0.9,0C699.4,178.6,699.3,176.5,699.2,174z M675.6,176.8c-0.4,0-0.7-0.1-1.1-0.1c-3.5,14.5-4.6,29.1-3.8,43.8 C672.3,205.9,674,191.3,675.6,176.8z M661.2,367.9c3.9-1.3,3.6-4.1,3.9-6.5c0.4-3.3,0-6.7,0.3-10c0.3-5.1,0.9-10.2,1.3-15.2 c0.1-0.7-0.2-1.4-0.2-2.1c-0.2,0-0.3,0-0.5,0.1C664.3,345.4,662.8,356.6,661.2,367.9z M670.1,320.6c-0.3,0-0.5,0-0.8,0 c-0.3,11.1-0.6,22.1-0.9,33.2C672,342.8,670.1,331.7,670.1,320.6z M719.7,182c-0.3,0-0.5,0-0.8,0c0-0.4-0.1-0.9,0-1.3 c0.1-1.9,0.3-3.9,0.3-5.8c0-0.6-0.9-1.2-1.4-1.7c-0.4,0.5-1,1-1.1,1.6c-0.4,2.1-0.7,4.3-0.7,6.4c0,0.6,0.6,1.5,1.3,1.9 c1.2,0.5,2.6,0.7,4.3,1.1c0.6-3,1.2-5.9,1.6-8.7c0.1-0.4-0.5-0.9-0.8-1.3c-0.5,0.4-1.2,0.7-1.5,1.2c-0.3,0.5-0.2,1.2-0.3,1.8 C720.3,178.7,720,180.3,719.7,182z M729,174.7c-0.1,1.4-0.1,2.6-0.3,3.9c-0.3,1.6-0.9,3.3-1.2,4.9c-0.1,0.6,0.1,1.5,0.6,1.7 c1.7,0.8,4.7-0.5,4.7-2c0-2.1-0.3-4.1-0.3-6.2C732.6,174.6,732.5,174.5,729,174.7z M727.2,175.6c-0.1-0.2-0.5-0.7-0.9-1.3 c-0.6,0.3-1.7,0.5-1.8,0.8c-0.6,2.8-1.2,5.6-1.5,8.4c-0.1,0.5,1,1,1.6,1.6c0.5-0.5,1.4-1,1.5-1.5 C726.6,181.1,726.8,178.7,727.2,175.6z M666.4,308.8c0.4,0,0.7,0.1,1.1,0.1c0.3-1.1,0.2-2.5,1-3.4c2.4-2.8,1.5-5.9,1.6-8.9 c0-0.4-0.8-0.8-1.2-1.3c-0.3,0.1-0.6,0.1-0.9,0.2C667.5,299.9,666.9,304.3,666.4,308.8z M663.8,378.2c3.2,0,3.3-0.1,3.3-2.5 c0-1.6,0.1-3.2,0.3-4.8c0.3-2.7,0.6-5.3,1-8c-0.1,0-0.3,0-0.4,0C666.5,368,665.1,373.1,663.8,378.2z M669.5,274.7 c0.2,0,0.5,0,0.7,0.1c0.5-7.1-0.3-14.2-0.5-21.3c-0.3,0-0.7,0-1,0C668.9,260.5,669.2,267.6,669.5,274.7z M734.5,184.4 c0.4,0,0.8,0,1.1,0c0.6-3,1.3-6.1,2-9.2c-3.2,0.1-3.4,0.2-3.5,1.8c-0.1,1.9-0.1,3.9-0.1,5.8C734,183.3,734.3,183.8,734.5,184.4z M678.2,172.6c-0.3,0-0.5,0-0.8,0c-0.3,4.3-0.6,8.6-0.9,13.1c2.5-1.1,3.4-3,2.7-4.1c-0.6-0.9-1.2-2-1.2-3 C677.9,176.7,678.1,174.7,678.2,172.6z M684.7,172.9c-0.3,0-0.5,0-0.8,0c-0.4,2.5-0.9,5-1.2,7.5c0,0.1,0.3,0.3,0.4,0.5 c0.3,0,0.5,0,0.8,0C684.1,178.3,684.4,175.6,684.7,172.9z M669,287.9c0.2,0,0.4,0,0.7,0.1c0.1-3.7,0.2-7.5,0.3-11.2 c-0.2,0-0.4,0-0.6,0C669.2,280.4,669.1,284.2,669,287.9z M669.4,229.1c0.3,0,0.6,0,1,0c0.1-2.1,0.3-4.2,0.4-6.3 c-0.3,0-0.6,0-0.9,0C669.7,224.9,669.6,227,669.4,229.1z M693.9,174.2c0.4,0,0.7,0,1.1,0.1c1.1-1.4,0-3,0.1-4.5 c-0.2,0-0.5,0-0.7,0C694.2,171.2,694,172.7,693.9,174.2z"/>
      <path d="M886.2,333.6c0.5-1,3.8-1.3,3.2-3.7c0-0.1,1.6-0.7,2.5-0.6c5.5,0.3,11.1,0.7,16.6,1c6.3,0.3,12.5,1.7,19,0.9 c3.1-0.4,5.4,0.8,7.3,2.8c6.2,6.4,10.7,13.4,15.7,20.3c0.5,0.6,1.2,1.2,1.5,1.9c0.4,0.8,0.8,1.9,0.4,2.6c-0.3,0.4-2,0.5-3,0.6 c-0.4,0.1-0.9,0-1.6,0c-0.2,2.5-0.3,5-0.5,7.5c-0.2,2.4-0.2,4.8-0.7,7.2c-0.3,1.6-0.1,2.9,2.5,3.5c-0.1,0.2-0.2,0.4-0.2,0.6 c-1.3,0.1-2.6,0.3-3.9,0.2c-5.7-0.2-11.4-0.5-17.1-0.6c-8.7-0.1-17.5,0.1-26.2-0.2c-8.6-0.3-17.1-1.1-25.6-1.4 c-5.2-0.2-10.4,0.1-15.5,0.2c-4.4,0.1-8.9,0.3-13.3,0.4c-2.5,0.1-5.1-0.4-7.2,1.3c-0.7,0.6-2.8,0.5-4.1,0.4 c-15.2-1.2-30.1-0.1-44.9,2.5c-7.7,1.4-15.6,0.4-23.1-1.6c-8.9-2.5-17.8-4.9-26.6-7.4c-2.1-0.6-3.1-0.2-3.3,1.4 c0,0.3,0,0.6-0.3,0.8c-0.6,0.4-1.3,0.8-2,1.1c-0.2-0.6-0.8-1.2-0.6-1.8c0.7-2.1,1.8-4.2,2.6-6.3c0.5-1.3,1.5-2.7-0.7-3.8 c4.3-2,4.7-9.5,3.7-12.3c1.7-1.5,3.3-2.7,4.6-4.1c4.6-4.4,9.1-8.8,13.7-13.2c2.6-2.5,5.1-5,7.9-7.7c-1.3-0.2-2-0.2-3.2-0.4 c3-0.9,5.3-1.5,8.4-1.1c4.5,0.7,9.2,0.6,13.8,0.9c10,0.8,20.1,1.6,30.1,2.4c0.8,0.1,1.7,0.2,2.4,0.1c2.6-0.3,4.5,0.1,5.8,2 c0.8,1.2,2.5,1.5,4.3,1c1.9-0.6,3.9-1.1,5.7-1.8c5.2-2.3,10.4-3.8,16.9-2.6c9.5,1.7,19.1,2.7,28.7,4c0.7,0.1,1.5,0.1,2.1,0.4 C883.2,331.8,884.5,332.6,886.2,333.6z M815.9,331.1c-0.2-0.2-0.3-0.4-0.5-0.7c-0.8-0.1-1.6-0.4-2.3-0.4 c-6.8-0.6-13.6-1.1-20.4-1.6c-6.2-0.5-12.5-1.1-18.8-1.4c-4.9-0.3-5.1,0-7.2,3.6c1-0.5,1.9-1,2.8-1.4c0.2,0.1,0.4,0.2,0.6,0.4 c-0.5,0.8-1,1.6-1.6,2.4c-1.5,2.1-5.2,3.5-3.5,6.6c0.1,0.1-0.2,0.4-0.3,0.5c-0.1,0.8-0.1,1.7-0.2,2.5c0.2,0,0.4,0.1,0.6,0.1 c-0.5,0.6-0.9,1.2-1.5,2c0.9,0,1.6-0.1,3-0.1c-1.7,2.7-3.2,5.1-4.6,7.4c6.3,0.4,13,0.8,19.6,1c1.5,0,3.3-0.6,4.5-1.4 c6.1-3.8,12.1-7.8,18.2-11.8C808.3,336.3,812.1,333.7,815.9,331.1z M878,332.5c0.2,0.1-0.2-0.1-0.6-0.2 c-10.9-1.4-21.7-2.8-32.6-4.1c-1.9-0.2-3.6,0.1-4.3,2.1c-0.6,1.9,1,3,1.5,4.3c-1.9,1.3-3.8,2.5-5.7,3.7c3.8-1.6,3.8-1.6,5.1-1.1 c-0.2,1.8-0.3,3.3-0.5,4.8c0.7,0,1.4,0.1,1.7,0.1c0.3,0.9,0.6,1.8,1,2.9c-0.9,0.6-2.1,1.3-3.1,2.2c-0.4,0.4-0.7,1.2-0.5,1.6 c0.8,1.5,1.8,2.9,2.9,4.3c1.2,1.5,2.8,1.9,4.8,0.7c2-1.2,4.1-2.4,6-3.7c3.7-2.4,7.6-4.7,11.1-7.3C869.5,339.6,873.7,336,878,332.5 z M901.7,355.6c8.4-7.2,16.8-14.3,25.6-21.7c-1.9-0.3-3.1-0.6-4.3-0.7c-1.6-0.1-3.3,0.1-4.9,0c-7.6-0.5-15.2-1.2-22.8-1.8 c-2.2-0.2-3.7,0.3-4.3,2.1c0.7,0.3,1.5,0.7,2.2,1.1c-0.7,1.1-1.3,2.1-1.9,3.1c0.2,0.1,0.4,0.2,0.6,0.2c0.4-0.4,0.7-1,1.2-1.2 c0.6-0.2,1.6,0,2.2,0.2c0.6,0.3,1,0.8,1.7,1.4c-0.3,0.4-0.8,1.3-1.5,2.2c1-0.2,1.8-0.4,2.7-0.6c0.2,0.6,0.3,1.1,0.4,1.5 c0.3,1.5-0.1,3.5,1.1,4.5c2.2,1.9,0.7,3.7,1.1,5.5c-0.3,0-0.7,0.1-1,0.1c-0.8-2.5-1.6-5.1-2.5-7.5c-2.5,3.5-2.1,5.3,1.2,8.2 C899.8,353.2,900.6,354.3,901.7,355.6z M823.1,332.2c-0.5,0.1-0.9,0.2-1.4,0.2c-1,2.9-2.2,5.7-2.9,8.6c-0.9,3.9-1.4,7.8-1.9,11.7 c-0.1,0.6,1,1.8,1.6,1.8c6.5,0.2,13.1,0.2,19.6,0.2c1.8,0,2.2-0.7,1.4-1.8c-1.6-2.2-3.1-4.3-4.7-6.5c-1.6-2.1-3.3-4.3-5-6.4 C827.5,337.4,825.3,334.8,823.1,332.2z M930.8,333.7c-0.4,1.2-0.8,2-0.9,2.7c-0.7,4.9-1.3,9.7-1.9,14.6c-0.5,3.9,0.2,4.4,5.4,4.8 c0.2,0,0.4,0,0.5,0c4.9,0.3,9.7,0.7,15.2,1.1C943.5,348.9,939.1,340.8,930.8,333.7z M741.1,368.9c-0.1,0.2-0.2,0.5-0.3,0.7 c3.9,0.6,7.8,1.3,11.7,1.9c1.4,0.2,2.9,0.4,4.2,0.7c6.5,1.4,12.9,2.9,19.3,4.4c1.4,0.3,2.3,0,2.6-1.1c0.8-2.8,1.6-5.5,2.2-8.3 c0.1-0.5-0.2-1.5-0.7-1.7c-2.3-0.9-4.7-1.9-7.2-2.4c-6.3-1.1-12.6-2.1-19-3c-3.4-0.5-6.9-0.9-10.3-1.3c-0.1,0.2-0.3,0.4-0.4,0.7 c0.9,0.4,1.8,1,2.8,1.2c5.9,1,11.8,1.8,17.7,2.7c5,0.8,10,1.6,15,2.5c0.5,0.1,1.2,0.6,1.2,0.8c0,0.3-0.6,0.8-1.1,1 c-0.6,0.2-1.4,0.1-2.1,0c-8.4-1.4-16.7-2.8-25.1-4.2c-0.6-0.1-1.2-0.2-1.9-0.3c-0.6-0.1-1.2-0.1-1.8-0.1 c10.1,3.1,21.3,2.9,31.2,6.5c-0.6,1.5-1.6,1.7-3.6,1.2c-3-0.9-6.2-1.7-9.3-2.3c-6.2-1.2-12.3-2.3-18.5-3.4 c-1.5-0.3-3.1-0.6-4.6-0.5c-0.7,0-1.6,0.7-2,1.2c-0.2,0.2,0.7,1.1,1.3,1.3c0.8,0.4,1.9,0.4,2.9,0.6c8.3,1.4,16.5,2.8,24.7,4.4 c2.3,0.4,4.4,1.3,6.6,1.9c-0.1,0.3-0.2,0.6-0.3,0.9c-1.9-0.2-3.9-0.3-5.8-0.6c-1.4-0.2-2.8-0.6-4.2-0.8c-3-0.6-6-1.1-9-1.7 C752,370.9,746.6,369.9,741.1,368.9z M865.1,369.6c0,1.1,0,1.6,0,2.2c0.1,2.5,0.8,3.1,4.1,3.1c2.4,0,4.7-0.1,7.1-0.4 c0.7-0.1,1.7-0.7,1.8-1.2c1.4-4.2,2.7-8.5,4.1-12.7c0.4-1.2-0.3-1.6-1.8-1.6c-3.7-0.1-7.5-0.3-11.2-0.5c-2.3-0.2-3.1,0.6-3.2,2.2 C865.7,363.9,865.3,367,865.1,369.6z M852,354.5c0.2,0.2,0.4,0.4,0.5,0.5c6.4,0.5,12.7,0.9,19.1,1.4c2.6,0.2,3.3-0.7,3.5-2.4 c0.3-3.5,0.8-6.9,1.3-10.4c0.3-2,0.8-4,1.2-6.3C868.8,343.3,860.4,348.9,852,354.5z M815.5,334.9c-6.5,3.1-26.2,16.5-27,18.4 c5.4,0.3,10.8,0.5,16.1,0.9c1.9,0.1,3.1-0.4,3.7-1.8c2-4.8,4.2-9.7,6.3-14.5C814.9,337,815.1,336,815.5,334.9z M806.9,366.2 c-0.1,0-0.2,0-0.3,0c0,2.6-0.1,5.2,0.1,7.8c0.1,0.7,0.7,1.8,1.5,2.1c3.5,1.1,7.2-0.6,7.4-3.5c0.2-3.8,0.1-7.6,0.1-11.4 c0-4.4-0.1-4.3-5.9-4.8c-2.4-0.2-2.9,0.5-2.8,1.9C806.9,361,806.9,363.6,806.9,366.2z M895.5,357c-1.4-6.6-7-15.6-11.8-19.2 c-0.3,2.6-0.6,5.3-0.8,7.9c-0.3,3.1-0.7,6.3-0.8,9.4c0,0.6,0.7,1.7,1.1,1.7C887.2,357,891.3,357,895.5,357z M926.6,338.2 c-0.2-0.1-0.4-0.1-0.6-0.2c-6.8,5.8-13.5,11.6-20.3,17.4c0.1,0.2,0.3,0.3,0.4,0.5c4.5,0,9.1,0.1,13.6,0c0.7,0,1.7-0.8,1.9-1.4 C923.3,349.1,924.9,343.6,926.6,338.2z M925.6,366.5c-0.1,0-0.3,0-0.4-0.1c0-0.9,0-1.9,0-2.8c0-5.5-0.3-5.7-7.6-5.6 c-1.6,0-2.4,0.3-1.9,1.7c0.4,1.3,0.6,2.7,1,4c0.4,1.3,1.2,2.6,1.3,3.9c0.1,2-0.3,4.1-0.2,6.1c0,0.6,1.3,1.5,2.1,1.5 c1.4,0.1,3.6,0.9,4-0.9C924.5,371.7,925,369.1,925.6,366.5z M818.5,374.7c0.1,0.3,0.2,0.5,0.2,0.8c0.2,0.1,0.5,0.3,0.7,0.3 c5.5,0.2,10.9,0.4,16.4,0.4c0.6,0,1.6-0.7,1.7-1.1c0.5-2.2,0.8-4.4,1.1-6.6c0.1-1.3-0.9-2-2.7-1.9c-5.5,0.3-10.9,0.7-17,1.1 c6.1,2.3,12-0.7,18.1,0.6c-2.5,0.6-5.1,1.2-7.6,1.8c2.5,0.3,5,0.6,7.5,0.8c-1.1,0.1-1.9,0.2-2.7,0.2c-4.4,0.2-8.8,1-13.1-0.4 c-0.5-0.2-1.3,0.4-2,0.6c0.6,0.4,1.2,1.2,1.9,1.3c1.5,0.2,6.6,0.3,7.6,0.5c0,0.2,0,0.5,0,0.7C825.2,374.2,821.9,374.5,818.5,374.7 z M803.4,370.2c-1.8,0.8-3.4,1.2-4.3,1.4c-5.8,1.3-9.1-0.2-14.6,1.7c-1,0.3-1.8,0.7-2.2,0.9c0.4,0.4,0.8,0.9,1.2,1.2 c0.2,0.1,0.4,0.2,0.5,0.2c5.8,1.9,7.9,1.8,7.9,1.8c3.1-0.2,4.9-1.6,5.5-0.8c0.3,0.3,0.2,0.9,0,1.3c0.9-0.3,2-0.5,2.9-0.8 c0.7-0.2,1.5-0.6,2-1C804.2,374.6,803.5,370.8,803.4,370.2z M841.1,375c3.9,0.2,7.4,0.5,10.9,0.5c2.9,0,5.8-0.2,8.7-0.5 c2-0.2,2.1-1.6,1.7-2.7c-0.1-0.3-1.8-0.6-2.6-0.5c-6,0.4-11.9,2.1-18.2,0.6C841.4,373.3,841.2,374,841.1,375z M745.5,352.1 c0,0.2,0,0.4,0,0.6c12.5,1.7,24.9,3.4,37.5,5.1c0.4-1.6-1.1-2.4-3.2-2.6C768.3,354.2,756.9,353.2,745.5,352.1z M802.6,365.7 c0,0.3,0,0.6,0,0.9c-6,0.2-12,0.5-17.9,0.7c1.7,0.7,3.6,1.5,5.6,1.6c3.9,0,7.8-0.4,11.7-0.6c2.3-0.2,1.5-1.5,1.7-2.5 c0.2-1.2-0.8-1.4-2.2-1.5c-3.4-0.1-6.7-0.3-10.1-0.4c-1.4,0-2.8,0.1-4.2,0.1c0,0.2,0,0.5,0,0.7C792,366.6,797.7,363.9,802.6,365.7 z M943.4,363.2c0.1,0.2,0.3,0.5,0.4,0.7c-0.4,0.1-0.8,0.3-1.2,0.4c-3.8,0.5-7.7,0.9-11.5,1.3c-0.4,0-1-0.4-1.4-0.7 c-0.5-0.4-0.9-0.9-1.5-1.5c-0.9,2,0.3,3,2.5,3c3.4,0,6.8-0.2,10.3-0.4c-0.6,0.3-1.2,0.5-2.2,1c1.6,0,2.6,0.1,3.6,0 c3.3-0.2,2.2-2.1,2.4-3.5c0.2-1.6-1.4-1.7-2.9-1.6c-2.6,0.2-5.2,0.6-7.8,0.9c0,0.1,0,0.3,0,0.4 C937.1,363.2,940.2,363.2,943.4,363.2z M883.1,375c-0.1-0.2-0.2-0.3-0.4-0.5c1-0.5,1.9-1.1,3-1.3c2.5-0.4,5-0.6,7.5-0.9 c1-0.2,1.9-0.6,2.8-1c-0.1-0.2-0.2-0.4-0.3-0.6c-4.2,0.2-8.5,0.4-12.7,0.7c0-0.3,0-0.5-0.1-0.8c2.6-0.2,5.2-0.3,7.9-0.5 c-2.3-0.4-4.6-0.5-6.8-0.4c-0.6,0-1.5,0.5-1.8,0.9c-0.6,0.9-0.8,1.9-1.1,2.9C880.7,374.6,881.3,375.3,883.1,375z M926.9,375.5 c5.2-0.6,10-1.2,14.8-1.8c1.5-0.2,2.7-0.5,1.9-2.1c-4.7,0.8-9.4,1.5-14,2.3c-0.1-0.3-0.2-0.5-0.3-0.8c1.9-0.3,3.7-0.7,5.6-1 c0-0.1-0.1-0.1-0.1-0.2c-2.4-0.1-4.8-0.3-7.4-0.4C927.3,372.8,927.2,374,926.9,375.5z M905.3,374.5c0,0.1,0,0.3,0,0.4 c2.5,0,5.1,0.1,7.6,0c0.8,0,2-0.9,2-1.3c-0.1-1.2-0.5-3.2-1.3-3.3c-3.5-0.6-7-0.1-10.4,0.6c0,0.2,0.1,0.4,0.1,0.6 c3.2-0.1,6.5-0.3,9.7-0.4c0.1,0.3,0.1,0.6,0.2,0.9c-3.2,0.5-6.3,0.9-9.5,1.4c0,0.1,0,0.1,0,0.2c2.3-0.1,4.7-0.2,7-0.3 c0,0.2,0,0.4,0,0.5C909,374.1,907.2,374.3,905.3,374.5z M883.1,368.3c5.2-0.4,9.8-0.8,14.4-1.2c0-0.3-0.1-0.6-0.1-0.9 c-3.2,0.4-6.4,0.7-9.7,1.1c0-0.2-0.1-0.3-0.1-0.5c0.6-0.2,1.2-0.4,1.8-0.5c-1-0.2-1.9-0.4-2.8-0.7c0-0.2,0-0.4,0.1-0.7 c2.2-0.2,4.5-0.5,7.1-0.7c-3,0-5.6-0.1-8.2,0c-0.5,0-1.3,0.5-1.4,0.9C883.6,365.9,883.4,366.9,883.1,368.3z M839.2,359.1 c-7,0.3-13.8,0.6-20.7,1c0,0.3,0,0.5,0,0.8c3.3,0.8,6.7,0,10,0c3.5,0,7,0,10.5,0C839.1,360.3,839.1,359.7,839.2,359.1z M777,360.7 c-8.6-2.5-29.8-4.8-32.8-3.9C754.8,358.1,765.6,359.4,777,360.7z M787,358.2c-0.1,0.2-0.1,0.4-0.2,0.6c0.6,0.2,1.1,0.5,1.7,0.5 c4.2,0.3,8.5,0.7,12.7,0.8c0.8,0,1.7-0.6,2.5-0.9c-0.9-0.3-1.7-0.9-2.6-0.9c-3.9-0.1-7.8-0.1-11.7-0.1 C788.6,358.2,787.8,358.2,787,358.2z M880.5,336.2c-1,6.9-2,13.5-2.9,20.1c0.5,0,1,0.1,1.5,0.1 C879.5,349.8,881.1,343.2,880.5,336.2z M913.5,362.6c-0.4-1.2-0.5-2.3-1.1-3.2c-0.3-0.5-1.2-1.2-2-1.3c-2.3-0.2-4.6-0.1-6.9-0.1 c-0.2,0.1-0.3,0.3-0.5,0.4c0.7,0.4,1.3,1,2,1c1.2,0,2.5-0.6,3.7-0.6c0.9,0,1.7,0.6,2.6,0.9c-0.5,0.5-0.8,1.1-1.4,1.4 c-0.7,0.4-1.7,0.5-2.6,0.7c0.1,0.1,0.1,0.2,0.2,0.3C909.3,362.4,911.2,362.5,913.5,362.6z M943.9,368.9c0-0.2,0-0.5,0-0.7 c-2.9,0.2-5.8,0.5-8.8,0.5c-1.7,0-3.5-0.3-5.2-0.4c-0.7,0-1.4,0.1-2.2,0.1C933.3,371.4,938.5,369.4,943.9,368.9z M929.6,358.2 c-0.1,0.2-0.1,0.5-0.2,0.7c4.5,0.6,9,1.1,13.5,1.6c0.5,0.1,1-0.3,1.5-0.5c-0.5-0.3-0.9-0.9-1.4-0.9 C938.6,358.7,934.1,358.4,929.6,358.2z M819.3,365.1c0,0.2,0,0.4,0.1,0.6c6.6,0.4,13.1-0.3,19.5-0.9c0-0.4-0.1-0.8-0.1-1.2 C832.2,364.1,825.8,364.6,819.3,365.1z M884.5,362.3c3.4-0.3,6.4-0.5,9.4-0.7c0,0.3,0.1,0.6,0.1,0.9c-1.3,0.2-2.5,0.3-3.8,0.5 c5.3,0.5,8,0.1,8.7-1.4C894.8,360.7,886.1,361,884.5,362.3z M831.5,336.8c1-1.9,3.8-2.6,3.4-5.2c-2.4,0.8-4.4,1.5-6.7,2.3 C829.4,334.9,830.2,335.6,831.5,336.8z M756,342.7c-0.1-0.1-0.2-0.1-0.3-0.2c-1.4,1.2-2.8,2.4-4.2,3.6c-1.4,1.3-2.7,2.6-4,3.9 c0.1,0.2,0.2,0.3,0.3,0.5c0.8-0.1,2.1-0.1,2.4-0.5C752.2,347.6,754.1,345.2,756,342.7z M811.4,354.3c2.6-0.4,3.7-4.5,2.3-7.7 C812.9,349.5,812.2,351.8,811.4,354.3z M787.1,360.8c0,0.1,0,0.2,0,0.4c5.4,0.1,10.8,0.2,16.2,0.4c-0.1-0.2-0.3-0.4-0.4-0.6 C797.7,360.9,792.4,360.8,787.1,360.8z M934.1,375.5c4.9,1.4,9.1,0.9,9.1-1.1C940.1,374.8,937.1,375.2,934.1,375.5z M842.4,357.2 c0,0.2,1.5,4.2,1.4,4.3c5,0,15.2,1.4,20.2,1.4c0-0.2-2-3.1-2-3.3C857.1,359.7,847.4,357.2,842.4,357.2z M906.9,364.3 c2.3,0.6,4.7,1.3,7.3,1.9C913.9,363.9,910.5,363.3,906.9,364.3z M819.2,357.1c0,0.3,0,0.6,0,0.9c4.7-0.2,9.4-0.4,14.2-0.6 c0-0.1,0-0.2,0-0.2C828.7,357.1,823.9,357.1,819.2,357.1z M757,348.3c-0.1-0.1-0.3-0.2-0.4-0.4c-1.2,0.7-2.4,1.4-3.7,2.1 c0.1,0.2,0.3,0.5,0.4,0.7c1.9,0.1,3.9,0.2,5.8,0.3c0-0.2,0-0.4,0-0.5c-0.9,0-1.8-0.1-3-0.2C756.5,349.5,756.8,348.9,757,348.3z M801.9,356.7c0-0.2,0.1-0.4,0.1-0.6c-4.3-0.2-8.7-0.4-13-0.6c0,0.2,0,0.4,0,0.7C793.2,356.4,797.6,356.5,801.9,356.7z M843.8,364.4c0,0.1-1.5,4.2-1.4,4.3c3.9-0.2,15.7-1,19.6-1.1c0-0.2,2.1-3.1,2.1-3.2C860.1,364.6,847.8,364.2,843.8,364.4z M803.5,363.3c0-0.2,0-0.5-0.1-0.7c-2.4,0.1-4.9,0.2-7.3,0.3c0,0.1,0,0.3,0,0.4C798.6,363.3,801,363.3,803.5,363.3z M886.5,359.5 c0,0.1,0,0.2,0,0.3c3.6,0,7.1,0,10.7,0.1c0-0.1,0-0.2,0-0.3C893.6,359.5,890.1,359.5,886.5,359.5z M819.3,362.9 c0.1,0.5,0.1,1,0.2,1.5c4.6-0.4,9.3-0.8,13.9-1.2c0-0.6-0.1-1.1-0.1-1.7C828.6,362,824,362.5,819.3,362.9z M833,338.2 c0.2,0.1,0.4,0.2,0.6,0.3c1.1-1,2.3-2.1,3.4-3.1c-0.3-0.2-0.6-0.4-1-0.5C835,336,834,337.1,833,338.2z M826.5,371.6 M807.7,381.8"/>
      <path class="st0" d="M537.1,325.6c0.9-3.8,1.4-7.6,2.9-11.3c15.9-39,47.8-64.9,98-74.8c22.5-4.4,45.2-9.6,68.6-6.2 c37.3,5.5,71.9,16.3,100.5,37.1c2.1,1.5,3.7,3.4,7,6.4c-2.8-0.9-3.7-1-4.2-1.4c-29.8-24.1-67.3-36.5-108.1-39.2 c-42-2.8-82.8,5.5-116.4,27.1c-21.3,13.7-35.6,32.6-42.3,54.4c-0.9,2.8-2,5.6-2.9,8.4C539,326,538,325.8,537.1,325.6z"/>
      <path class="st0" d="M547.6,319.9c0.4-19.8,44.6-66.6,81.1-71.6C588.7,262.7,563.6,288,547.6,319.9z"/>
      <path class="st0" d="M567,319.8c6.6-12.8,18.1-22.5,30.9-31.4C587.6,298.8,577.3,309.3,567,319.8z"/>
      <path class="st0" d="M597.7,299.3c-6.5,7.2-13,14.5-19.5,21.7c-0.7-0.4-1.3-0.8-2-1.1c6.4-7.3,12.8-14.5,19.3-21.8 C596.2,298.5,596.9,298.9,597.7,299.3z"/>
      <path class="st0" d="M570.8,295.7c-5.3,8.6-10.7,17.2-16,25.8c-0.6-0.2-1.2-0.5-1.8-0.7c5.2-8.8,10.4-17.5,15.6-26.3 C569.2,294.9,570,295.3,570.8,295.7z"/>
      <g>
        <g>
          <g>
            <path class="st1" d="M1047.8,378.1c-1.5,1.8-3.1,1.9-5.1,0.7c-1.6-1-3.3-1.8-5.2-2.7c-0.6,0.4-1.3,0.9-2.2,1.5 c0.9,1.1,2.9,2,1.2,3.3c-1.6-0.7-3-1.4-4.4-2c-0.1,0.1,0.3-0.3,0.8-1c-0.9-0.2-1.5-0.3-2.1-0.4c0-0.2-0.1-0.4-0.1-0.6 c0.6-0.1,1.2-0.5,1.7-0.4c2.2,0.9,2.2,0.9,2.3-1.2c1.4-0.4,2.7-0.8,4-1.2c0-0.3-0.1-0.5-0.1-0.8c0.6,0.7,1.2,1.4,1.9,2.1 c0.2-0.1,0.4-0.3,0.5-0.4c-0.8-0.8-1.4-2-2.3-2.4c-0.5-0.2-1.6,0.7-2,1c-0.4-0.8-0.9-1.9-1.5-3.3c1.8,0,3.7,0,5.8,0 c-0.5,0.9-0.7,1.3-1.2,2.1c1-0.2,1.7-0.3,2.6-0.4c-0.6,2.6,0.3,4.1,2.9,4.4c1.7-3.1,5-1.2,7.6-2.2c0-2.1-0.9-4.5,1.3-6.1 c0.1-0.1-0.6-1.6-0.8-1.6c-2.6,0.3-4.4-1.3-6.3-2.7c-0.8-0.5-1.8-0.6-3.6-1.2c1.3-0.9,2-1.8,2.9-2c0.6-0.1,1.4,0.7,2.1,1.1 c0.7,0.4,1.4,0.9,2.1,1c1.1,0.2,2.4,0.3,3.5-0.1c1.2-0.4,2.2-1.2,3.5-2.1c-1.1-1-1.7-1.4-2.6-2.2c2.5-0.6,4.7-1.1,7.4-1.7 c-2.1-2.6-4.4-2.7-6.3-2.5c-0.9-0.7-1.6-1.8-2-1.6c-2.3,0.8-3.6-0.6-5-2c0.6-0.8,1.2-1.7,1.8-2.5c-0.1-0.3-0.2-0.5-0.3-0.8 c-2.3,0.3-4.6,0.6-6.9,0.8c0,0.3,0.1,0.6,0.1,0.8c1.8-0.2,3.6-0.4,5.7-0.7c-1.1,1.5-2,2.7-3,3.9c2.1-0.5,3.7-0.7,4,1.8 c1.3-0.2,2.4-0.3,3.7-0.5c-0.4,1-0.8,1.7-1,2.2c2.3-0.1,4.7-0.3,7.2-0.4c0,0.3,0.1,0.6,0.1,0.9c-2.6,0.8-5.2,1.6-7.8,2.4 c0.1,0.2,0.1,0.5,0.2,0.7c1,0.3,1.9,0.6,3,0.9c-2.2,2.2-5,2.1-6.9,0.4c-0.7-0.6-2.2-0.9-3.1-0.6c-1.1,0.4-1.9,1.5-2.8,2.3 c0.9,0.9,1.8,1.8,3.1,3c0-0.1,0,0.5-0.1,1.3c0.9-0.2,1.7-0.3,2.5-0.4c0.1,0.6,0.2,1.2,0.3,2c0.8-0.2,1.5-0.5,2.1-0.6 c0.7-0.1,1.4-0.2,2.4,0.2c-1,0.8-1.9,1.5-2.9,2.3c0.3,0.3,0.6,0.8,1.2,1.6c-1.4-0.1-2.3-0.2-3.3-0.3c-0.1,0.2-0.1,0.3-0.2,0.5 c1,0.5,2,1,3,1.5c-2.4,0.4-4.9,0.9-7.4,1.4c-0.5-4-2.4-5.8-6.3-5.5c-1.2,0.1-2.3,0.7-3.4,1.1c0.3,1,0.7,1.9,1.3,3.6 c-1.1-0.8-2-1.1-2.5-1.8c-1.2-1.6-2.3-1.9-3.6-0.1c-0.9,1.3-1.9,2.6-3,3.7c-0.4,0.4-1.2,0.3-2,0.4c0.1,1.1,0.2,2.3,0.4,4 c-3.2-0.5-2.6-4.3-5.4-4.9c-0.2,0.1-0.7,0.4-1.4,0.8c0-1,0-1.9,0-2.9c-2.5-0.1-3.2,6.1-6.5,1.2c-0.4,0.6-0.7,1-1,1.4 c-0.5-0.8-0.9-1.6-1.8-3c-0.1,1.9-0.2,3-0.3,4.6c-0.9-1.3-1.6-2.1-2.7-3.7c-0.4,0.8-0.6,1.4-0.9,2c-1-0.6-1.9-1.1-3.1-1.9 c0.1,1.1,0.2,1.8,0.4,2.8c-1.4,0.3-2.8,0.7-3.8,1c-0.5-2.1-0.9-3.5-1.4-5.3c-0.8,0.4-1.7,0.9-2.6,1.3c-1.5-1.8-3-1.6-4.9,0.8 c0.9-0.3,1.6-0.6,2.6-1c0.1,0.9,0.1,1.5,0.2,2.4c1.1-0.5,1.9-0.9,3.1-1.5c0.3,1.1,0.6,2.2,1,3.2c0.9,2.2-0.6,1.9-1.9,2 c-2.6,0.2-5.2,0.5-7.7,0.7c0.1-0.3,0.3-1.2,0.6-2.5c-2.6,1-4.6,2.5-6.7,2.6c-2.2,0-4.4-1.3-6.9-2.2c-0.1,1.2-0.1,2-0.2,3 c-2.7-0.7-5.4-1.5-8.1-2.2c-0.1,0.3-0.2,0.7-0.2,1c3.3,0.8,6.6,1.7,10.3,2.6c-0.3-1.2-0.5-1.9-0.8-3.2c2.4,1,4.4,1.8,6.7,2.7 c1-0.8,2.5-1.9,4.6-3.4c-0.5,1.6-0.7,2.4-1.1,3.9c1.4-0.6,2.4-0.9,3.3-1.3c2.7-1.3,5.3-1.4,8-0.1c0.6,0.3,1.6,0.6,2,0.4 c3.2-2.1,6.8-0.3,10-0.9c1.2-0.2,2.2-1.2,3.3-1.8c1.5,1.8,3.3,1.8,4.9,0.2c1.6,0.2,3,0.3,4.9,0.6c2.4,3.4,5.5-0.1,8.7,0 c0.4,3,2.3,0.6,3.6,0.7c3,3.1,3.6,2.8,5.6-2c2.3,1,4.5,2.1,7,3.2c0.7-0.9,1.3-1.9,2-2.8C1048,378.3,1047.9,378.2,1047.8,378.1z M1027.5,374.5c1.5-1,2.7-1.8,4.3-2.9c0.7,1.4,1.4,2.8,2.1,4.1c-0.2,0.1-0.4,0.3-0.6,0.4 C1032.3,372.6,1029.7,375.5,1027.5,374.5z"/>
            <path class="st1" d="M997,342.5c-0.5,0.6-0.9,1.3-1.6,2.1c2.5,0.4,4.7,0.7,7,1c0,0.3,0,0.5,0,0.8c-0.6,0.3-1.1,0.5-2.3,1 c1.2,0.9,2.2,1.6,2.8,2c-0.2,1.3-0.4,2.2-0.7,3.8c-1.5,0.8-3.6,2.1-5.6,3.2c-1.2-1-2.3-2.4-2.9-2.3c-1.8,0.4-3.6,1.3-5.2,2.4 c-0.6,0.4-0.7,1.9-0.7,2.9c0,1.8-1.2,1.6-2.3,1.6c-0.6,0-1.3-0.1-1.9,0.2c-0.8,0.3-1.6,0.9-2.4,1.4c0.5,0.7,0.9,1.4,1.4,2.1 c0.2,0.3,0.6,0.4,1.2,0.8c-1.7,0.6-3,1.2-4.4,1.7c0,0.2,0.1,0.4,0.1,0.6c1.6,0,3.2,0,5.1,0c-0.3,1-0.5,1.5-0.7,2.1 c0.1,0.1,0.3,0.2,0.4,0.3c0.6-0.7,1.3-1.4,2.1-2.4c-1.1-0.4-1.9-0.7-2.9-1c0.8-0.6,1.4-1,2.2-1.6c-1.4-0.8-2.6-1.5-3.9-2.1 c0.1-0.3,0.1-0.6,0.2-0.9c2.3-0.2,4.6-0.4,6.7-0.6c0.6-1.2,1.2-2.2,1.8-3.4c-0.3-0.2-0.9-0.6-1.6-1c1.6-0.7,3.1-1.3,4.9-2 c0.4,0.6,1.1,1.4,1.9,2.3c0-0.2,0-0.5,0-0.7c2.6-0.3,5.2-0.5,7.9-0.8c-0.8-0.5-1.5-0.9-2.8-1.7c1.5-0.4,2.5-0.6,3.6-0.9 c-0.5-1.9-1-3.8-1.6-6.1c1.3-1.2,0.6-2.3-1.6-2.8c-1-0.2-2.1-0.2-3.1-0.5c-0.4-0.1-0.6-0.9-0.9-1.4 C997.3,342.7,997.2,342.6,997,342.5z"/>
            <path class="st1" d="M1002.7,361.4c-2.9,0-2.4,2.4-3.1,4.5c3-0.7,6.4,0.3,8.1-3c1.3,0.9,2.6,1.8,3.9,2.7 c0.2-0.2,0.4-0.5,0.6-0.7c-0.2-0.4-0.5-0.8-0.6-1.3c-0.1-0.4,0-1,0.2-1.3c0.1-0.1,0.8-0.1,1.2,0.1c1.9,0.9,3.8,2.2,5.8,2.8 c1.2,0.3,2.6-0.5,4.3-0.9c-0.9-1.4-1.7-2.6-2.5-3.8c-0.1-0.1-0.3-0.2-0.4-0.4c-1.7,0.3-3.1,0.2-4.4-1.5 c-0.9-1.2-2.5-1.8-3.7,0.2c-0.4,0.7-1.5,0.9-3,1.7c0.4-1.3,0.5-1.8,0.7-2.3C1007.2,357.5,1005.2,358.4,1002.7,361.4 c1.1-0.1,2.2-0.3,3.3-0.5c-0.1-0.2-0.3-0.3-0.4-0.5c0.6-0.6,1.2-1.2,1.8-1.7c0,0.3,0.1,0.6,0.1,0.9c1.1,0.4,2.2,1.3,3.2,1.1 c1.2-0.2,2.3-1.3,3.7-2.2c0.3,0.7,0.6,1.5,1,2.5c2.2,0,4.8-0.1,6.2,3.1c-2.2-0.5-3.5-2.1-5.6-2.1c-2.2,0-4.5-1.6-6.1,1.3 c-2.4-2.1-3.4-2.3-5.3,0.3c-1.6,2.3-2.4,0.9-3.6-0.1C1001.7,362.6,1002.2,362,1002.7,361.4z"/>
            <path class="st1" d="M1020.6,360.6c2-1.6,4-3.2,6.1-5c0.9,2,2.2,2.2,4.4,2.2c3,0,6,1.3,9,2.1c-0.3-1.3-0.5-2.4-0.8-3.5 c-0.1-0.2-0.1-0.7-0.3-0.7c-1.8-0.4-3.8-0.4-5.4-1.3c-1.7-1-3-2.3-4.9-0.4c-0.3,0.3-1,0.2-1.5,0.3c-1.6,0.1-2.9,0.4-3.6,2.2 c-0.2,0.5-2.1,1.1-2.3,0.9c-1.5-2.1-2.7-0.4-4,0.7c1.1,0.1,2.3,0.2,3.7,0.4c-0.3,0.6-0.6,1.2-0.9,1.7 C1020.4,360.4,1020.5,360.5,1020.6,360.6z M1034.4,356.5c-0.2,0.3-0.3,0.6-0.5,0.9c-2-0.4-4-0.9-6.1-1.3 c0.1-0.3,0.1-0.6,0.2-0.9c0.6,0.2,1.2,0.4,1.5,0.5c0.5-0.7,1.1-1.6,1.1-1.5C1032,354.8,1033.2,355.7,1034.4,356.5z"/>
            <path class="st1" d="M1030,346.3c0.8-0.1,1.7-0.1,2.7-0.2c-0.2,1-0.5,1.9-0.7,2.9c2.1,0.3,4,0.7,6.2,1 c-0.3,0.6-0.6,1.2-0.9,1.8c0.2,0.2,0.5,0.3,0.5,0.3c0.7-0.8,1.3-1.6,2.2-2.8c-2.5-0.6-4.5-1-6.6-1.5c0.6-1.7,1.2-3.2-2-3.3 c1.9-1,3-1.5,4-2.1c1.8-1,1.9-2.4,0-3c-1.5-0.5-3.4-0.1-5.1,0c-0.9,0-1.9,0-2.8-0.3c-2.6,1.4-2.7,1.4-3.8-0.6 c-1.6,0.6-3.3,1.1-5.2,1.8c-0.3,1.6-0.7,3.4-1.2,5.5c-0.2-0.2-0.1,0,0.1,0c1,0.4,2,0.8,3,1.1c-0.4-0.9-1-1.8-1.2-2.7 c-0.2-0.9-0.3-2.3,0.2-2.8c0.8-0.8,2.5-1.6,3.3-1.3c3,1.3,5.7,0.8,8.5-0.2c1.8-0.7,3.3-0.7,4.6,1.1c-2.2,1.4-4.2,2.8-6.3,4.2 C1029.6,345.6,1029.8,345.9,1030,346.3z"/>
            <path class="st1" d="M997.5,342.8c1.6-1.1,3.1-2.3,4.9-3.6c0,0-0.3-0.6-0.6-1.3c4.4-0.6,1.2,3,2.7,4.3c0.7-0.2,1.7-0.4,2.6-0.6 c0.4,3.9,4.7,3.2,6.5,5.4c-0.8-1.3-1.6-2.6-2.7-4.3c-0.4,0.1-1.3,0.5-2.3,0.8c-0.1-3.5-0.1-3.5-3.6-2.3 c0.1-0.8,0.5-1.8,0.1-2.3c-0.5-0.8-1.4-1.8-2.3-2c-0.6-0.1-1.4,1-2.1,1.5c-0.4,0.4-0.8,1-1.3,1.2c-0.4,0.2-1.1-0.2-1.6-0.1 c-1,0.2-1.9,0.6-2.8,0.9c0.6,0.7,1.3,1.3,1.9,2C997.2,342.6,997.3,342.7,997.5,342.8z"/>
            <path class="st1" d="M1048.1,378.4c0.5-0.2,0.9-0.5,1.8-0.9c-0.3,0.8-0.6,1.2-0.7,1.6c-0.1,0.6-0.3,1.4,0,1.7 c0.3,0.3,1.1,0.2,1.7,0.2c4.1-0.4,8.2-0.9,13-1.4c-1,1.1-1.5,1.6-2,2.1c0.1,0.2,0.2,0.4,0.3,0.6c1.3-0.3,2.5-0.7,4.1-1.1 c-1.5-2.1-3.2-2.6-5.3-2.3c-2.4,0.3-4.7,1.7-7.2,0.1c-0.7-0.4-2.3,0.8-4.3,1.6c1.1-1.7,1.7-2.8,2.4-3.9 c-0.2-0.2-0.3-0.5-0.5-0.7c-1.2,0.7-2.4,1.4-3.6,2.1C1047.9,378.2,1048,378.3,1048.1,378.4z"/>
            <path class="st1" d="M970.2,383.2c-0.9-0.7-1.8-1.5-2.7-2.2c-0.1,0.1-0.2,0.2-0.4,0.3c0.3,0.5,0.6,0.9,1,1.6 c-3.8-1-7.5-1.6-10.7,1.1c1-0.4,2.5,2.1,3.4-0.8c0.1-0.5,3.6,0,5.5,0.1c1.2,0.1,2.3,0.5,3.4,0.7 C970,383.8,970.1,383.5,970.2,383.2z"/>
            <path class="st1" d="M984.2,370c-0.8,1.4-1.8,2.8-2.3,4.4c-0.2,0.5,1,1.9,1.8,2.2c1.3,0.4,2.8,0.1,4.2,0.1c0-0.2,0-0.5,0-0.7 c-0.7,0-1.5,0-2.2-0.1c-1-0.2-2-0.6-3-0.9c0.7-0.8,1.4-1.6,2.1-2.4c0.4-0.3,0.9-0.5,1.3-0.8c-0.6-0.5-1.1-1-1.5-1.4 C984.4,370.2,984.3,370.1,984.2,370z"/>
          </g>
        </g>
      </g>
      <g>
        <path d="M1255.9,292c1.1,1.6,3.2,3,1.1,5.2c-3,3.1-6.1,1.6-9.7,0.2c0.7-1,1.2-1.7,1.1-1.5c-0.5-1.8-0.8-3-1.3-4.6 c-0.7,1.2-1.1,2.2-1.7,3.1c-1.5,2.2-5.3,2.5-5.7,0.4c-0.8-4.6-3.5-2.6-5.8-2.1c-1.1,0.3-2.1,1-4.1,2c1.3,0.8,2,1.3,2.9,1.9 c-1.3,0.4-2.4,0.8-3.2,1c0.1,1.6,0.2,2.9,0.3,4.3c-3-0.4-6-0.8-9.1-1.2c-0.2-0.6-0.3-1.1-0.5-1.7c1-0.3,2.1-0.5,3.8-1 c-3.6-1.5-5.5-2.4-7.5-3.2c4.3,0.8,4.8-2.8,5.9-5.3c0.2-0.4-2-2.6-2.6-2.5c-2.1,0.5-4,1.9-5.6-0.7c-1-1.6-1.9-3.3-2.7-4.7 c-4.1,0.6-8.4,1.3-13.1,2.1c1.3-5.2,1.3-5.2-4.7-6.2c0-1.5,0-3,0-4.8c-0.7,0.3-1.3,0.4-1.4,0.6c-0.2,4.5-5.1,4.5-7.1,7.3 c-0.3,0.4-3.1-1-5-1.7c1.1-1,1.7-1.6,3-2.8c-3.2,0.5-5.5,0.9-8,1.3c-0.4-1.8-0.8-3.1-1.1-4.5c-2,5-0.7,13.1-10.1,9.7 c-2,1.1-3.9,2.1-6.2,3.3c-0.4-1.8-0.7-3.1-1.3-5.5c-1.1,2.4-2.2,4-2.4,5.6c-0.5,3.5-2.2,5.1-6,4.2c0.1-2.6,0.3-5.2,0.4-7.8 c-0.2,0-0.4,0-0.6,0c-0.7,4.3-1.3,8.5-2.3,12.8c-0.2,1-1.7,2.4-2.5,2.3c-1-0.1-1.8-1.6-3.1-2.8c-3.1,1.5-2.9-1.4-2.9-3.9 c0-2.3,0-4.6-0.9-6.9c0,3.3,0,6.6,0,10.6c-2-2.9-3.5-4.8-6.6-2.7c-0.5,0.3-2-1-3-1.5c-0.4,1.2-0.8,2.4-1.2,3.6 c-0.2-0.3-0.4-0.7-0.7-1c-2.3,0.7-4.6,1.4-6.8,2.1c-0.1,0-0.2,0.3-0.3,0.3c-6.8-0.9-9.1,6.3-14.5,8.2c-2.3,0.8-4.2,3.1-6,5 c-0.4,0.4,0.6,2.1,0.9,3c-1.6,1.9-3.7,4.3-6.4,7.6c-0.6-0.1-2.4-0.5-4.4-0.8c-1.5,4.4-5.4,6.7-9.2,9.3c1.8-0.1,3.6-0.3,5.3-0.4 c0.1,0.4,0.2,0.8,0.3,1.2c0.8-2.2,1.5-4.4,2.3-6.7c5,2.9,6.6,2.5,9.3-2.3c-1.1-4.4,2.1-7.1,7.5-5.6c-1.7,1.3-3.6,2.1-5.4,3.2 c-0.9,0.6-1.5,1.7-2.2,2.5c1.9-0.5,3.9-1,5.8-1.5c0,1.8,0,3.4,0,4.6c2.9,0,5.5,0.2,7.9-0.1c0.7-0.1,1.4-1.3,1.9-2.1 c0.7-1.1,1.2-2.4,2.6-3.2c-0.3,1.5-0.7,3-1,4.5c0.3,0.1,0.5,0.2,0.8,0.3c0.8-1.5,1.5-3,2.2-4.3c1.4,0.1,2.8,0.6,3.9,0.2 c3.8-1.4,5.2-0.7,5.4,3.4c0.1,0.7,0.1,1.5,0.2,2.2c0.5-0.1,1-0.1,1.4-0.2c-0.1-0.9-0.3-1.8-0.3-2.7c-0.1-1.3-0.1-2.6-0.1-3.9 c1.2,0.1,2.8-0.3,3.7,0.3c5,3.3,6.9,8.6,8,14.2c1.6,8.3,0.4,16.6-0.2,24.9c-0.4,5.7-0.2,11.4-0.3,17.1c0,1.7,0,3.4-0.7,5.2 c-0.7-3.6,0.3-7.8-4.9-10.8c0.2,3,0.4,5.2,0.6,7.9c-2.2-1.9-4.2-3.6-6.2-5.3c-0.2,0.2-0.4,0.3-0.5,0.5c1.2,1.5,2.5,3,3.9,4.8 c-1,0.5-1.8,1-2.7,1.5c0.3,0.8,0.6,1.6,1,2.6c-2.6-1.1-4.9-2.1-7.1-3c-0.3,0.5-0.5,1-0.8,1.6c1.8,1.1,3.5,2.2,5.6,3.5 c-6.8,1.6-13.1,1.1-19.2-2c-1.2-0.6-2.4-1.5-3.6-1.8c-1.3-0.3-2.8,0.1-4.2,0.2c0.4,1.4,0.8,2.8,1.2,4.2c0.1-1.3,0.1-2.5,0.2-4.4 c3.9,1.8,7.2,3.4,10.5,5c-0.1,0.3-0.1,0.6-0.2,0.9c-3.5-0.5-7.1-1-10.6-1.6c-1,2.4-1.9,4.8-3.2,8c-0.9-1.1-1.7-2.2-2.8-3.6 c-3.5-0.5-7.7-1.1-11.9-1.7c-0.1,0.3-0.2,0.6-0.2,0.9c1.9,0.5,3.9,0.9,6,1.4c-0.8,0.7-1.3,1.1-1.6,1.4c3.9,0.8,7.8,1.5,12.2,2.4 c0.3-1.6,0.7-3.5,1.2-5.9c1.1-0.2,2.4-0.4,4.4-0.7c-1,1.3-1.5,2-2.1,2.8c0.3,0.3,0.5,0.6,0.6,0.6c5.8-0.4,11.7-0.8,17.5-1.4 c2.7-0.2,5.4-0.8,8.1-1c2.7-0.1,5.4,0.2,8.3,0.4c0.2,1.4,0.5,2.6,0.8,4.4c1.1-1.8,1.9-3.3,2.7-4.7c0.4,0.6,0.9,1.2,1.5,2 c1.6-1.8,3.2-4.7,4-2.9c1.2-0.9,2.4-1.7,3.7-2.6c0.3,0.7,0.7,1.4,1,2.1c0.5,0.2,1,0.7,1.5,0.7c2.5-0.2,5.1-0.3,7.5-0.9 c7.8-2,14.9,2.4,22.7,1.7c10.4-0.9,20.8-1.1,31.3-1.5c0-0.4,0-0.9,0-1.3c-4.6,0.4-9.1,0.7-13.7,1.1c0-0.2,0-0.4-0.1-0.6 c4.3-0.9,8.7-1.7,13.6-2.7c-5.8,0-10.9,0-16,0c-2.8,1.5-5.5,3.5-8.8,0.1c2.9,0,5.9,0,8.8,0c-1.3-0.6-2.6-1.7-3.9-1.7 c-4,0-8.1,0.4-12.4,0.7c0.1-1,0.2-1.7,0.3-2.8c-1.2,0.4-2.1,1-3.1,1.1c-2.2,0.3-4.7,4.2-6.8-0.6c-0.3-0.6-4.2-0.1-6.2,0.6 c-2.6,0.9-4.8,2.6-7.2,4c-0.3-0.3-0.7-0.7-1-1c1.5-2.5,3-5.1,4.4-7.4c-1.1-0.4-2.6-1-4.5-1.8c-1,1.5-2.1,3.2-3.2,4.8 c-5.4-14.6-1.6-29,1.2-43.5c-0.4,2.3-0.8,4.6-1.3,6.9c0.3,0.1,0.6,0.1,0.9,0.2c1-4.4,1.8-8.8,3.1-13.1c0.7-2.2,2-4.5,3.7-6 c4.2-3.6,8.8-6.7,13.8-10.4c0,2.4,0,4.3,0,6.6c2.1-0.7,4.1-1.3,6.6-2.1c-1-1.3-1.7-2.2-2.4-3.1c-0.2,0.2-0.4,0.3-0.5,0.5 c-0.1,0.8-0.2,1.6-0.3,2.4c-0.4,0-0.8-0.1-1.3-0.1c-2-4.4-2.2-7.9,1.5-12.3c3.8-4.5,8.9,0.2,12.6-3.2c-0.2,0.9-0.4,1.8-0.6,2.7 c5.5,0.5,7-0.9,5.6-5.8c2.3,0.8,4.6,1.6,6.9,2.4c-0.1,0.5-0.3,0.9-0.4,1.4c11.6-3.2,21.7,4,32.8,4.1c0,0.4,0,0.8,0,1.1 c-3.3,0.5-6.5,0.9-9.5,1.3c3.3,4.3,7.1-0.9,11.4-1.1c-1-1.2-2.1-2.4-2.7-3c1.4-1.7,2.8-3.7,4.4-5.4c1.5-1.5,7.6-0.3,9.6,1.7 c3.1,3.1,10,1.3,11-3C1259.5,293.8,1258.5,292.2,1255.9,292z M1195.3,287.1l-0.1,0.1L1195.3,287.1l0.1-0.1 C1195.4,287,1195.3,287.1,1195.3,287.1z M1131.4,305.1c-0.1,0-0.2,0.1-0.3,0.1C1131.2,305.2,1131.4,305.2,1131.4,305.1 c0.1-0.1,0.2-0.2,0.3-0.3c0,0.1,0,0.2,0,0.2C1131.6,305,1131.5,305.1,1131.4,305.1z M1146.3,340.5c-0.4-3.4-1.3-6.9,2.3-9.4 c0.7,2,1.3,3.7,2,5.7c-1,0-2.1,0.1-3.2,0.1C1146.9,338.1,1146.6,339.3,1146.3,340.5c0.2,1.3,0.4,2.7,0.7,4.7 c-0.8-1.2-1.1-1.7-1.9-2.8c0,5.8,0,10.8,0,15.8c-0.3,0.1-0.5,0.1-0.8,0.2c-0.3-0.9-0.7-1.9-1-2.8c-0.4,0.3-0.7,0.7-1.1,1 c0.4,3.3,0.9,6.6,1.3,9.9c-3.3-1.4-1.8-3.7-2.2-5.7c-1.1-6.4,1.1-12.2,2.5-18.2C1144,341.7,1145.4,341.2,1146.3,340.5z M1154.8,306.6c3.8,11.7-4.5,17.3-9.4,25.4c-0.8-4.5-1.6-8.3-2.2-12.1c-0.8-4.6,2.9-8.1,7.4-7.3 C1151.9,310.7,1153.2,308.9,1154.8,306.6z M1171.6,297c0.4,1.7,1.3,3.3,0.8,4.4c-0.4,0.9-3.2,0.8-3.5,1.7c-0.7,2-2,2-3.6,2.1 c-4.5,0.3-5.7-2.5-6.5-6.8c2.3,0.4,4.1,0.8,6.5,1.2c1-1,2.7-2.5,4.3-4.1c0.2,0.2,0.3,0.3,0.5,0.5c-0.2,0.5-0.4,1-0.7,1.9 C1170.4,297.4,1171,297.2,1171.6,297z M1103.2,319.5c3.2-4.7,6.5-9.5,9.7-14.2c0.4,0.3,0.9,0.6,1.3,0.9c-1.1,1.3-2.2,2.6-3.2,4 c-0.6,0.9-1.4,2.1-1.4,3.1C1109.8,316.6,1107.7,319.5,1103.2,319.5z M1155.2,302.5c-5.9,0.2-6.3,0-7.8-6.4 c2.5,0.3,4.9,0.6,6.9,0.9C1154.7,299.1,1154.9,300.6,1155.2,302.5z M1211.5,288.5c-0.1,0.5-0.2,1-0.3,1.4 c-1.7-0.5-3.4-1.5-5.1-1.5c-2.1,0.1-4.2,1-6.3,1.7c-1.7,0.6-3.3,1.5-5,2.2c2.6-2.3,5.1-4.4,8-5.2c2.7-0.8,4.7-4.9,8.7-2.3 c-1.4,1.1-2.5,2-3.9,3.2C1209.3,288.3,1210.4,288.4,1211.5,288.5z M1161.5,307c1.5-0.2,2.6-0.4,3.7-0.5c0.7,0,1.6,0.1,2.1,0.5 c0.3,0.2,0.3,1.5,0.1,1.7c-1.7,1.3-3.5,2.5-5.3,3.7c-0.2-1.7-0.5-3.5-0.7-5.2C1161.4,306.9,1161.6,306.6,1161.5,307z M1131,311.5 c2.9,0,4.7,0,6.6,0c0,2,0,3.9,0,5.8c-0.3,0.2-0.6,0.4-1,0.6C1134.9,315.9,1133.1,313.8,1131,311.5z M1237.5,292.8 c0.4,0.4,0.7,0.8,1.1,1.2c-1.7,2.4-3.5,4.7-5.2,7.1c-0.6-0.5-1.1-1-1.7-1.5c1.1-1.1,2.2-2.2,4-4c-0.9-0.3-1.8-0.6-2.7-0.9 c0.2-0.3,0.4-0.6,0.5-0.8C1234.9,293.5,1236.2,293.1,1237.5,292.8z M1159.5,297.3c3.2-3.5,6.1-6.7,9-10 C1165.7,290.8,1165.4,296.5,1159.5,297.3z M1145.2,308.2c3.2-5.2,6.2-6,9.5-2.6C1150.4,301.8,1149,307.7,1145.2,308.2z M1106.1,305.2c-1.9,6-2.4,6.2-7.6,3.3c1.7,0,3.4,0,5.5,0C1104.4,307.7,1105.2,306.4,1106.1,305.2z M1178,297.2 c-0.4-0.5-0.7-0.9-1.1-1.4c2.7-1.8,5.5-3.7,8.2-5.5c0.1,0.2,0.2,0.4,0.4,0.6C1183,292.9,1180.5,295.1,1178,297.2z M1170.7,383.9 c0.1-0.4,0.2-0.8,0.2-1.3c3,0.3,6.1,0.7,9.1,1c0,0.4-0.1,0.7-0.1,1.1C1176.8,384.4,1173.7,384.2,1170.7,383.9z"/>
        <path d="M1197.4,236.3c-1.6,0-4.4-0.6-4.8,0c-1.3,2.6-3.5,2.5-5.5,2.3c-3.5-0.3-6.9-1-10.4-1.6c0.2-1.6,0.3-2.8,0.4-4.1 c-5.9-0.1-12.3,4.7-16.9-2.6c-4.4,4.5-7.4-3.8-12.4-0.8c-0.4,1.7-1.2,4.3-1.9,7c-2.7-4.5-3.7-4.8-8.9-3.2 c-2.4,0.8-4.5,0.9-4.9-2.8c-0.1-1.5-1.5-2.8-2.6-4.6c1.5-1.3,3.4-2.9,5.3-4.6c-0.9-1.2-1.6-2.1-2.6-3.3c2.7-1.5,5.3-2.9,8-4.4 c-1.6-2.3-6.7,2.3-6.5-3.2c-2.9,2.4-1.2,3.4,1.3,4.9c-2.5,0.3-5.1,0.6-7.7,0.9c0.3,2.9,1.4,5.7,0.5,7.6c-0.7,1.5-3.8,1.8-6.4,2.9 c0-2,0.2-3.4-0.1-4.6c-0.2-0.8-1.5-2.2-1.7-2.1c-3.1,1.3-2.9-1.8-4.1-2.9c-0.4,2.2-0.8,4.4-1.1,6.7c1.6-0.9,3.4-2,5.5-3.3 c0.2,1.2,0.6,1.9,0.4,2.4c-1.3,4.2,0.2,5.3,4.2,4c1.7-0.5,5.9,3,6.4,4.7c0.4,1.3,1.1,2.6,2,4.6c-3.6-1.3-7,1.8-10.5-0.9 c-0.7-0.5-2.3,0.2-3.4,0.4c-0.2,0-0.3,0.5-0.5,0.6c-2.1,1.2-4.1,2.3-6.2,3.4c1.5,2,2.9,4.1,4.7,6.5c-2.5-0.4-4.7,5.7-7-0.7 c-2.5,1.7-4.8,3.4-7.2,5.1c4.5,5.2,2.9,9-4.9,12.4c1.4,0.1,3-0.1,4.2,0.5c1.1,0.6,1.8,2,2.6,2.5c1.6,0.9,3.3,1.7,5.3,2.8 c6.1-1.7,13.3-3.6,21-5.7c0-1.3,0-3.6,0-6.4c3.2,0.8,6.1,1.5,9.3,2.4c-1.4-1.5-2.6-2.7-3.8-4c0.3-0.2,0.5-0.5,0.8-0.7 c1.9,0.8,3.9,1.5,5.8,2.3c2.1,0.8,4.2,1.5,6.2,2.2c0.1-5,2.7-7.1,7.8-6c0.2,1.8,0.1,5,0.6,5.1c2.3,0.5,4.8,0.2,7.3-0.1 c2-0.2,3.9-0.9,5.8-1.2c3.8-0.6,4.7-1.9,3-6.1c2.3-0.6,4.4-1.1,6.4-1.6c-0.8-0.5-1.8-1.2-2.9-2c5.4-3.1,9.3-9.2,17.4-6.6 c-0.9-1.3-1.4-2.2-2.3-3.6C1194.6,236.7,1196,236.5,1197.4,236.3z M1117.5,263.3c-1.5,1.2-2.9,2.3-4.4,3.5 c-0.3-0.4-0.7-0.7-1-1.1c1.6-2.1,3.2-4.1,4.9-6.2c0.3,0.2,0.6,0.3,0.8,0.5C1117.7,261.1,1117.5,262.3,1117.5,263.3 c1.9-2.1,3.9-4.4,5.8-6.6c0.2,0.2,0.5,0.4,0.7,0.5c-1.9,2.7-3.8,5.5-6.1,8.9C1117.7,264.6,1117.6,264,1117.5,263.3z M1155.3,250.5c-0.4-0.4-0.9-0.8-1.3-1.3c-1.1,0.8-2.2,1.5-4,2.7c0.9-1.8,1.6-3.1,2.2-4.3c0-1-0.4-2.2,0.1-2.8 c1.7-2.4,3.7-4.6,5.6-6.8c1.1-1.2,2.4-2.2,3.6-3.4c0.3,0.3,0.5,0.6,0.8,0.9c-1.7,2-3.5,3.9-5.2,5.9c2.6-1.9,5.2-3.8,8.2-6.1 c-0.6,1.6-1,2.5-1.4,3.4c1.2-0.2,2.4-0.4,3.6-0.5c0.6-0.1,1.3-0.3,2.7-0.6c-1.8,2.2-3.2,3.7-4.5,5.2c1.3-0.6,2.7-1.3,4-1.9 c0.3,0.3,0.5,0.6,0.8,0.9c-3.6,3.6-7.2,7.1-10.8,10.7c-0.4-0.3-0.8-0.6-1.2-0.9c0.6-1,1.1-2.1,1.9-2.9c1.7-2,3.6-3.9,5.4-5.8 c-2.5,2.1-4.9,4.2-7.4,6.2C1157.6,249.7,1156.4,250,1155.3,250.5z M1168.7,249.6c1.9-0.1,2.7,0.8,1.5,2.3c-1.2,1.5-3,2.5-4.6,3.8 c-0.2-0.3-0.5-0.6-0.7-0.8c1.2-1.7,2.4-3.3,3.5-5c-3.1,2.5-6.2,5-9.3,7.5c-0.4-0.4-0.7-0.9-1.1-1.3c3.8-3.1,7.5-6.3,12.2-10.2 C1169.5,247.8,1169.1,248.7,1168.7,249.6z M1138,245.3c-1,1.7-2,3.4-3.4,5.7c3.1-2.6,5.5-4.7,7.9-6.7c0.2,0.3,0.4,0.6,0.6,0.8 c-2.8,3.3-5.5,6.7-8.5,9.8c-0.7,0.7-2.3,0.4-3.6,0.6c0.1-1-0.1-2,0.3-2.9c0.5-1.2,1.3-2.4,1.9-3.5c-0.9,0.7-1.9,1.4-3.4,2.6 c0.1-2-0.4-3.8,0.3-4.5c3.3-3.2,6.8-6,10.6-9.3c0.8,2.2,1.3,3.4,1.9,5C1141,243.8,1139.5,244.5,1138,245.3z M1119.6,244.1 c0.3,0.1,0.6,0.3,0.9,0.4c-3.4,7.1-6.9,14.2-10.3,21.2c-0.6-0.3-1.2-0.6-1.8-0.9C1112.2,257.9,1115.9,251,1119.6,244.1z M1128.5,237.3c-0.5,2.7-0.9,5.1-1.5,8.3C1123.2,238.8,1123.3,238.6,1128.5,237.3z M1140.7,250.9c1.7-0.5,2.9-0.9,4.4-1.4 c0.3,2.2,0.6,4.1,0.8,6.1c-0.5,0.2-1,0.5-1.5,0.7C1143.3,254.6,1142.1,252.9,1140.7,250.9z"/>
        <path d="M1217.4,217.8c-0.9,2.3-0.2,3.5,2.3,4c1.8,0.3,3.6,0.9,5.4,1.4c-0.2,3.5-0.3,6.6-0.5,10.5c-1.2,0-2.7-0.1-4.3,0 c-3.3,0.3-6,1.5-7,5.2c-0.2,0.8-0.9,1.9-1.6,2c-6.7,1.2-10.4,6.5-14.7,10.9c-1.7,1.8-3.5,3.2-6,1.2c-0.2-0.2-1,0-1.4,0.2 c-2.6,2-5.1,4-7.9,6.2c3,2.8,4.7,0.9,6.2-0.7c2.2-2.3,4-2.3,5.7,0c6.3-1.4,13.6,1.2,19-4.6c-0.5,1-0.9,2-1.5,3.4 c3.8-1,4.9-6.6,10-5.5c-0.4,1.2-0.7,2.2-1,3.3c0.2,0.2,0.4,0.4,0.6,0.5c1.9,1,3.8,1.9,5.7,3c2.5,1.5,5.3,0.3,6.5-2.2 c0.9-1.9,2.6-3.5,4-5.2c0.2,0.5,0.5,1,0.7,1.5c1.4,0.4,2.8,1.2,4.1,1.1c3.5-0.1,4.6,1.3,3.3,5.2c1.6,0.3,3.1,0.7,4.6,1 c-0.9-1.5-2-3-2.8-4.6c-1.2-2.5-6.3-5.2-9.3-4.6c-1.3,0.2-2.6,0.7-4.1,1.1c0.5-4.3-1.7-4.5-4.9-3.6c-1.2,0.3-2.7,0-4-0.1 c0.1-1.5,0-3.1,0.3-4.6c0.9-4.5,2.2-8.9,1-13.8c-0.6-2.3,1.3-5.2,2-7.8c-2.3-0.4-5.3-0.9-8.8-1.5c1-0.6,1.6-0.9,2.7-1.5 C1220,218.6,1218.7,218.2,1217.4,217.8z M1215.8,241.3c0.1-1.6-0.3-4.1,0.6-4.7c1.8-1.2,4.2-1.4,6.4-2c0.1,0.5,0.3,0.9,0.4,1.4 C1220.7,237.7,1218.3,239.4,1215.8,241.3c-1.8,5-4.9,8.9-9,12.4C1206.7,246.6,1211.3,243.9,1215.8,241.3z M1227.1,249.8 c2.1-0.1,3.5-0.2,4.8-0.3c0.3,0.3,0.7,0.6,1,1c-4.5,1.2,1.1,6.8-4.5,7.5c0.5-0.5,1-1.1,1.8-1.9c-2-0.5-3.6-0.8-6-1.4 c2.1-1,3.5-1.6,5-2.3C1228.6,251.7,1228.2,251.1,1227.1,249.8z"/>
        <path d="M1078,288c2,0,4.4-0.6,4.2,3c1-0.5,1.8-1.2,2.4-1.1c6.9,1.8,9.5-4.2,13.6-7.4c1-0.8,2.3-1.3,3.6-2 c-1.3,2.8-2.3,5.1-3.3,7.4c0.7,0,1.4,0,2.1,0c0.5-0.7,0.9-1.8,1.6-2.2c2.9-1.4,5.9-2.5,9.3-3.9c0.3,1,0.7,2.4,1,3.6 c-1.4,1.1-2.5,2.2-3.8,2.8c-0.9,0.4-2.1,0.2-3.1,0.2c-0.1,0.2-0.3,0.4-0.4,0.6c0.4,0.4,0.7,1,1.2,1.1c0.8,0.1,2.4,0,2.5-0.3 c0.9-3.8,8.8,0,7-6c-2.9-1.7-5.5-3.3-8.2-4.9c-0.3,0.4-0.6,0.7-0.9,1.1c0.4,0.5,0.9,1,1.7,2c-1.5,0.6-2.7,1.2-4.4,1.9 c0-1.8,0-3.1,0-4.8c-2.6,1.1-5.4-1.5-7.5,1.7c-0.4,0.5-3.2-0.6-5.7-1.1c0.9,1.7,1.4,2.7,2,3.8c-0.3,0.3-0.5,0.5-0.8,0.8 c-2-2-4-3.9-6.1-6c0-1.1,0-2.6,0-4.1c-1.6,0.2-3.2,0.2-4.7,0.6c-3.9,1-7.8,2.2-11.3,3.3c-2-1.8-3.8-3.4-5.7-5 c-1,0-2.1-0.1-3.1,0.1c-1.1,0.2-2.4,0.5-3.1,1.2c-0.4,0.4-0.4,2.2,0.1,2.5c0.8,0.7,2.2,1,3.2,1c1.6-0.1,3.2-0.6,4.8-1 c0,0.4,0,0.9,0,1.3c1.6,0.2,3.4,0.9,4.9,0.6c4.7-1,9.3-2.3,14.3-3.6c-0.7,1.4-1.3,2.8-2.1,4.5c1.7,0.5,3.1,0.9,5,1.4 c-0.6,1.4-1.1,2.6-1.5,3.6c1.3,0.8,2.6,1.6,3.8,2.3c-0.5,0.7-1,1.4-1.5,2.1c-2.4-0.7-4.8-1.7-7.2-2.1 C1080.6,286.9,1079.2,287.7,1078,288z"/>
        <path d="M1078.2,327.2c-2.2-1.6-4.4-3.3-6.6-4.9c-0.2,0.3-0.5,0.7-0.7,1c1.7-1.3,3.4-2.7,5.1-4c-0.2-0.4-0.5-0.8-0.7-1.2 c-2.9,1.4-5.8,3.8-8.7,3.9c-2.6,0.1-6.9,1.3-8.6-3.3c0.9-0.2,1.5-0.3,1.9-0.5c1.8-0.8,3.6-1.6,5.4-2.4c-1.5-1.1-3.3-2-4.4-3.4 c-1.3-1.7-2.1-3.8-3.1-5.7c-1.5,2.6-0.7,5.4,2.1,6.7c1.3,0.6,2.7,1.1,4,2.5c-3.1,0.9-6.3,1.8-9.4,2.9c-1,0.4-1.6,1.5-2.4,2.3 c0.9,0.6,1.8,1.5,2.8,1.7c2.2,0.3,4.5,0,6.7,0.3c4.1,0.5,8.1,1.2,12.2,1.8c2.2,0.3,2.4,1.5,1.4,3.1c-0.7,1.1-1.6,2.2-1.8,3.9 C1074.9,330.3,1076.6,328.7,1078.2,327.2z"/>
        <path d="M1074.9,250.6c-0.7,0.3-1.4,0.5-2,0.8c-0.1-0.2-0.3-0.5-0.4-0.7c0.8-0.8,1.7-1.6,2.7-2.5c-1.6-2.2-3.1-4.3-4.6-6.2 c2.7-1.3,5.4-2.6,8.1-3.9c-0.5-0.9-0.9-1.6-0.9-1.7c3.2-2.2,6.3-4.3,9.2-6.3c-0.1-2.6-5.2-1.6-3.1-5.2c-3.6,2.4-1.4,3.5,1.9,5 c-4.6,2-8.6,3.7-13.3,5.7c1.7,1.1,2.6,1.6,4.6,2.9c-4.5,1.1-8,2-12.5,3.1c2.1,0.7,3.6,1,4.8,1.7c1.1,0.7,1.7,2,3.2,3.9 c-3.3-0.3-5.1-0.5-6.9-0.7c-0.1,0.5-0.3,1.1-0.4,1.6c1.9,0.7,3.7,1.3,5.8,2.1c0.5,0.7,1.3,1.7,2,2.6 C1073.6,252,1074.3,251.3,1074.9,250.6z"/>
        <path d="M1165.3,198.7c0-3.6,2.7-2.5,4.4-2.3c3.1,0.4,4.6,2.2,2.7,5.7c2.6-0.1,4.4-0.2,6.5-0.3c-0.3,2-0.5,3.5-0.8,5.5 c3.8,0.6,7,0.2,9.9-2.3c2.4-2,3.9-1.5,4,1.8c2.5-2.4,1.7-4.1-1.4-3.9c-2.1,0.1-5.9-2.1-6.4,2.8c0,0.5-2.7,0.7-4.1,1 c-0.3-2.1-0.2-4.2-1-5.7c-0.4-0.7-2.7-0.4-4.2-0.6c-1.1-4.3-4.3-6.3-8.9-5.1C1163.7,195.9,1163.6,196.6,1165.3,198.7z"/>
        <path d="M1197.2,316.3c1.2-0.8,2.4-1.5,3.6-2.2c0.6,1.5,1.3,3,1.5,3.6c2.1-0.1,4.2-0.1,6.3-0.3c1.6-0.2,3.2-0.6,5.2-1 c-0.1,0.3-0.5,1.5-0.8,2.5c1.9-0.3,4.1-0.6,6.3-1c0.3,0.4,0.6,0.9,0.8,1.3c0.5-1.4,1-2.7,1.5-4.1c-0.3-0.3-0.6-0.5-0.8-0.8 c-2.3,1.8-4.5,3.7-6.5,0c-0.2-0.3-2.6,0.6-4,1c0,0.6-0.1,1.3-0.1,1.9c-2.7-1.4-5.4-3-8.2-4c-1.3-0.5-3.2-0.1-4.5,0.5 c-0.6,0.3-0.6,2-0.8,3.1C1196.8,316.7,1197,316.5,1197.2,316.3z"/>
        <path d="M1069.1,260.5c1.2,3.8,2.4,4.1,5.1,1.7c2.6-2.4,5.4-4.6,8-7c0.6-0.5,0.6-1.7,0.9-2.5c-1,0.7-1.9,1.4-3,1.9 c-0.9,0.4-2.4,1-2.7,0.6c-2.8-2.8-4.6,0.8-6.9,0.9c0.1,1-0.1,2.4,0.5,3c0.6,0.6,1.9,0.4,3.1,0.6 C1072.8,263.4,1071,262.5,1069.1,260.5z"/>
        <path d="M1192.1,206.8c-1.2,2.7,1.2,2.2,2.4,2.5c3,0.6,6.1,1,9.7,1.5c-0.9,1.4-1.5,2.2-2.3,3.3c5.3,0.1,9.2-5,14.5-2.8 c-0.8,1.1-1.5,2.2-2.3,3.3c1.8-1.1,3.7-2.1,6.1-3.5c-3.6-1.1-6.6-2.1-9.6-3c-1.3,3.5-2.9,3.9-6,2.4c-2.4-1.1-5.2-1.3-7.7-2 C1195.3,207.9,1193.7,207.3,1192.1,206.8z"/>
        <path d="M1083.9,224.9c1.5-0.6,2.9-1.2,4.1-1.7c0-1.5-0.2-4,0-4c2.9-0.6,6-0.8,9-1.1c0.1,1.9,0.2,3.8,0.3,5.4 c2.2-0.6,4.9-1.3,8.5-2.2c-0.9,1.5-1.3,2-1.6,2.6c0.6,0.1,1.2,0.2,1.9,0.3c0.4-1.2,0.8-2.3,1.3-3.9c-3,0.4-5.3,0.6-8,1 c0.3-4.6-2.6-4.9-5.8-4.5c-3.3,0.5-7.7-0.6-7.6,5.2C1086,222.7,1084.6,223.8,1083.9,224.9z"/>
        <path d="M1146.1,204.4c2.3-1,5.7,0.3,6.5-3.8c0.1-0.6,3-1.2,4.4-0.8c1,0.3,1.7,2.1,2.2,3.3c0.6,1.3,0.8,2.7,1.3,4 c2-1,4.2-1.8,5.8-3.2c0.7-0.6,0.3-2.6,0.3-4c0.1,3.8-2.7,4.8-5.8,6.1c-0.2-1.2-0.4-2.1-0.5-2.9c-0.6-4.4-4.2-6.2-7.8-3.8 C1150.2,200.7,1148.2,202.6,1146.1,204.4z"/>
        <path d="M1063.4,295.3c2.7,2.6,4.8,2.6,6-1.3c1.5,0.5,2.9,0.9,4.2,1.4c-1.4-1.3-2.6-2.7-4.1-3.8 C1067.1,289.8,1064.6,291.4,1063.4,295.3z"/>
        <path d="M1064.3,273.2c-2.5-1.3-5-2.5-7-3.6c3.2-1,6.9-1.6,10.2-3.2c3.7-1.8,0.3-3.5-0.7-5.2c0.2,1.2,0.4,2.3,0.7,3.7 c-4.3,1.3-8.6,2.7-12.9,4c0,0.4,0,0.9,0,1.3C1057.8,271.3,1061,272.2,1064.3,273.2z"/>
        <path d="M1057.7,306.8c1.9,0,3.8,0,5.8,0c-0.7-1.8-1.3-3.6-1.9-5.3c0.4-0.2,0.9-0.4,1.3-0.6c0.5,0.8,1.1,1.7,1.6,2.5 c0.3-0.1,0.6-0.1,0.9-0.2c-0.7-2.7-1.3-5.3-2-8C1061.5,299.1,1059.6,302.9,1057.7,306.8z"/>
        <path d="M1256.7,277.6c-0.8,1.4-1.6,2.8-2.3,4.3c-1,2.3-2.3,4.6-2.4,7c-0.1,1,2.5,2.1,3.9,3.1c-3.3-3.2-3.1-6.1-0.1-9.7 C1256.7,281.3,1256.5,279.2,1256.7,277.6z"/>
        <path d="M1178.4,312.3c0.2-1.4,0.3-2.8,0.5-4.1c1.3,0.8,2.5,1.6,3.8,2.4c1.8,1.1,3.6,2.1,5.4,3.1c0.2-0.4,0.4-0.9,0.5-1.3 c-1.4-0.4-2.8-0.9-4.5-1.4c-0.7-2.7-2.1-5.4-5.8-3.8c-3.1,1.3-2,3.6-0.5,5.6C1178,312.6,1178.2,312.4,1178.4,312.3z"/>
        <path d="M1083.1,252.7c2.2-0.1,4-1.2,3.2-3.5c-0.3-1.1-2.4-1.9-3.8-2.3c-2.6-0.6-5.3-1-6,2.7c2.6-2.5,5.6-2.2,9.2-0.9 C1084.7,250.2,1083.9,251.5,1083.1,252.7z"/>
        <path d="M1196.6,316.8c-1.7,0.8-3.5,1.6-5.1,2.4c-0.7-2-1.2-3.4-1.7-4.9c-0.2,0.1-0.4,0.2-0.6,0.2c0.1,1.6,0.2,3.2,0.3,5.8 c2.7-0.7,5.3-1.3,7.9-2c0.2,0,0-1.3-0.1-1.9C1197,316.5,1196.8,316.7,1196.6,316.8z"/>
        <path d="M1106.1,224c-0.6-0.1-1.2-0.2-1.9-0.3c-0.5,0.7-1,1.4-1.4,2.1c0.3,0.4,0.5,0.7,0.8,1.1c3.3-1.9,6.6-3.8,10.8-6.2 c-1.8-1-2.6-1.5-3.5-2C1111.9,222.8,1108.2,222.7,1106.1,224z"/>
        <path d="M1134.3,210.1c4.4-0.2,8.7-0.4,12.3-0.6c-0.1-1.6-0.2-3.4-0.4-5.2c-0.9,1.2-1.8,2.4-2.4,3.3 C1140.5,208.5,1137.4,209.3,1134.3,210.1z"/>
        <path d="M1217.9,275.5c0.7,0.2,1.5,0.9,2,0.7c1.3-0.4,2.4-1.3,3.6-1.9c0.3,0.3,0.5,0.7,0.8,1c-1.2,1.4-2.4,2.7-3.6,4.1 c0.1,0.2,0.2,0.3,0.3,0.5c1-0.5,2-0.9,3.7-1.7c-0.8,1.7-1.4,2.9-2.3,4.7c4.9-1.3,2.3-5.1,3.1-6.9c2.2-0.9,4-1.6,6.4-2.5 c0.7,1.3,1.7,3,2.5,4.4c0.2-2.4-0.6-6.1,0.8-7.3c1.7-1.5,5.2-1,7.9-1.3c0-0.4,0-0.8,0-1.2c-2.4,0.3-4.9,0.6-7.6,0.9 c-0.2-1.6-0.3-3-0.4-4.5c-2.7,2.6-5.3,5.1-7.9,7.6c-2.3,2.1-4.3,2.8-5.9-0.9c-0.4-0.8-2-1.1-3-1.6 C1221.9,271.7,1220.1,273.6,1217.9,275.5z"/>
        <path d="M1100.4,287.9c-0.7,0-1.4,0-2.1,0c-2.8,1.3-5.6,2.5-8.4,3.8c0.2,0.4,0.3,0.8,0.5,1.2c3.8-0.5,8.2,1.6,11.1-3.1 c0.4-0.7,2.2-0.4,3.4-0.6c0.1-0.2,0.3-0.4,0.4-0.6C1103.8,288.3,1102.1,288.1,1100.4,287.9z"/>
        <path d="M1094.8,237c-0.3,1.8-0.5,3.6-0.8,5.4c-0.3,0.3-0.6,0.6-0.9,0.9c-1.3-1.8-2.7-3.7-4-5.5c-0.5,0.5-0.9,1-1.4,1.5 c1.9,1.8,3.9,3.6,5.7,5.3c2.4-2.6,4.2-4.7,6.8-7.7c-0.3,2.1-0.4,3.2-0.6,4.2c0.2,0,0.5,0.2,0.7,0.1c2.3-1.7,2.8-3.7,0.8-6.1 c-1.8,1-3.5,1.9-5.3,2.8C1095.5,237.6,1095.1,237.3,1094.8,237z"/>
        <path d="M1080.9,306.2c0.5-0.4,1.3-0.7,1.6-1.2c1.2-2.5,2.3-5,5.7-2.3c0.1,0.1,0.7-0.2,0.8-0.3c-0.1,1.6-0.2,3.2-0.3,4.9 c0.1,0.2,0.3,0.3,0.4,0.5c0.9-2.2,1.7-4.4,2.9-7.4c-4.8,0-8.3,0-11.9,0c0.2,2,0.3,3.6,0.4,5.3 C1080.6,305.9,1080.7,306,1080.9,306.2z"/>
        <path d="M1133.8,271c0.4,1.7,0.7,2.8,1,4.3c1.7-1.3,3-2.3,4.6-3.5c0,1.9,0,3.6,0,6.2c2-1.5,3.2-2.5,4.7-3.6 c-2-2.6-2.9-6.5-7.1-2.8C1136.7,272,1135.5,271.3,1133.8,271z"/>
        <path d="M1197,251.9c-1.3-1.5-2.6-3.1-4.1-4.8c2-1.5,3.5-3.8,6.1-1c0.4-0.1,0.7-0.2,1.1-0.3c-0.8-3.1-1.6-6.1-2.4-9.2 c-0.3,2.3,0,5.1-1.2,6.7c-1.3,1.7-4.1,2.3-6.8,3.7C1192.6,248.9,1194.8,250.4,1197,251.9z"/>
        <path d="M1156.3,274.1c0-1.1,0.2-3-0.2-3.1c-2.4-0.7-4.8-1.1-7.3-1.6c-1.7-0.4-3.5-0.8-5.6-0.7c5.2,0.3,2.4,3.2,1.6,6 c2.2-1.9,3.8-3.3,5.4-4.7c0.2,0.2,0.5,0.3,0.7,0.5c-0.3,1.3-0.7,2.7-1.3,4.9c1.8-1.3,2.9-2.3,4.2-3c0.3-0.2,1.2,0.9,1.8,1.3 C1155.9,273.9,1156.1,274,1156.3,274.1z"/>
        <path d="M1239.4,277.1c-1.2,1.7-2.4,3.3-3.4,4.7c1.2,1.4,2.3,2.6,3.7,4.3c1.3-2,2.7-4.2,4.1-6.4c-0.2-0.3-0.3-0.5-0.5-0.8 c-1.3,0.4-2.7,0.9-4.4,1.4c0.3-1.1,0.6-1.9,0.9-2.7C1239.7,277.4,1239.5,277.2,1239.4,277.1z"/>
        <path d="M1108.9,236.4c-3.7,3.8-2.9,10.5-9.3,11.2c-0.1-0.6-0.3-1.2-0.4-1.9c-0.2,0-0.4,0-0.6,0c-0.2,0.9-0.4,1.9-0.7,2.9 C1103.6,248.5,1109.4,242.3,1108.9,236.4z"/>
        <path d="M1088.6,307.3c-2.4,3.2-4.9,6.3-7.3,9.5c5.7-0.6,4.2-6.8,7.8-9C1088.9,307.6,1088.7,307.5,1088.6,307.3z"/>
        <path d="M1155.7,273.8c-0.9,1.1-1.8,2.3-3.2,4.1c1.8-0.5,2.7-0.8,4-1.1c0.1,0.9,0.3,1.7,0.4,2.6c2-0.6,4-1.1,5.1-1.4 c-1.6-1.1-3.7-2.4-5.7-3.8C1156.1,274,1155.9,273.9,1155.7,273.8z"/>
        <path d="M1239.8,277.5c1.3-1.6,2.5-3.2,3.8-4.7c-2.9-3.1-3.4-2.9-6.3,2.3c1.4-0.4,2.4-0.7,3.6-1.1c-0.6,1.2-1.1,2.2-1.5,3.1 C1239.5,277.2,1239.7,277.4,1239.8,277.5z"/>
        <path d="M1080.4,305.7c-1.7,0-3.5,0.2-5.2,0c-2-0.2-3.9-0.6-5.9-0.5c2.2,1.7,6.9-0.4,6.2,5.1c2-1.5,3.7-2.8,5.4-4 C1080.7,306,1080.6,305.9,1080.4,305.7z"/>
        <path d="M1187.2,225.7c-1.2,0.9-1.9,1.4-3.1,2.3c2.1,0.8,3.7,1.3,5.4,1.9c-0.3-2.6-0.6-4.8-1-7c-0.2-1.3-0.4-2.8-1.2-3.7 c-0.6-0.6-2.1-0.4-3.2-0.5c-0.1,1.1-0.6,2.3-0.1,3.1C1184.6,223.2,1185.9,224.3,1187.2,225.7z"/>
        <path d="M1198.1,226.2c-1.1,1.1-2.1,2.2-4,4.3c4.7-1.1,8.3-1.9,12.2-2.7c0,1.4,0,2.2,0,2.9c0.3,0,0.5,0,0.8,0c0-1,0-2.1,0-3.1 c-2.5,0-5,0-7.6,0c-0.4-1.4-0.9-3.1-1.4-4.7c-2.6,0.3-5.1,0.6-7.6,0.9c0.1,0.4,0.1,0.9,0.2,1.3c2.4,0,4.7,0,7.1,0 C1198,225.5,1198.1,225.8,1198.1,226.2z"/>
        <path d="M1163,222.8c1.2-1,2.4-2.1,4-3.4c0,1.2,0,2,0,2.9c0.3,0,0.6,0.1,1,0.1c0.2-1.5,0.3-2.9,0.6-5c-3.4,2.4-7.4-3.9-9.9,2.2 c1.5-0.7,2.8-1.3,4.7-2.2c-0.5,2.2-0.9,3.6-1.3,5.1C1162.3,222.6,1162.7,222.7,1163,222.8z"/>
        <path d="M1164.1,238.8c-3.3,3.5-6.7,7-10,10.4c0.4,0.4,0.9,0.8,1.3,1.3c4.1-4.1,8.2-8.1,12.3-12.2 C1166.4,238.4,1165.2,238.6,1164.1,238.8z"/>
      </g>
    </g>
  </g>
</svg>