{
  "wordsList": [
    { "DE": "der Klang", "CZ": "zvuk", "success": 0, "fail": 0, "successRatio": 0 },
    { "DE": "der Vergangenheit", "CZ": "minulost", "success": 0, "fail": 0, "successRatio": 0 },
    { "DE": "besonderes", "CZ": "speciální", "success": 0, "fail": 0, "successRatio": 0 },
    { "DE": "gewaltig", "CZ": "obrovský", "success": 0, "fail": 0, "successRatio": 0 },
    { "DE": "leise", "CZ": "tiše", "success": 0, "fail": 0, "successRatio": 0 },
    { "DE": "die Wange", "CZ": "tvář", "success": 0, "fail": 0, "successRatio": 0 },
    { "DE": "das Gebäude", "CZ": "budova", "success": 0, "fail": 0, "successRatio": 0 },
    { "DE": "meisten", "CZ": "většina", "success": 0, "fail": 0, "successRatio": 0 },
    { "DE": "engen", "CZ": "tight", "success": 0, "fail": 0, "successRatio": 0 },
    { "DE": "spüren", "CZ": "cítit (dotek)", "success": 0, "fail": 0, "successRatio": 0 },
    { "DE": "riechen", "CZ": "cítit (vůni)", "success": 0, "fail": 0, "successRatio": 0 },
    { "DE": "die Serviette", "CZ": "ubrousek", "success": 0, "fail": 0, "successRatio": 0 },
    { "DE": "der Lauser", "CZ": "všivák", "success": 0, "fail": 0, "successRatio": 0 },
    { "DE": "grauslich", "CZ": "příšerný", "success": 0, "fail": 0, "successRatio": 0 },
    { "DE": "lockig", "CZ": "kudrnatý", "success": 0, "fail": 0, "successRatio": 0 },
    {
      "DE": "die Fortsetzung",
      "CZ": "pokra\u010dov\u00e1n\u00ed",
      "success": 2,
      "fail": 1,
      "successRatio": 66.66666666666666
    },
    {
      "DE": "erregt",
      "CZ": "roz\u010dilen\u00fd",
      "success": 1,
      "fail": 1,
      "successRatio": 50.0
    },
    {
      "DE": "sch\u00e4tzen",
      "CZ": "odhadnout",
      "success": 0,
      "fail": 1,
      "successRatio": 0.0
    },
    {
      "DE": "das Ger\u00fccht",
      "CZ": "pov\u011bst",
      "success": 0,
      "fail": 0,
      "successRatio": 0
    },
    {
      "DE": "verwendet",
      "CZ": "pou\u017eit\u00fd",
      "success": 0,
      "fail": 0,
      "successRatio": 0
    },
    {
      "DE": "ungerecht",
      "CZ": "nespravedliv\u00fd",
      "success": 0,
      "fail": 0,
      "successRatio": 0
    },
    {
      "DE": "ewig",
      "CZ": "v\u011b\u010dn\u00fd",
      "success": 0,
      "fail": 0,
      "successRatio": 0
    },
    {
      "DE": "die Meisten",
      "CZ": "v\u011bt\u0161ina",
      "success": 0,
      "fail": 0,
      "successRatio": 0
    },
    {
      "DE": "geneigt",
      "CZ": "naklon\u011bn\u00fd",
      "success": 0,
      "fail": 0,
      "successRatio": 0
    },
    {
      "DE": "der Verkehr",
      "CZ": "provoz",
      "success": 0,
      "fail": 0,
      "successRatio": 0
    },
    {
      "DE": "verwandt",
      "CZ": "p\u0159\u00edbuzn\u00fd",
      "success": 0,
      "fail": 0,
      "successRatio": 0
    },
    {
      "DE": "allm\u00e4hlich",
      "CZ": "pozvoln\u00fd",
      "success": 0,
      "fail": 0,
      "successRatio": 0
    },
    {
      "DE": "das Gewitter",
      "CZ": "bou\u0159ka",
      "success": 0,
      "fail": 0,
      "successRatio": 0
    },
    {
      "DE": "gemeinsam",
      "CZ": "dohromady",
      "success": 0,
      "fail": 0,
      "successRatio": 0
    },
    {
      "DE": "besondere",
      "CZ": "speci\u00e1ln\u00ed",
      "success": 0,
      "fail": 0,
      "successRatio": 0
    },
    {
      "DE": "die Eimer",
      "CZ": "kbel\u00edk",
      "success": 0,
      "fail": 0,
      "successRatio": 0
    },
    {
      "DE": "froh",
      "CZ": "froh",
      "success": 0,
      "fail": 0,
      "successRatio": 0
    },
    {
      "DE": "mutig",
      "CZ": "state\u010dn\u00fd",
      "success": 0,
      "fail": 0,
      "successRatio": 0
    },
    {
      "DE": "der Sch\u00e4del",
      "CZ": "lebka",
      "success": 0,
      "fail": 0,
      "successRatio": 0
    },
    {
      "DE": "die Verwundung",
      "CZ": "zran\u011bn\u00ed",
      "success": 0,
      "fail": 0,
      "successRatio": 0
    },
    {
      "DE": "die Schritte",
      "CZ": "kroky",
      "success": 0,
      "fail": 0,
      "successRatio": 0
    },
    {
      "DE": "die M\u00f6glichkeit",
      "CZ": "mo\u017enost",
      "success": 0,
      "fail": 0,
      "successRatio": 0
    },
    {
      "DE": "der Atem",
      "CZ": "dech",
      "success": 0,
      "fail": 0,
      "successRatio": 0
    },
    {
      "DE": "die \u00dcberraschung",
      "CZ": "\u00dcberraschung",
      "success": 0,
      "fail": 0,
      "successRatio": 0
    },
    {
      "DE": "das Geheimnis",
      "CZ": "tajemstv\u00ed",
      "success": 0,
      "fail": 0,
      "successRatio": 0
    },
    {
      "DE": "der Nutz",
      "CZ": "u\u017eitek",
      "success": 0,
      "fail": 0,
      "successRatio": 0
    },
    {
      "DE": "der Zweig",
      "CZ": "v\u011btvi\u010dka",
      "success": 0,
      "fail": 0,
      "successRatio": 0
    },
    {
      "DE": "zwinkern",
      "CZ": "mrknout",
      "success": 0,
      "fail": 0,
      "successRatio": 0
    },
    {
      "DE": "gleich",
      "CZ": "stejn\u00fd",
      "success": 0,
      "fail": 0,
      "successRatio": 0
    },
    {
      "DE": "jedoch",
      "CZ": "jedoch",
      "success": 0,
      "fail": 0,
      "successRatio": 0
    },
    {
      "DE": "fl\u00fcstern",
      "CZ": "\u0161eptat",
      "success": 0,
      "fail": 0,
      "successRatio": 0
    },
    {
      "DE": "retten",
      "CZ": "zachr\u00e1nit",
      "success": 0,
      "fail": 0,
      "successRatio": 0
    },
    {
      "DE": "geduldig",
      "CZ": "trp\u011bliv\u00fd",
      "success": 0,
      "fail": 0,
      "successRatio": 0
    },
    {
      "DE": "davon",
      "CZ": "toho",
      "success": 0,
      "fail": 0,
      "successRatio": 0
    },
    {
      "DE": "allerdings",
      "CZ": "ov\u0161em",
      "success": 0,
      "fail": 0,
      "successRatio": 0
    },
    {
      "DE": "steigen",
      "CZ": "stoupat",
      "success": 0,
      "fail": 0,
      "successRatio": 0
    },
    {
      "DE": "rein",
      "CZ": "\u010dist\u00fd",
      "success": 0,
      "fail": 0,
      "successRatio": 0
    },
    {
      "DE": "offenbar",
      "CZ": "z\u0159ejm\u011b",
      "success": 0,
      "fail": 0,
      "successRatio": 0
    },
    {
      "DE": "das Geschick",
      "CZ": "dovednost",
      "success": 0,
      "fail": 0,
      "successRatio": 0
    },
    {
      "DE": "erz\u00e4hlt",
      "CZ": "\u0159ekl",
      "success": 0,
      "fail": 0,
      "successRatio": 0
    },
    {
      "DE": "der Knochen",
      "CZ": "kost",
      "success": 0,
      "fail": 0,
      "successRatio": 0
    },
    {
      "DE": "der Unterschied",
      "CZ": "rozd\u00edl",
      "success": 0,
      "fail": 0,
      "successRatio": 0
    },
    {
      "DE": "die H\u00fcgel",
      "CZ": "kopec",
      "success": 0,
      "fail": 0,
      "successRatio": 0
    },
    {
      "DE": "niedlich",
      "CZ": "niedlich",
      "success": 0,
      "fail": 0,
      "successRatio": 0
    },
    {
      "DE": "der Wache",
      "CZ": "str\u00e1\u017e",
      "success": 0,
      "fail": 0,
      "successRatio": 0
    },
    {
      "DE": "die Kleidung",
      "CZ": "Kleidung",
      "success": 0,
      "fail": 0,
      "successRatio": 0
    },
    {
      "DE": "kaum",
      "CZ": "sotva",
      "success": 0,
      "fail": 0,
      "successRatio": 0
    },
    {
      "DE": "der Schritt",
      "CZ": "krok",
      "success": 0,
      "fail": 0,
      "successRatio": 0
    },
    {
      "DE": "tats\u00e4chlich",
      "CZ": "skute\u010dn\u011b",
      "success": 0,
      "fail": 0,
      "successRatio": 0
    },
    {
      "DE": "das Gebiet",
      "CZ": "oblast",
      "success": 0,
      "fail": 0,
      "successRatio": 0
    },
    {
      "DE": "das Buckel",
      "CZ": "hrbol",
      "success": 0,
      "fail": 0,
      "successRatio": 0
    },
    {
      "DE": "besitzen",
      "CZ": "vlastnit",
      "success": 0,
      "fail": 0,
      "successRatio": 0
    },
    {
      "DE": "jedenfalls",
      "CZ": "ka\u017edop\u00e1dn\u011b",
      "success": 0,
      "fail": 0,
      "successRatio": 0
    },
    {
      "DE": "der Abstieg",
      "CZ": "sestup",
      "success": 0,
      "fail": 0,
      "successRatio": 0
    },
    {
      "DE": "bewegen",
      "CZ": "pohnout",
      "success": 0,
      "fail": 0,
      "successRatio": 0
    },
    {
      "DE": "schneiden",
      "CZ": "st\u0159\u00edhat / \u0159ezat",
      "success": 0,
      "fail": 0,
      "successRatio": 0
    },
    {
      "DE": "der Metzger",
      "CZ": "\u0159ezn\u00edk",
      "success": 0,
      "fail": 0,
      "successRatio": 0
    },
    {
      "DE": "der Schmied",
      "CZ": "kov\u00e1\u0159",
      "success": 0,
      "fail": 0,
      "successRatio": 0
    },
    {
      "DE": "wahrscheinlich",
      "CZ": "pravd\u011bpodobn\u011b",
      "success": 0,
      "fail": 0,
      "successRatio": 0
    },
    {
      "DE": "die Stirn",
      "CZ": "\u010delo",
      "success": 0,
      "fail": 0,
      "successRatio": 0
    },
    {
      "DE": "der Schwanz",
      "CZ": "ocas",
      "success": 0,
      "fail": 0,
      "successRatio": 0
    },
    {
      "DE": "erscheinen",
      "CZ": "objevit se",
      "success": 1,
      "fail": 0,
      "successRatio": 100
    },
    {
      "DE": "ank\u00fcnden",
      "CZ": "ozn\u00e1mit",
      "success": 1,
      "fail": 0,
      "successRatio": 100
    },
    {
      "DE": "die Feier",
      "CZ": "p\u00e1rty",
      "success": 1,
      "fail": 0,
      "successRatio": 100
    },
    {
      "DE": "dazu",
      "CZ": "na to",
      "success": 1,
      "fail": 0,
      "successRatio": 100
    }
  ]
}