{
  "timestamp": 1612833879,
  "EUR_CZK": 0,
  "quantities": [
    10000,
    100000,
    300000
  ],
  "coinmate": {
    "fee": 0.23,
    "currencyPairs": [
      "BTC_EUR"
    ],
    "averagePrices": {
      "BTC_EUR": {
        "10000": {
          "ask": 38473.8,
          "bid": 37491.45
        },
        "100000": {
          "ask": 38482.02,
          "bid": 35367.047
        },
        "300000": {
          "ask": 38493.945,
          "bid": -1000
        }
      }
    }
  },
  "binance": {
    "fee": 0.1,
    "currencyPairs": [
      "BTC_EUR"
    ],
    "averagePrices": {
      "BTC_EUR": {
        "10000": {
          "ask": 38473.8,
          "bid": 37491.45
        },
        "100000": {
          "ask": 38482.02,
          "bid": 35367.047
        },
        "300000": {
          "ask": 38493.945,
          "bid": -1000
        }
      }
    }
  }
}