"10000": 
from\to   CZK         EUR       BTC       LTC       ETH       DAI       XRP       DASH      BCH
  CZK      0,          0,      1126642.3.., 4940.5.., 39429.8.., 0, 11.8.., 5661.7.., 15460.7..

  EUR      0,          0,      43549.9.., 192.6.., 1526.5.., 2.0.., 0.5.., 260.6.., 955.2..

  BTC      1123772,   43403.1.., 0,       -1,       -1,       0,        -1,       -1,       -1

  LTC      4909.3..,  183.9..,  -1,       0,        0,        0,        0,        0,        0

  ETH      39210.5,   1502.0.., -1,       0,        0,        -1,        0,       0,        0

  DAI      0,         -1,         0,      0,      3092.4..,    0,        0,         0,       0

  XRP      11.4..,    0.3..,      -1,     0,        0,        0,         0,         0,       0

  DASH     5591.2..,   205.3..,  -1,     0,         0,       0,        0,         0,         0

  BCH      15315.2..,  490.3..,  -1,     0,         0,       0,         0,        0,         0
