\relax 
\providecommand\hyper@newdestlabel[2]{}
\catcode `:\active 
\catcode `;\active 
\catcode `!\active 
\catcode `?\active 
\catcode `"\active 
\providecommand\HyperFirstAtBeginDocument{\AtBeginDocument}
\HyperFirstAtBeginDocument{\ifx\hyper@anchor\@undefined
\global\let\oldcontentsline\contentsline
\gdef\contentsline#1#2#3#4{\oldcontentsline{#1}{#2}{#3}}
\global\let\oldnewlabel\newlabel
\gdef\newlabel#1#2{\newlabelxx{#1}#2}
\gdef\newlabelxx#1#2#3#4#5#6{\oldnewlabel{#1}{{#2}{#3}}}
\AtEndDocument{\ifx\hyper@anchor\@undefined
\let\contentsline\oldcontentsline
\let\newlabel\oldnewlabel
\fi}
\fi}
\global\let\hyper@last\relax 
\gdef\HyperFirstAtBeginDocument#1{#1}
\providecommand\HyField@AuxAddToFields[1]{}
\providecommand\HyField@AuxAddToCoFields[2]{}
\select@language{english}
\@writefile{toc}{\select@language{english}}
\@writefile{lof}{\select@language{english}}
\@writefile{lot}{\select@language{english}}
\@input{head/abstracts.tex.aux}
\pgfsyspdfmark {pgfid2}{0}{40463552}
\pgfsyspdfmark {pgfid1}{6899315}{42674583}
\@writefile{toc}{\contentsline {chapter}{List of figures}{iii}{section*.2}}
\pgfsyspdfmark {pgfid4}{0}{40463552}
\pgfsyspdfmark {pgfid3}{6899315}{42674583}
\@writefile{toc}{\contentsline {chapter}{List of tables}{v}{section*.4}}
\pgfsyspdfmark {pgfid6}{0}{40463552}
\pgfsyspdfmark {pgfid5}{6899315}{42674583}
\@input{main/ch1_introduction.aux}
\pgfsyspdfmark {pgfid8}{0}{40463552}
\pgfsyspdfmark {pgfid7}{6899315}{42043079}
\@input{main/ch2_figures_tables.aux}
\pgfsyspdfmark {pgfid10}{0}{40463552}
\pgfsyspdfmark {pgfid9}{6899315}{39248875}
\@input{main/ch3_math.aux}
\pgfsyspdfmark {pgfid12}{0}{40463552}
\pgfsyspdfmark {pgfid11}{6899315}{39248875}
\@input{main/ch4_more_text.aux}
\pgfsyspdfmark {pgfid14}{0}{40463552}
\pgfsyspdfmark {pgfid13}{6899315}{39248875}
\@input{tail/appendix.aux}
\pgfsyspdfmark {pgfid16}{0}{40463552}
\pgfsyspdfmark {pgfid15}{6899315}{39248875}
\@input{tail/biblio.aux}
\pgfsyspdfmark {pgfid18}{0}{40463552}
\pgfsyspdfmark {pgfid17}{6899315}{42043079}
\@input{tail/cv.aux}
