PWD /mnt/Data/Dropbox/Studium/EPFL/MA4/sem_project/report/report/main
INPUT /etc/texmf/web2c/texmf.cnf
INPUT /var/lib/texmf/web2c/pdftex/pdflatex.fmt
INPUT ch1_introduction.tex
OUTPUT ./latex_output/ch1_introduction.log
