# Fdb version 3
["pdflatex"] 1496415834 "ch1_introduction.tex" "./latex_output/ch1_introduction.pdf" "ch1_introduction" 1496415835
  "./latex_output/ch1_introduction.aux" 1496415642 8 a94a2480d3289e625eea47cd1b285758 ""
  "/etc/texmf/web2c/texmf.cnf" 1454332835 33091 134486ebfd2513eda4f54f284cf3e842 ""
  "/var/lib/texmf/web2c/pdftex/pdflatex.fmt" 1487863667 3841925 960f0c8e7d6ad4a1bd4d96eb0b9f8a48 ""
  "ch1_introduction.tex" 1496415834 36 6acd39fbb6cf19a60dae1c2d57e786c7 ""
  (generated)
  "./latex_output/ch1_introduction.log"
  "./latex_output/ch1_introduction.pdf"
