PWD /mnt/Data/Dropbox/Studium/EPFL/MA4/sem_project/previous_works
INPUT /etc/texmf/web2c/texmf.cnf
INPUT /var/lib/texmf/web2c/pdftex/pdflatex.fmt
INPUT previous_work_summary.tex
OUTPUT ./latex_output/previous_work_summary.log
INPUT /usr/share/texmf/tex/latex/base/article.cls
INPUT /usr/share/texmf/tex/latex/base/article.cls
INPUT /usr/share/texmf/tex/latex/base/size10.clo
INPUT /usr/share/texmf/tex/latex/base/size10.clo
INPUT /usr/share/texmf/tex/latex/base/inputenc.sty
INPUT /usr/share/texmf/tex/latex/base/inputenc.sty
INPUT /usr/share/texmf/tex/latex/base/utf8.def
INPUT /usr/share/texmf/tex/latex/base/utf8.def
INPUT /usr/share/texmf/tex/latex/base/t1enc.dfu
INPUT /usr/share/texmf/tex/latex/base/t1enc.dfu
INPUT /usr/share/texmf/tex/latex/base/ot1enc.dfu
INPUT /usr/share/texmf/tex/latex/base/ot1enc.dfu
INPUT /usr/share/texmf/tex/latex/base/omsenc.dfu
INPUT /usr/share/texmf/tex/latex/base/omsenc.dfu
INPUT ./latex_output/previous_work_summary.aux
INPUT ./latex_output/previous_work_summary.aux
OUTPUT ./latex_output/previous_work_summary.aux
INPUT /usr/share/texmf/fonts/map/fontname/texfonts.map
INPUT /usr/share/texmf/fonts/tfm/public/cm/cmr17.tfm
INPUT /usr/share/texmf/fonts/tfm/public/cm/cmr12.tfm
INPUT /usr/share/texmf/fonts/tfm/public/cm/cmr8.tfm
INPUT /usr/share/texmf/fonts/tfm/public/cm/cmr6.tfm
INPUT /usr/share/texmf/fonts/tfm/public/cm/cmmi12.tfm
INPUT /usr/share/texmf/fonts/tfm/public/cm/cmmi8.tfm
INPUT /usr/share/texmf/fonts/tfm/public/cm/cmmi6.tfm
INPUT /usr/share/texmf/fonts/tfm/public/cm/cmsy10.tfm
INPUT /usr/share/texmf/fonts/tfm/public/cm/cmsy8.tfm
INPUT /usr/share/texmf/fonts/tfm/public/cm/cmsy6.tfm
INPUT /usr/share/texmf/fonts/tfm/public/cm/cmr12.tfm
INPUT /usr/share/texmf/fonts/tfm/public/cm/cmbx12.tfm
INPUT /usr/share/texmf/fonts/tfm/public/cm/cmbx12.tfm
INPUT /usr/share/texmf/tex/latex/base/omscmr.fd
INPUT /usr/share/texmf/tex/latex/base/omscmr.fd
INPUT /usr/share/texmf/fonts/tfm/public/cm/cmbx10.tfm
OUTPUT ./latex_output/previous_work_summary.pdf
INPUT /var/lib/texmf/fonts/map/pdftex/updmap/pdftex.map
INPUT ./latex_output/previous_work_summary.aux
INPUT /usr/share/texmf/fonts/type1/public/amsfonts/cm/cmbx10.pfb
INPUT /usr/share/texmf/fonts/type1/public/amsfonts/cm/cmbx12.pfb
INPUT /usr/share/texmf/fonts/type1/public/amsfonts/cm/cmmi10.pfb
INPUT /usr/share/texmf/fonts/type1/public/amsfonts/cm/cmr10.pfb
INPUT /usr/share/texmf/fonts/type1/public/amsfonts/cm/cmr12.pfb
INPUT /usr/share/texmf/fonts/type1/public/amsfonts/cm/cmr17.pfb
INPUT /usr/share/texmf/fonts/type1/public/amsfonts/cm/cmsy10.pfb
