\relax 
\@writefile{toc}{\contentsline {section}{\numberline {1}Tichu the game}{1}}
\@writefile{toc}{\contentsline {subsection}{\numberline {1.1}Tichu and AI}{1}}
\@writefile{toc}{\contentsline {section}{\numberline {2}Papers concerning Tichu or similar games}{1}}
\@writefile{toc}{\contentsline {subsection}{\numberline {2.1}Eine k\IeC {\"u}nstliche Intelligenz f\IeC {\"u}r das Kartenspiel Tichu (2013)}{1}}
\@writefile{toc}{\contentsline {subsection}{\numberline {2.2}Fight the Landlord (Dou Di Zhu)}{3}}
\@writefile{toc}{\contentsline {subsubsection}{\numberline {2.2.1}Results}{4}}
\@writefile{toc}{\contentsline {subsubsection}{\numberline {2.2.2}Conclusion}{4}}
