{
    "Version": "2012-10-17",
    "Statement": [
      {
        "Sid": "allowGitLabRunnersAccessCache",
        "Effect": "Allow",
        "Action": [
          "s3:PutObject",
          "s3:PutObjectAcl",
          "s3:GetObject",
          "s3:GetObjectAcl"
        ],
        "Resource": [
          "${s3_cache_arn}/*"
        ]
      }
    ]
  }