Place,Name,Sex,BirthDate,Age,Country,State,Equipment,Division,BodyweightKg,WeightClassKg,Squat1Kg,Squat2Kg,Squat3Kg,Best3SquatKg,Bench1Kg,Bench2Kg,Bench3Kg,Bench4Kg,Best3BenchKg,Deadlift1Kg,Deadlift2Kg,Deadlift3Kg,Deadlift4Kg,Best3DeadliftKg,TotalKg,Event,Team
1,Anna Elizabeth Johnson,F,1972-04-03,51,Australia,VIC,Raw,FM3-R,46.9,48,65,67.5,70,70,50,52.5,,,52.5,85,87.5,-90,,87.5,210,SBD,Slaughterhouse gym Melbourne
1,Massiva Boumaiza,F,1997-11-21,25,Australia,VIC,Raw,FO-R,84.4,90,120,127.5,-132.5,127.5,60,-65,-65,,60,135,145,-152.5,,145,332.5,SBD,Jason Yang - JETTS ST KILDA
NS,Angela Darby,F,1987-02-23,36,Australia,ACT,Raw,FSM-R,,,,,,,,,,,,,,,,,,SBD,
1,Monique Scoble,F,2005-12-23,17,Australia,VIC,Raw,FT2-R,64.3,67.5,90,95,100,100,60,65,67.5,70,67.5,105,110,112.5,,112.5,280,SBD,Derrimut kangaroo flat
1,Taylah Desira,F,1999-02-03,24,Australia,VIC,Wraps,FO-RP,65,67.5,117.5,-122.5,-125,117.5,52.5,55,-57.5,,55,120,130,-137.5,,130,302.5,SBD,Corey Formosa (Westgate Health Club)
1,Kelly Spiteri,F,1973-01-19,50,Australia,VIC,Raw,FM3-R,65.4,67.5,,,,,37.5,42.5,47.5,50,47.5,80,100,110,115,110,157.5,BD,Slaughterhouse gym Melbourne
1,Tyrone Zollo,M,1997-05-23,26,Australia,VIC,Raw,MO-R,74.7,75,140,150,155,155,90,95,97.5,,97.5,160,170,185,,185,437.5,SBD,Slaughterhouse gym Melbourne
1,Uriah Sefo,M,1997-07-03,25,Australia,VIC,Raw,MO-R,136.5,140,210,-225,235,235,-165,165,175,,175,225,-237.5,247.5,,247.5,657.5,SBD,Mildura Strength and Performance. Vince Simonetta
1,Brent Drake #2,M,1976-05-12,47,Australia,NSW,Raw,MM2-RP,98.5,100,210,230,-240,230,130,140,147.5,,147.5,230,245,252.5,,252.5,630,SBD,Super shape gym
1,Brian Jarrott,M,1968-09-29,54,Australia,VIC,Raw,MM3-RP,100,100,220,240,245,245,120,135,145,,145,220,240,250,,250,640,SBD,Super shape Laurie Butler
1,Stuart Day,M,1957-01-12,66,Australia,VIC,Raw,MM6-RP,96.8,100,120,140,-150.5,140,75,85,90.5,95,90.5,140,160,180,193,180,410.5,SBD,ESP
1,Tej Kalra,M,1985-11-21,37,Australia,VIC,Wraps,MO-RP,96.9,100,180,200,205,205,100,110,115,,115,165,185,205,,205,525,SBD,Jacob Spiteri
2,Aaron Fry,M,1985-12-30,37,Australia,VIC,Wraps,MO-RP,99.5,100,150,170,-190,170,110,120,130,,130,180,200,220,,220,520,SBD,Jacob Spiteri
1,Bradley Villaflor,M,2005-12-15,17,Australia,VIC,Raw,MT2-RP,87,90,180,-190,190,190,110,-120,-125,,110,190,200,,,200,500,SBD,Slaughterhouse gym Melbourne
1,Christopher Williams,M,2003-10-28,19,Australia,NSW,Raw,MT3-RP,102,110,175,190,210,210,100,110,120,,120,190,210,225,,225,555,SBD,Taylor Butler Super Shape Albury
1,Brodie Robertson,M,2005-10-31,17,Australia,VIC,Raw,MT2-R,140.3,140+,,,,,70,80,90,,90,120,135,150,,150,240,BD,Jacob Spiteri
1,Anthony Day,M,1972-02-04,51,Australia,VIC,Raw,MM3-R,100,100,,,,,95,-100,,,95,,,,,,95,B,Slaughterhouse gym Melbourne
1,Eitan Raveh,M,2006-03-30,17,Australia,VIC,Raw,MT2-R,60,60,,,,,67.5,-72.5,-72.5,,67.5,,,,,,67.5,B,Slaughterhouse gym Melbourne
1,Dylan Milat,M,2005-07-05,17,Australia,VIC,Raw,MT2-R,80.6,82.5,,,,,110,117.5,-122.5,,117.5,,,,,,117.5,B,Slaughterhouse gym Melbourne
1,Alex Ross,M,2005-02-18,18,Australia,VIC,Raw,MT3-R,80,82.5,,,,,120,125,130,,130,,,,,,130,B,Slaughterhouse gym Melbourne
1,Andrew Newton,M,1983-11-11,39,Australia,VIC,Raw,MSM-R,78.3,82.5,,,,,,,,,,160,170,175,,175,175,D,Slaughterhouse gym Melbourne
1,Richie Vary,M,2008-09-14,14,Australia,VIC,Raw,MT1-R,55,56,,,,,,,,,,105,110,115,,115,115,D,Slaughterhouse gym Melbourne
1,Dylan Milat,M,2005-07-05,17,Australia,VIC,Raw,MT2-R,80.6,82.5,,,,,,,,,,180,190,200,,200,200,D,Slaughterhouse gym Melbourne
