Place,Name,Sex,Event,Division,WeightClassKg,Equipment,BirthYear,Team,Country,State,BodyweightKg,Squat1Kg,Squat2Kg,Squat3Kg,Best3SquatKg,Bench1Kg,Bench2Kg,Bench3Kg,Best3BenchKg,Deadlift1Kg,Deadlift2Kg,Deadlift3Kg,Best3DeadliftKg,TotalKg,Age,BirthDate
1,Brian Nguyen #2,M,D,MR-T2,90,Raw,2007,,USA,TX,87.4,,,,,,,,,200,-205,205,205,205,,
DQ,Polly Gauthier,F,SBD,F-O,67.5,Single-ply,1965,,USA,TX,65.4,-70,-70,-70,,40,50,-60,50,70,80,92.5,92.5,,,
1,Rebeca Jaramillo,F,SBD,FR-Jr,48,Raw,2001,,USA,TX,45.7,95,100,105,105,47.5,50,55,55,115,122.5,-125,122.5,282.5,,
1,Venu Phan,F,SBD,FR-Jr,60,Raw,1999,,USA,TX,58.9,132.5,-140,-140,132.5,75,80,-82.5,80,140,147.5,-155,147.5,360,,
1,Zeina Mohamed,F,SBD,FR-Jr,75,Raw,2001,,USA,MN,73.7,125,130,137.5,137.5,87.5,92.5,-95,92.5,165,170,-175,170,400,,
2,Victoria Soriano,F,SBD,FR-Jr,75,Raw,2001,,USA,TX,74,140,147.5,152.5,152.5,65,67.5,70,70,125,135,-140,135,357.5,,
1,Karla Olmedo Cruz,F,SBD,FR-Jr,100,Raw,2003,,USA,TX,94.6,110,120,127.5,127.5,57.5,62.5,67.5,67.5,122.5,132.5,145,145,340,,
1,Amanda Hisole,F,SBD,FR-Jr,67.5,Raw,1999,,USA,TX,66.7,142.5,150,160,160,-60,62.5,-67.5,62.5,167.5,175,187.5,187.5,410,,
2,Ana Karen Gonzalez,F,SBD,FR-Jr,67.5,Raw,2001,,USA,TX,65.8,95,102.5,107.5,107.5,52.5,57.5,62.5,62.5,100,110,-120,110,280,,
1,Johnique Atkins,F,SBD,FR-M1a,82.5,Raw,1981,,USA,TX,81.7,-82.5,82.5,95,95,45,50,-55,50,110,120,132.5,132.5,277.5,,
1,Angela Hairrell,F,SBD,FR-M2a,82.5,Raw,1970,,USA,TX,80.6,80,90,100,100,45,52.5,-60,52.5,105,115,125,125,277.5,,
1,Karen Sanzo,F,SBD,FR-M3a,90,Raw,1959,,USA,TX,87.8,-75,75,80,80,42.5,-47.5,-50,42.5,97.5,105,110,110,232.5,,
1,Rebeca Jaramillo,F,SBD,FR-O,48,Raw,2001,,USA,TX,45.7,95,100,105,105,47.5,50,55,55,115,122.5,-125,122.5,282.5,,
1,Venu Phan,F,SBD,FR-O,60,Raw,1999,,USA,TX,58.9,132.5,-140,-140,132.5,75,80,-82.5,80,140,147.5,-155,147.5,360,,
2,Sally Chiu,F,SBD,FR-O,60,Raw,1996,,USA,TX,58.7,105,115,125,125,57.5,62.5,67.5,67.5,115,125,137.5,137.5,330,,
3,Jaclyn Wolff,F,SBD,FR-O,60,Raw,1991,,USA,TX,58.5,105,115,120,120,50,55,57.5,57.5,100,115,120,120,297.5,,
4,Siena Hickey,F,SBD,FR-O,60,Raw,1989,,USA,TX,59.1,75,82.5,90,90,40,45,-47.5,45,120,130,137.5,137.5,272.5,,
1,Zeina Mohamed,F,SBD,FR-O,75,Raw,2001,,USA,MN,73.7,125,130,137.5,137.5,87.5,92.5,-95,92.5,165,170,-175,170,400,,
2,Adriana Rivera,F,SBD,FR-O,75,Raw,1998,,USA,TX,74.4,132.5,145,152.5,152.5,72.5,80,-85,80,130,142.5,152.5,152.5,385,,
3,Lisa Bergeron,F,SBD,FR-O,75,Raw,1993,,USA,TX,73.3,100,107.5,115,115,45,50,52.5,52.5,145,155,162.5,162.5,330,,
1,Sarah Hlipala,F,SBD,FR-O,90,Raw,1998,,USA,TX,89.2,-107.5,-107.5,107.5,107.5,-57.5,57.5,-62.5,57.5,107.5,112.5,117.5,117.5,282.5,,
1,Monica Hernandez,F,SBD,FR-O,100,Raw,1996,,USA,FL,98.2,147.5,157.5,162.5,162.5,72.5,-82.5,-82.5,72.5,162.5,175,-182.5,175,410,,
2,Anna Cormier,F,SBD,FR-O,100,Raw,1996,,USA,TX,97.1,75,82.5,92.5,92.5,-52.5,52.5,-60,52.5,87.5,97.5,105,105,250,,
1,Guadalupe Garcia #5,F,SBD,FR-O,100+,Raw,1995,Be Strong,USA,TX,106.8,-155,157.5,170,170,72.5,77.5,80,80,165,175,-185,175,425,,
2,Shenequa Harris-Carter,F,SBD,FR-O,100+,Raw,1987,,USA,TX,122.3,70,85,100,100,77.5,82.5,-87.5,82.5,127.5,147.5,155,155,337.5,,
1,Amanda Hisole,F,SBD,FR-O,67.5,Raw,1999,,USA,TX,66.7,142.5,150,160,160,-60,62.5,-67.5,62.5,167.5,175,187.5,187.5,410,,
2,Alexandra Orellana,F,SBD,FR-O,67.5,Raw,1993,,USA,TX,62.8,115,120,125,125,52.5,57.5,60,60,130,137.5,145,145,330,,
3,Ashley Hall,F,SBD,FR-O,67.5,Raw,1995,,USA,TX,66.8,97.5,110,-120,110,80,-85,85,85,110,117.5,-125,117.5,312.5,,
4,Rasheeda Bull,F,SBD,FR-O,67.5,Raw,1996,,USA,NY,66.4,110,122.5,-132.5,122.5,55,-60,62.5,62.5,110,122.5,-132.5,122.5,307.5,,
5,Larissa Gehring,F,SBD,FR-O,67.5,Raw,1994,,USA,TX,61,100,107.5,-112.5,107.5,50,55,57.5,57.5,110,117.5,125,125,290,,
6,Yanyris Velasquez,F,SBD,FR-O,67.5,Raw,1990,,USA,NY,65.6,77.5,87.5,95,95,40,47.5,50,50,95,-100,-100,95,240,,
7,Khristina Pierce,F,SBD,FR-O,67.5,Raw,1999,,USA,TX,64.8,37.5,40,42.5,42.5,25,30,-32.5,30,52.5,57.5,65,65,137.5,,
1,Mariah Olive,F,SBD,FR-O,82.5,Raw,1995,Team Warfare,USA,TX,80.2,145,150,155,155,72.5,77.5,-82.5,77.5,155,-167.5,170,170,402.5,,
2,Johnique Atkins,F,SBD,FR-O,82.5,Raw,1981,,USA,TX,81.7,-82.5,82.5,95,95,45,50,-55,50,110,120,132.5,132.5,277.5,,
3,Luz Divina,F,SBD,FR-O,82.5,Raw,1995,,USA,TX,77.8,87.5,92.5,97.5,97.5,40,45,-50,45,100,105,112.5,112.5,255,,
1,Katie Segura,F,SBD,FW-M1a,100,Wraps,1981,,USA,TX,97.4,102.5,120,127.5,127.5,70,85,92.5,92.5,125,147.5,155,155,375,,
DQ,Kyle Steele,M,SBD,M-Jr,52,Single-ply,2000,,USA,TX,,40,52.5,-82.5,52.5,-25,,,,,,,,,,
1,Rudy Herrero,M,SBD,M-O,100,Single-ply,1998,Be Strong,USA,TX,100,150,155,160,160,105,-110,-110,105,170,180,190,190,455,,
DQ,Andrew Gauthier,M,SBD,M-O,82.5,Single-ply,2005,,USA,TX,82.2,-200,200,-210,200,-115,-115,-115,,180,195,-210,195,,,
1,Anthony Nguyen #8,M,SBD,MR-Jr,75,Raw,2002,,USA,TX,75,225,-237.5,237.5,237.5,135,-147.5,147.5,147.5,245,265,280,280,665,,
2,Matthew Nguyen,M,SBD,MR-Jr,75,Raw,2000,,USA,TX,74.5,200,212.5,220,220,157.5,167.5,-177.5,167.5,227.5,240,250,250,637.5,,
3,Jeffrey Heng,M,SBD,MR-Jr,75,Raw,1999,,USA,TX,73.7,200,212.5,220,220,142.5,-147.5,-147.5,142.5,247.5,262.5,-272.5,262.5,625,,
4,Nick Cook #1,M,SBD,MR-Jr,75,Raw,2003,Yoddha Training,USA,TX,74.8,192.5,210,225,225,125,137.5,147.5,147.5,197.5,215,222.5,222.5,595,,
5,Blake Saksenberg,M,SBD,MR-Jr,75,Raw,2003,,USA,TX,74.2,200,215,220,220,-117.5,117.5,-120,117.5,245,-257.5,-257.5,245,582.5,,
6,Hector Frausto,M,SBD,MR-Jr,75,Raw,2001,,USA,TX,74,195,200,205,205,115,120,-122.5,120,232.5,-240,-240,232.5,557.5,,
7,Mark Eusebio,M,SBD,MR-Jr,75,Raw,2001,,USA,TX,74.4,170,175,185,185,87.5,92.5,-102.5,92.5,-207.5,220,-235,220,497.5,,
8,Jeffrey Dao,M,SBD,MR-Jr,75,Raw,2000,,USA,TX,74.5,145,155,165,165,-97.5,97.5,-100,97.5,185,-195,205,205,467.5,,
9,Michael Davalos,M,SBD,MR-Jr,75,Raw,2001,,USA,TX,72.9,147.5,155,160,160,90,95,-97.5,95,155,162.5,172.5,172.5,427.5,,
1,Malik Haifa,M,SBD,MR-Jr,90,Raw,2002,,USA,TX,89,225,235,242.5,242.5,172.5,177.5,,177.5,230,245,,245,665,,
2,Andrew Cardi,M,SBD,MR-Jr,90,Raw,2002,,USA,TX,85,240,-250,250,250,135,137.5,-142.5,137.5,250,-257.5,257.5,257.5,645,,
3,Jericho Gonzaga,M,SBD,MR-Jr,90,Raw,2002,,USA,TX,83.9,207.5,220,227.5,227.5,117.5,125,135,135,195,210,220,220,582.5,,
4,Joel Abban,M,SBD,MR-Jr,90,Raw,2000,,USA,TX,88.4,185,192.5,205,205,120,125,130,130,215,225,235,235,570,,
5,Caleb Timms,M,SBD,MR-Jr,90,Raw,1999,,USA,TX,85.2,152.5,162.5,170,170,100,-105,-112.5,100,185,190,200,200,470,,
1,Tanner Knox,M,SBD,MR-Jr,100,Raw,2001,,USA,TX,90.4,230,240,-250,240,150,-155,155,155,272.5,285,-295,285,680,,
2,Edgar Arredondo,M,SBD,MR-Jr,100,Raw,2002,Be Strong,USA,TX,97.9,242.5,252.5,260,260,142.5,152.5,-155,152.5,250,257.5,-262.5,257.5,670,,
3,Daniel Gaona,M,SBD,MR-Jr,100,Raw,2003,,USA,TX,97.3,207.5,222.5,-227.5,222.5,145,150,-155,150,237.5,250,-265,250,622.5,,
4,Luke Dyvig,M,SBD,MR-Jr,100,Raw,1999,,USA,TX,95.2,192.5,202.5,207.5,207.5,122.5,130,137.5,137.5,245,262.5,275,275,620,,
5,Alvaro Uruena,M,SBD,MR-Jr,100,Raw,2002,,USA,TX,100,187.5,197.5,205,205,115,122.5,130,130,177.5,197.5,207.5,207.5,542.5,,
DQ,Max Arenas,M,SBD,MR-Jr,100,Raw,1999,,USA,TX,96.7,172.5,180,190,190,120,-125,-125,120,-205,-220,-220,,,,
1,Drew Robinson,M,SBD,MR-Jr,110,Raw,1999,,USA,TX,107.2,255,265,272.5,272.5,147.5,152.5,-157.5,152.5,255,265,272.5,272.5,697.5,,
2,Travis Moody,M,SBD,MR-Jr,110,Raw,1999,,USA,AL,104,227.5,235,-240,235,150,160,-162.5,160,217.5,230,242.5,242.5,637.5,,
3,Ben Clements,M,SBD,MR-Jr,110,Raw,2003,Yoddha Training,USA,TX,107.8,220,247.5,272.5,272.5,120,135,-140,135,197.5,215,230,230,637.5,,
4,Jose Hernandez #43,M,SBD,MR-Jr,110,Raw,2002,,USA,TX,102.6,100,110,125,125,95,-105,105,105,-125,162.5,185,185,415,,
DQ,Caleb Jones,M,SBD,MR-Jr,110,Raw,2003,,USA,AZ,100.2,280,300,-310,300,170,-190,-190,170,-300,-320,-320,,,,
1,Augustus Davis,M,SBD,MR-Jr,140,Raw,2002,Be Strong,USA,TX,138.4,267.5,282.5,285,285,185,192.5,-197.5,192.5,285,295,-297.5,295,772.5,,
1,Brandon Nguyen,M,SBD,MR-Jr,67.5,Raw,2001,,USA,NJ,66.8,157.5,167.5,175,175,102.5,107.5,-112.5,107.5,230,247.5,-252.5,247.5,530,,
2,Jacob Stanley,M,SBD,MR-Jr,67.5,Raw,2000,,USA,TX,66.1,145,150,155,155,97.5,-100,100,100,180,-190,200,200,455,,
1,Noah Martinez #2,M,SBD,MR-Jr,82.5,Raw,2002,,USA,TX,77.2,205,215,227.5,227.5,115,127.5,137.5,137.5,237.5,260,-275,260,625,,
2,Nicholas Brown,M,SBD,MR-Jr,82.5,Raw,2003,,USA,TX,79.1,190,195,200,200,125,-130,,125,232.5,240,-245,240,565,,
3,Jason Tran #7,M,SBD,MR-Jr,82.5,Raw,2001,,USA,TX,80.8,180,185,190,190,110,115,-120,115,200,210,-220,210,515,,
4,Paul Moshauer,M,SBD,MR-Jr,82.5,Raw,1999,Texas A&M Powerlifting,USA,TX,81.1,182.5,187.5,190,190,92.5,100,107.5,107.5,192.5,200,215,215,512.5,,
5,Alvin Kim,M,SBD,MR-Jr,82.5,Raw,1999,,USA,TX,82.5,165,180,-185,180,105,112.5,120,120,170,182.5,195,195,495,,
6,Adrian Ramirez,M,SBD,MR-Jr,82.5,Raw,2002,Be Strong,USA,TX,82.4,162.5,170,177.5,177.5,100,105,112.5,112.5,175,185,190,190,480,,
7,Seth Dickens,M,SBD,MR-Jr,82.5,Raw,2001,,USA,TX,79.6,152.5,165,175,175,95,100,-105,100,165,182.5,195,195,470,,
1,Tim Lamando,M,SBD,MR-M1a,82.5,Raw,1979,,USA,TX,80.3,195,205,210,210,130,135,137.5,137.5,235,242.5,,242.5,590,,
2,Tuan Tran,M,SBD,MR-M1a,82.5,Raw,1981,,USA,TX,80.9,185,197.5,205,205,110,117.5,122.5,122.5,210,222.5,227.5,227.5,555,,
1,Enrique Gasca,M,SBD,MR-M3b,82.5,Raw,1957,,USA,TX,82.5,75,85,90,90,50,55,60,60,110,115,120,120,270,,
1,Adam Lira,M,SBD,MR-O,56,Raw,1988,,USA,TX,53.1,102.5,115,125,125,82.5,-87.5,-92.5,82.5,125,132.5,142.5,142.5,350,,
1,Anthony Nguyen #8,M,SBD,MR-O,75,Raw,2002,,USA,TX,75,225,-237.5,237.5,237.5,135,-147.5,147.5,147.5,245,265,280,280,665,,
2,Jeffrey Heng,M,SBD,MR-O,75,Raw,1999,,USA,TX,73.7,200,212.5,220,220,142.5,-147.5,-147.5,142.5,247.5,262.5,-272.5,262.5,625,,
3,Yeong Hyeon Jeong,M,SBD,MR-O,75,Raw,1991,,South Korea,,74.7,210,220,227.5,227.5,145,-150,-150,145,210,220,225,225,597.5,,
4,Cole Elham,M,SBD,MR-O,75,Raw,1999,,USA,TX,72.4,205,215,-227.5,215,127.5,132.5,-137.5,132.5,235,247.5,-255,247.5,595,,
5,Angel Acuna,M,SBD,MR-O,75,Raw,1997,,USA,TX,74.5,-190,197.5,-215,197.5,-125,125,-137.5,125,220,-232.5,232.5,232.5,555,,
6,Ben Huynh,M,SBD,MR-O,75,Raw,2003,,USA,TX,73.9,172.5,180,187.5,187.5,107.5,112.5,117.5,117.5,185,197.5,210,210,515,,
1,Andrew Cardi,M,SBD,MR-O,90,Raw,2002,,USA,TX,85,240,-250,250,250,135,137.5,-142.5,137.5,250,-257.5,257.5,257.5,645,,
2,William Wilson,M,SBD,MR-O,90,Raw,1996,,USA,TX,87.3,-200,212.5,-220,212.5,135,142.5,147.5,147.5,225,240,245,245,605,,
3,Daniel Rosales,M,SBD,MR-O,90,Raw,1999,,USA,TX,89.5,182.5,197.5,205,205,120,127.5,132.5,132.5,227.5,242.5,255,255,592.5,,
4,Philip Mok,M,SBD,MR-O,90,Raw,1988,,USA,TX,88.5,200,215,-227.5,215,110,120,125,125,-220,227.5,237.5,237.5,577.5,,
5,Joel Abban,M,SBD,MR-O,90,Raw,2000,,USA,TX,88.4,185,192.5,205,205,120,125,130,130,215,225,235,235,570,,
6,Kyle Christmas,M,SBD,MR-O,90,Raw,1995,,USA,TX,89.7,-220,-220,220,220,135,142.5,150,150,185,200,-220,200,570,,
7,Sinclair Walker,M,SBD,MR-O,90,Raw,1989,Team Warfare,USA,TX,89.3,175,185,190,190,85,102.5,107.5,107.5,220,240,-260,240,537.5,,
8,David Aguilar,M,SBD,MR-O,90,Raw,1999,,USA,TX,87.8,190,205,215,215,102.5,107.5,112.5,112.5,187.5,197.5,205,205,532.5,,
9,Saul Lira,M,SBD,MR-O,90,Raw,1999,,USA,TX,86.5,-155,-165,165,165,105,112.5,120,120,190,205,210,210,495,,
10,Caleb Timms,M,SBD,MR-O,90,Raw,1999,,USA,TX,85.2,152.5,162.5,170,170,100,-105,-112.5,100,185,190,200,200,470,,
11,Carlos Chavez,M,SBD,MR-O,90,Raw,1997,,USA,TX,89.4,115,127.5,135,135,92.5,100,-105,100,155,167.5,175,175,410,,
12,Gedion Tagese,M,SBD,MR-O,90,Raw,1998,,USA,TX,85.8,150,-157.5,-157.5,150,-67.5,67.5,-70,67.5,167.5,175,180,180,397.5,,
1,Edgar Arredondo,M,SBD,MR-O,100,Raw,2002,Be Strong,USA,TX,97.9,242.5,252.5,260,260,142.5,152.5,-155,152.5,250,257.5,-262.5,257.5,670,,
2,Dylan Salinas,M,SBD,MR-O,100,Raw,1998,,USA,TX,94.1,200,225,232.5,232.5,150,165,170,170,200,225,-267.5,225,627.5,,
3,Oskar Timm,M,SBD,MR-O,100,Raw,1999,,USA,TX,99.4,205,215,220,220,132.5,-137.5,-137.5,132.5,210,220,227.5,227.5,580,,
1,Travis Moody,M,SBD,MR-O,110,Raw,1999,,USA,AL,104,227.5,235,-240,235,150,160,-162.5,160,217.5,230,242.5,242.5,637.5,,
2,Tyler Ross,M,SBD,MR-O,110,Raw,1992,,USA,TX,107.2,165,175,182.5,182.5,130,-140,-140,130,210,227.5,240,240,552.5,,
3,Ryan Ibarra,M,SBD,MR-O,110,Raw,1994,,USA,TX,102.6,182.5,192.5,200,200,140,145,147.5,147.5,185,195,202.5,202.5,550,,
4,Charles Klepac,M,SBD,MR-O,110,Raw,1990,,USA,TX,104.5,140,150,155,155,100,105,-107.5,105,180,192.5,200,200,460,,
DQ,Caleb Jones,M,SBD,MR-O,110,Raw,2003,,USA,AZ,100.2,280,300,-310,300,170,-190,-190,170,-300,-320,-320,,,,
1,Jose Soltero,M,SBD,MR-O,125,Raw,1999,,USA,TX,123.2,260,272.5,285,285,160,167.5,177.5,177.5,260,285,300,300,762.5,,
2,Babber Momin,M,SBD,MR-O,125,Raw,1998,,USA,TX,113.2,187.5,200,210,210,135,142.5,-147.5,142.5,197.5,207.5,217.5,217.5,570,,
1,Roberto Garcia,M,SBD,MR-O,140+,Raw,1994,Be Strong,USA,TX,168.8,175,182.5,192.5,192.5,140,147.5,-160,147.5,190,200,217.5,217.5,557.5,,
1,Jacob Breaux,M,SBD,MR-O,82.5,Raw,1996,,USA,TX,82.1,227.5,240,250,250,135,140,145,145,275,287.5,295,295,690,,
2,Javier Vela,M,SBD,MR-O,82.5,Raw,1998,,USA,TX,81.4,230,240,247.5,247.5,145,155,-160,155,260,272.5,-280,272.5,675,,
3,Daniel Gil,M,SBD,MR-O,82.5,Raw,2003,,USA,TX,78.6,215,225,232.5,232.5,135,145,-157.5,145,225,240,255,255,632.5,,
4,James Ramadhan,M,SBD,MR-O,82.5,Raw,1997,,USA,TX,77.3,205,217.5,-227.5,217.5,147.5,155,-157.5,155,227.5,-240,-240,227.5,600,,
5,Laureano Hoyos,M,SBD,MR-O,82.5,Raw,1999,Yoddha Training,USA,TX,80.9,182.5,195,205,205,157.5,167.5,-175,167.5,200,215,227.5,227.5,600,,
6,Reid Connolly,M,SBD,MR-O,82.5,Raw,1989,,USA,TX,81.5,185,192.5,202.5,202.5,122.5,130,-137.5,130,210,227.5,240,240,572.5,,
7,Humberto Alvarado,M,SBD,MR-O,82.5,Raw,1985,,USA,TX,75.4,157.5,,,157.5,145,152.5,-162.5,152.5,197.5,212.5,227.5,227.5,537.5,,
8,Napoleon Heredia,M,SBD,MR-O,82.5,Raw,1986,,USA,TX,81.4,175,190,-200,190,132.5,-137.5,137.5,137.5,175,192.5,205,205,532.5,,
9,Jacob Orbe,M,SBD,MR-O,82.5,Raw,1995,,USA,TX,81.7,165,175,-185,175,102.5,110,115,115,210,222.5,235,235,525,,
10,Adam Benge,M,SBD,MR-O,82.5,Raw,1985,,USA,TX,80,142.5,150,157.5,157.5,105,115,-117.5,115,200,227.5,240,240,512.5,,
11,Paul Moshauer,M,SBD,MR-O,82.5,Raw,1999,Texas A&M Powerlifting,USA,TX,81.1,182.5,187.5,190,190,92.5,100,107.5,107.5,192.5,200,215,215,512.5,,
12,Adrian Ramirez,M,SBD,MR-O,82.5,Raw,2002,Be Strong,USA,TX,82.4,162.5,170,177.5,177.5,100,105,112.5,112.5,175,185,190,190,480,,
13,Drew Conserva,M,SBD,MR-O,82.5,Raw,1991,Team Warfare,USA,TX,81.7,125,142.5,155,155,95,102.5,110,110,185,195,207.5,207.5,472.5,,
1,Aaron Plakas,M,SBD,MR-T1,60,Raw,2008,,USA,TX,59.9,75,85,92.5,92.5,45,50,52.5,52.5,85,105,115,115,260,,
1,Donny Nguyen,M,SBD,MR-T1,75,Raw,2007,,USA,TX,69.2,152.5,160,-165,160,92.5,97.5,100,100,195,-205,-205,195,455,,
2,Gordon Tran,M,SBD,MR-T1,75,Raw,2007,,USA,TX,74.5,137.5,-145,-147.5,137.5,87.5,-95,-102.5,87.5,-180,185,-200,185,410,,
3,John Khoury,M,SBD,MR-T1,75,Raw,2007,,USA,TX,72.1,132.5,142.5,150,150,90,105,-112.5,105,135,142.5,150,150,405,,
1,Ethan Clark #4,M,SBD,MR-T1,67.5,Raw,2009,,USA,TX,62.8,107.5,112.5,120,120,-65,70,-85,70,130,140,-145,140,330,,
1,Joseph Song,M,SBD,MR-T2,60,Raw,2006,,USA,CA,59.6,125,130,135,135,80,-85,85,85,170,180,192.5,192.5,412.5,,
2,Landon Beals,M,SBD,MR-T2,60,Raw,2007,,USA,TX,58.4,95,100,105,105,50,60,-67.5,60,122.5,130,-137.5,130,295,,
1,Ryan Bautista,M,SBD,MR-T2,75,Raw,2005,,USA,TX,74.1,200,210,217.5,217.5,155,165,172.5,172.5,200,215,227.5,227.5,617.5,,2005-06-30
2,Taylor Maurer,M,SBD,MR-T2,75,Raw,2005,,USA,TX,72.2,182.5,192.5,-197.5,192.5,-117.5,120,125,125,200,207.5,217.5,217.5,535,,
3,Raphael Rivera,M,SBD,MR-T2,75,Raw,2007,,USA,TX,74.5,150,160,-175,160,80,90,100,100,170,180,190,190,450,,
1,Travis Anderson,M,SBD,MR-T2,90,Raw,2005,,USA,TX,84.4,-207.5,207.5,-217.5,207.5,120,125,-127.5,125,225,-235,,225,557.5,,
2,Brian Nguyen #2,M,SBD,MR-T2,90,Raw,2007,,USA,TX,87.4,145,155,165,165,95,102.5,105,105,200,-205,205,205,475,,
3,Brennan Cox,M,SBD,MR-T2,90,Raw,2005,Yoddha Training,USA,TX,87.7,142.5,155,162.5,162.5,85,92.5,97.5,97.5,160,175,182.5,182.5,442.5,,
4,Luca Torres,M,SBD,MR-T2,90,Raw,2007,,USA,TX,88.5,-125,135,142.5,142.5,72.5,80,85,85,140,157.5,-165,157.5,385,,
1,DJ Losack,M,SBD,MR-T2,100,Raw,2005,,USA,TX,93.9,207.5,222.5,235,235,140,147.5,150,150,205,220,232.5,232.5,617.5,,
2,Samuel Ramirez,M,SBD,MR-T2,100,Raw,2005,,USA,TX,97.7,167.5,182.5,190,190,132.5,135,137.5,137.5,185,195,202.5,202.5,530,,
1,Weston Bonneau,M,SBD,MR-T2,110,Raw,2006,,USA,TX,102.6,207.5,215,220,220,127.5,-132.5,-132.5,127.5,195,207.5,220,220,567.5,,
1,Pedro Garza,M,SBD,MR-T2,125,Raw,2006,,USA,TX,121.8,180,185,-192.5,185,107.5,112.5,120,120,172.5,187.5,195,195,500,,
1,Roger Meza,M,SBD,MR-T2,67.5,Raw,2005,,USA,TX,64.9,140,-142.5,-147.5,140,77.5,-82.5,82.5,82.5,155,162.5,-165,162.5,385,,
DQ,Juan Coronado,M,SBD,MR-T2,67.5,Raw,2006,,USA,TX,65.6,-142.5,-142.5,-142.5,,-82.5,-82.5,82.5,82.5,165,-180,-180,165,,,
1,Ben Huynh,M,SBD,MR-T3,75,Raw,2003,,USA,TX,73.9,172.5,180,187.5,187.5,107.5,112.5,117.5,117.5,185,197.5,210,210,515,,
2,Brian Noguez,M,SBD,MR-T3,75,Raw,2003,,USA,TX,73.7,165,175,182.5,182.5,-107.5,107.5,-110,107.5,182.5,197.5,205,205,495,,
3,Ethan Rivera,M,SBD,MR-T3,75,Raw,2003,,USA,TX,73.9,125,132.5,140,140,75,-77.5,-77.5,75,180,-190,-190,180,395,,
1,Alex Mendez,M,SBD,MR-T3,90,Raw,2005,,USA,TX,88.8,195,210,-225,210,117.5,125,130,130,225,240,-255,240,580,,
2,Ivan Sanchez,M,SBD,MR-T3,90,Raw,2005,,USA,TX,82.9,177.5,187.5,200,200,92.5,97.5,102.5,102.5,192.5,205,220,220,522.5,,
1,Wyaat Harrell,M,SBD,MR-T3,100,Raw,2003,,USA,TX,99.3,197.5,205,215,215,135,145,-147.5,145,220,232.5,-240,232.5,592.5,,
1,Lance Heimann,M,SBD,MR-T3,110,Raw,2005,,USA,TX,103,195,210,225,225,135,-145,-145,135,220,237.5,-245,237.5,597.5,,
1,Aidan Ouellette,M,SBD,MR-T3,67.5,Raw,2004,,USA,TX,65,-137.5,147.5,-155,147.5,95,-102.5,-102.5,95,142.5,150,160,160,402.5,,
2,Jesiah Rodriguez,M,SBD,MR-T3,67.5,Raw,2003,,USA,TX,64.4,117.5,137.5,147.5,147.5,-55,65,70,70,150,170,180,180,397.5,,
1,Daniel Gil,M,SBD,MR-T3,82.5,Raw,2003,,USA,TX,78.6,215,225,232.5,232.5,135,145,-157.5,145,225,240,255,255,632.5,,
2,Logan Clay,M,SBD,MR-T3,82.5,Raw,2004,Yoddha Training,USA,TX,81.3,-200,222.5,-242.5,222.5,102.5,120,132.5,132.5,227.5,245,-257.5,245,600,,
1,Victor Benavides Jr,M,SBD,MW-Jr,90,Wraps,2001,,USA,TX,89.5,135,150,177.5,177.5,67.5,80,90,90,102.5,142.5,150,150,417.5,,
1,Jorge Cardena,M,SBD,MW-Jr,110,Wraps,2001,,USA,TX,103.6,200,207.5,-215,207.5,112.5,125,-140,125,197.5,215,230,230,562.5,,
1,Richard Anguiano,M,SBD,MW-M2a,90,Wraps,1973,,USA,TX,89.8,102.5,122.5,-132.5,122.5,60,70,-82.5,70,102.5,117.5,130,130,322.5,,
1,Luke Cognata,M,SBD,MW-M2b,140,Wraps,1968,,USA,TX,135.4,195,-210,-210,195,102.5,125,132.5,132.5,-192.5,192.5,227.5,227.5,555,,
1,Chance Logue,M,SBD,MW-O,75,Wraps,1994,,USA,TX,68.5,-100,-100,100,100,80,82.5,-85,82.5,-140,140,145,145,327.5,,
1,Xavier Cervantes,M,SBD,MW-O,82.5,Wraps,2006,,USA,OK,82.5,180,190,200,200,90,-95,-95,90,195,220,-230,220,510,,
1,Beaux Cox,M,SBD,MW-T2,90,Wraps,2006,,USA,TX,83.3,215,-237.5,-237.5,215,102.5,125,132.5,132.5,215,232.5,-245,232.5,580,,
1,Xavier Cervantes,M,SBD,MW-T2,82.5,Wraps,2006,,USA,OK,82.5,180,190,200,200,90,-95,-95,90,195,220,-230,220,510,,
1,Montrell Ned,M,SBD,MR-Y2,60,Raw,2012,,USA,LA,57.1,20,25,-30,25,20,25,27.5,27.5,30,47.5,-55,47.5,100,,
1,Marc Macias,M,SBD,M-T1,67.5,Single-ply,2008,,USA,TX,66,180,-187.5,-187.5,180,95,-102.5,102.5,102.5,165,182.5,192.5,192.5,475,,
1,Ethan Diaz,M,SBD,M-T3,125,Single-ply,2004,,USA,TX,121.8,240,252.5,265,265,125,132.5,135,135,210,220,232.5,232.5,632.5,,
