# N   time_unoptimized   block_2  block_4  block_8  block_16  block_32  block_64  block_128
1024 0.023527 0.010979  0.009690  0.008850  0.008540  0.008617  0.009079  0.009620 
2048 0.056650 0.047487  0.041505  0.041163  0.038398  0.038616  0.039650  0.042313 
4096 0.265211 0.207074  0.184411  0.173789  0.169242  0.165632  0.172807  0.179222 
