\relax 
\providecommand\hyper@newdestlabel[2]{}
\catcode `"\active 
\providecommand\HyperFirstAtBeginDocument{\AtBeginDocument}
\HyperFirstAtBeginDocument{\ifx\hyper@anchor\@undefined
\global\let\oldcontentsline\contentsline
\gdef\contentsline#1#2#3#4{\oldcontentsline{#1}{#2}{#3}}
\global\let\oldnewlabel\newlabel
\gdef\newlabel#1#2{\newlabelxx{#1}#2}
\gdef\newlabelxx#1#2#3#4#5#6{\oldnewlabel{#1}{{#2}{#3}}}
\AtEndDocument{\ifx\hyper@anchor\@undefined
\let\contentsline\oldcontentsline
\let\newlabel\oldnewlabel
\fi}
\fi}
\global\let\hyper@last\relax 
\gdef\HyperFirstAtBeginDocument#1{#1}
\providecommand\HyField@AuxAddToFields[1]{}
\providecommand\HyField@AuxAddToCoFields[2]{}
\providecommand\@newglossary[4]{}
\@newglossary{main}{glg}{gls}{glo}
\select@language{ngerman}
\@writefile{toc}{\select@language{ngerman}}
\@writefile{lof}{\select@language{ngerman}}
\@writefile{lot}{\select@language{ngerman}}
\@writefile{toc}{\contentsline {chapter}{\numberline {1}Vorwort}{3}{chapter.1}}
\@writefile{lof}{\addvspace {10\p@ }}
\@writefile{lot}{\addvspace {10\p@ }}
\@writefile{lol}{\addvspace {10\p@ }}
\@writefile{toc}{\contentsline {chapter}{\numberline {2}Einleitung}{4}{chapter.2}}
\@writefile{lof}{\addvspace {10\p@ }}
\@writefile{lot}{\addvspace {10\p@ }}
\@writefile{lol}{\addvspace {10\p@ }}
\@writefile{toc}{\contentsline {chapter}{\numberline {3}Enigma}{5}{chapter.3}}
\@writefile{lof}{\addvspace {10\p@ }}
\@writefile{lot}{\addvspace {10\p@ }}
\@writefile{lol}{\addvspace {10\p@ }}
\@writefile{lof}{\contentsline {figure}{\numberline {3.1}{\ignorespaces Enigma im Verkehrshaus Luzern: \url  {https://commons.wikimedia.org/wiki/File:Enigma_Verkehrshaus_Luzern_cropped.jpg}}}{5}{figure.3.1}}
\@writefile{toc}{\contentsline {section}{\numberline {3.1}Geschichte}{6}{section.3.1}}
\@writefile{toc}{\contentsline {section}{\numberline {3.2}Funktion}{6}{section.3.2}}
\newlabel{sec:functionEnigma}{{3.2}{6}{Funktion}{section.3.2}{}}
\newlabel{eq:enigma}{{3.2}{6}{Funktion}{equation.3.2.1}{}}
\@writefile{toc}{\contentsline {section}{\numberline {3.3}Schw\IeC {\"a}chen}{7}{section.3.3}}
\@writefile{toc}{\contentsline {chapter}{\numberline {4}Turing-Bombe}{8}{chapter.4}}
\@writefile{lof}{\addvspace {10\p@ }}
\@writefile{lot}{\addvspace {10\p@ }}
\@writefile{lol}{\addvspace {10\p@ }}
\@writefile{lof}{\contentsline {figure}{\numberline {4.1}{\ignorespaces Nachgebaute Turing-Bombe in Bletchley Park \url  {http://www.extremetech.com/wp-content/uploads/2011/08/rebuilt-bombe-bletchley-park.jpg}}}{8}{figure.4.1}}
\@writefile{toc}{\contentsline {section}{\numberline {4.1}Geschichte und Entwicklung}{9}{section.4.1}}
\@writefile{toc}{\contentsline {section}{\numberline {4.2}Crib}{9}{section.4.2}}
\newlabel{sec:crib}{{4.2}{9}{Crib}{section.4.2}{}}
\@writefile{lof}{\contentsline {figure}{\numberline {4.2}{\ignorespaces Tabelle in Latex, davon Screenshot erstellt}}{9}{figure.4.2}}
\@writefile{toc}{\contentsline {section}{\numberline {4.3}Bestimmung der Rotorposition}{10}{section.4.3}}
\@writefile{lof}{\contentsline {figure}{\numberline {4.3}{\ignorespaces Tabelle in Latex, davon Screenshot erstellt}}{10}{figure.4.3}}
\@writefile{lof}{\contentsline {figure}{\numberline {4.4}{\ignorespaces Mit DIA erstellt}}{10}{figure.4.4}}
\newlabel{fig:Loops}{{4.4}{10}{Mit DIA erstellt}{figure.4.4}{}}
\@writefile{lof}{\contentsline {figure}{\numberline {4.5}{\ignorespaces elsbury.com bearbeitet mit GIMP: \url  {http://www.ellsbury.com/bombe/fig_2-2_descrambler.gif}}}{11}{figure.4.5}}
\@writefile{lof}{\contentsline {figure}{\numberline {4.6}{\ignorespaces Mit DIA erstellt}}{11}{figure.4.6}}
\newlabel{fig:Setup}{{4.6}{11}{Mit DIA erstellt}{figure.4.6}{}}
\@writefile{lof}{\contentsline {figure}{\numberline {4.7}{\ignorespaces Mit DIA erstellt}}{11}{figure.4.7}}
\@writefile{toc}{\contentsline {section}{\numberline {4.4}Diagonalboard}{12}{section.4.4}}
\@writefile{lof}{\contentsline {figure}{\numberline {4.8}{\ignorespaces elsbury.com: \url  {http://www.ellsbury.com/bombe/fig_3-3_bombewires.gif}}}{13}{figure.4.8}}
\@writefile{toc}{\contentsline {section}{\numberline {4.5}Was passiert, wenn die Turing-Bombe anh\IeC {\"a}lt}{13}{section.4.5}}
\@writefile{toc}{\contentsline {section}{\numberline {4.6}Wo funktioniert sie \IeC {\"u}berhaupt?}{14}{section.4.6}}
\@writefile{toc}{\contentsline {chapter}{\numberline {5}Programm}{15}{chapter.5}}
\@writefile{lof}{\addvspace {10\p@ }}
\@writefile{lot}{\addvspace {10\p@ }}
\@writefile{lol}{\addvspace {10\p@ }}
\@writefile{toc}{\contentsline {section}{\numberline {5.1}Struktur}{15}{section.5.1}}
\@writefile{toc}{\contentsline {subsection}{\numberline {5.1.1}TuringBomb}{15}{subsection.5.1.1}}
\@writefile{toc}{\contentsline {subsection}{\numberline {5.1.2}Doublescrambler}{15}{subsection.5.1.2}}
\@writefile{lof}{\contentsline {figure}{\numberline {5.1}{\ignorespaces Tabelle in Latex, davon Screenshot erstellt}}{16}{figure.5.1}}
\@writefile{lof}{\contentsline {figure}{\numberline {5.2}{\ignorespaces Tabelle in Latex, davon Screenshot erstellt}}{16}{figure.5.2}}
\@writefile{toc}{\contentsline {subsection}{\numberline {5.1.3}RotorPart}{16}{subsection.5.1.3}}
\@writefile{toc}{\contentsline {subsection}{\numberline {5.1.4}Diagonalboard}{17}{subsection.5.1.4}}
\@writefile{toc}{\contentsline {section}{\numberline {5.2}Screenshot}{18}{section.5.2}}
\@writefile{lof}{\contentsline {figure}{\numberline {5.3}{\ignorespaces Screenshot aus meinen Programm}}{18}{figure.5.3}}
\@writefile{toc}{\contentsline {section}{\numberline {5.3}Vergleich zur echten Turing-Bombe}{19}{section.5.3}}
\@writefile{toc}{\contentsline {section}{\numberline {5.4}Auswertung}{19}{section.5.4}}
\@writefile{toc}{\contentsline {section}{\numberline {5.5}Ausblick}{19}{section.5.5}}
\@writefile{toc}{\contentsline {chapter}{\numberline {6}Fazit}{21}{chapter.6}}
\@writefile{lof}{\addvspace {10\p@ }}
\@writefile{lot}{\addvspace {10\p@ }}
\@writefile{lol}{\addvspace {10\p@ }}
\@writefile{toc}{\contentsline {chapter}{\numberline {7}Bibiliografie}{22}{chapter.7}}
\@writefile{lof}{\addvspace {10\p@ }}
\@writefile{lot}{\addvspace {10\p@ }}
\@writefile{lol}{\addvspace {10\p@ }}
\@writefile{toc}{\contentsline {chapter}{\numberline {8}Hilfsmittel}{23}{chapter.8}}
\@writefile{lof}{\addvspace {10\p@ }}
\@writefile{lot}{\addvspace {10\p@ }}
\@writefile{lol}{\addvspace {10\p@ }}
