
{
  "extends": ["config:base"], 
  "assignees": ["lujobi"], 
  "packageRules": [
    {
      "matchUpdateTypes": ["minor", "patch", "pin", "digest"],
      "automerge": true
    }, 
    {
      "matchDepTypes": ["devDependencies"],
      "automerge": true
    }, 
    {
      "matchPackagePatterns": ["eslint"],
      "automerge": true
    }
  ]
}
