M48
;DRILL file {KiCad 4.0.7-e2-6376~58~ubuntu16.04.1} date Sun Apr  8 10:28:40 2018
;FORMAT={3:3/ absolute / metric / suppress leading zeros}
FMAT,2
METRIC,TZ
T1C3.500
T2C3.500
%
G90
G05
M71
T1
X118387Y-88697
X118539Y-99593
X124793Y-88722
X124843Y-99492
T2
X101501Y-46519
X101501Y-136519
X171506Y-46521
X171506Y-136521
T0
M30
