EESchema Schematic File Version 2
LIBS:Power_converter_V4-rescue
LIBS:power
LIBS:device
LIBS:transistors
LIBS:conn
LIBS:linear
LIBS:regul
LIBS:74xx
LIBS:cmos4000
LIBS:adc-dac
LIBS:memory
LIBS:xilinx
LIBS:microcontrollers
LIBS:dsp
LIBS:microchip
LIBS:analog_switches
LIBS:motorola
LIBS:texas
LIBS:intel
LIBS:audio
LIBS:interface
LIBS:digital-audio
LIBS:philips
LIBS:display
LIBS:cypress
LIBS:siliconi
LIBS:opto
LIBS:atmel
LIBS:contrib
LIBS:valves
LIBS:sensors
LIBS:Measurement_block-cache
LIBS:Measurement_block-rescue
LIBS:digital
LIBS:lm2672
LIBS:digital-cache
LIBS:feeder_block-cache
LIBS:Power_converter_V4-cache
EELAYER 25 0
EELAYER END
$Descr A4 11693 8268
encoding utf-8
Sheet 13 15
Title "Windlogger digital"
Date "2017-03-28"
Rev "1.1.1"
Comp "ALEEA"
Comment1 "LONGUET Gilles"
Comment2 "AGPL3"
Comment3 ""
Comment4 ""
$EndDescr
Text HLabel 2050 1575 0    60   Input ~ 0
UDC
Text HLabel 1150 2925 0    60   Input ~ 0
Uac_hi
Text HLabel 2125 2925 2    60   Input ~ 0
Uac_lo
$Comp
L GND #PWR039
U 1 1 5886421D
P 1125 7575
F 0 "#PWR039" H 1125 7325 50  0001 C CNN
F 1 "GND" H 1125 7425 50  0000 C CNN
F 2 "" H 1125 7575 50  0000 C CNN
F 3 "" H 1125 7575 50  0000 C CNN
	1    1125 7575
	1    0    0    -1  
$EndComp
Text Notes 4250 1550 0    60   ~ 0
DC-DC converter\nVin 8 to 40V\nVout 5V
$Comp
L +5V #PWR040
U 1 1 5886D48F
P 8100 5125
F 0 "#PWR040" H 8100 4975 50  0001 C CNN
F 1 "+5V" H 8100 5265 50  0000 C CNN
F 2 "" H 8100 5125 50  0000 C CNN
F 3 "" H 8100 5125 50  0000 C CNN
	1    8100 5125
	1    0    0    -1  
$EndComp
$Comp
L CP C17
U 1 1 5886E707
P 9375 5350
F 0 "C17" H 9400 5450 50  0000 L CNN
F 1 "120u" H 9400 5250 50  0000 L CNN
F 2 "digital:condensator_horizontal_8_11_5" H 9413 5200 50  0001 C CNN
F 3 "" H 9375 5350 50  0000 C CNN
	1    9375 5350
	1    0    0    -1  
$EndComp
Text Notes 7825 4775 0    60   ~ 0
5 to 4.1V, 2 A, mount it when use the GPRS sim 800L module
$Comp
L +BATT #PWR041
U 1 1 588751D0
P 9650 5050
F 0 "#PWR041" H 9650 4900 50  0001 C CNN
F 1 "+BATT" H 9650 5190 50  0000 C CNN
F 2 "" H 9650 5050 50  0000 C CNN
F 3 "" H 9650 5050 50  0000 C CNN
	1    9650 5050
	1    0    0    -1  
$EndComp
$Comp
L LM358 U8
U 1 1 58883066
P 4850 5750
F 0 "U8" H 4800 5950 50  0000 L CNN
F 1 "LM358" H 4800 5500 50  0000 L CNN
F 2 "Housings_SOIC:SOIC-8_3.9x4.9mm_Pitch1.27mm" H 4850 5750 50  0001 C CNN
F 3 "" H 4850 5750 50  0000 C CNN
	1    4850 5750
	1    0    0    -1  
$EndComp
$Comp
L LM358 U8
U 2 1 588830EE
P 5800 5850
F 0 "U8" H 5750 6050 50  0000 L CNN
F 1 "LM358" H 5750 5600 50  0000 L CNN
F 2 "Housings_SOIC:SOIC-8_3.9x4.9mm_Pitch1.27mm" H 5800 5850 50  0001 C CNN
F 3 "" H 5800 5850 50  0000 C CNN
	2    5800 5850
	1    0    0    -1  
$EndComp
$Comp
L +5V #PWR042
U 1 1 58883DD7
P 5700 5475
F 0 "#PWR042" H 5700 5325 50  0001 C CNN
F 1 "+5V" H 5700 5615 50  0000 C CNN
F 2 "" H 5700 5475 50  0000 C CNN
F 3 "" H 5700 5475 50  0000 C CNN
	1    5700 5475
	1    0    0    -1  
$EndComp
$Comp
L +5V #PWR043
U 1 1 58883E49
P 4750 5400
F 0 "#PWR043" H 4750 5250 50  0001 C CNN
F 1 "+5V" H 4750 5540 50  0000 C CNN
F 2 "" H 4750 5400 50  0000 C CNN
F 3 "" H 4750 5400 50  0000 C CNN
	1    4750 5400
	1    0    0    -1  
$EndComp
$Comp
L +3.3V #PWR044
U 1 1 58884C23
P 4400 5850
F 0 "#PWR044" H 4400 5700 50  0001 C CNN
F 1 "+3.3V" H 4400 5990 50  0000 C CNN
F 2 "" H 4400 5850 50  0000 C CNN
F 3 "" H 4400 5850 50  0000 C CNN
	1    4400 5850
	0    -1   -1   0   
$EndComp
$Comp
L R R10
U 1 1 58884FF8
P 4025 5425
F 0 "R10" V 4105 5425 50  0000 C CNN
F 1 "10k" V 4025 5425 50  0000 C CNN
F 2 "Resistors_ThroughHole:Resistor_Horizontal_RM10mm" V 3955 5425 50  0001 C CNN
F 3 "" H 4025 5425 50  0000 C CNN
	1    4025 5425
	1    0    0    -1  
$EndComp
Text Label 3850 5200 0    60   ~ 0
Vin
$Comp
L C C19
U 1 1 588853C8
P 3625 5900
F 0 "C19" H 3650 6000 50  0000 L CNN
F 1 "100nF" H 3650 5800 50  0000 L CNN
F 2 "Capacitors_ThroughHole:C_Rect_L7_W2.5_P5" H 3663 5750 50  0001 C CNN
F 3 "" H 3625 5900 50  0000 C CNN
	1    3625 5900
	1    0    0    -1  
$EndComp
Text GLabel 5700 6925 0    60   Input ~ 0
USBVCC
$Comp
L +5V #PWR045
U 1 1 588869CB
P 6450 6925
F 0 "#PWR045" H 6450 6775 50  0001 C CNN
F 1 "+5V" H 6450 7065 50  0000 C CNN
F 2 "" H 6450 6925 50  0000 C CNN
F 3 "" H 6450 6925 50  0000 C CNN
	1    6450 6925
	1    0    0    -1  
$EndComp
$Comp
L C C12
U 1 1 58887D5F
P 9800 2200
F 0 "C12" H 9825 2300 50  0000 L CNN
F 1 "100n" H 9825 2100 50  0000 L CNN
F 2 "Capacitors_ThroughHole:C_Rect_L7_W2.5_P5" H 9838 2050 50  0001 C CNN
F 3 "" H 9800 2200 50  0000 C CNN
	1    9800 2200
	1    0    0    -1  
$EndComp
$Comp
L CP C16
U 1 1 5879D4DC
P 9075 5350
F 0 "C16" H 9100 5450 50  0000 L CNN
F 1 "120u" H 9100 5250 50  0000 L CNN
F 2 "digital:condensator_horizontal_8_11_5" H 9113 5200 50  0001 C CNN
F 3 "" H 9075 5350 50  0000 C CNN
	1    9075 5350
	1    0    0    -1  
$EndComp
$Comp
L C C18
U 1 1 587F8D8D
P 6350 5850
F 0 "C18" H 6375 5950 50  0000 L CNN
F 1 "100nF" H 6375 5750 50  0000 L CNN
F 2 "Capacitors_ThroughHole:C_Rect_L7_W2.5_P5" H 6388 5700 50  0001 C CNN
F 3 "" H 6350 5850 50  0000 C CNN
	1    6350 5850
	1    0    0    -1  
$EndComp
$Comp
L D D8
U 1 1 58839433
P 8500 5125
F 0 "D8" H 8500 5225 50  0000 C CNN
F 1 "SR5100" H 8500 5025 50  0000 C CNN
F 2 "digital:Diode_DO-27_Horizontal_RM12" H 8500 5125 50  0001 C CNN
F 3 "" H 8500 5125 50  0000 C CNN
	1    8500 5125
	-1   0    0    1   
$EndComp
$Comp
L PWR_FLAG #FLG046
U 1 1 5883D1ED
P 10025 5100
F 0 "#FLG046" H 10025 5195 50  0001 C CNN
F 1 "PWR_FLAG" H 10025 5280 50  0000 C CNN
F 2 "" H 10025 5100 50  0000 C CNN
F 3 "" H 10025 5100 50  0000 C CNN
	1    10025 5100
	1    0    0    -1  
$EndComp
$Comp
L Q_PMOS_GDSD Q2
U 1 1 58B4BB1B
P 6125 6825
F 0 "Q2" V 6025 6975 50  0000 R CNN
F 1 "NDT2955" V 6350 6900 50  0000 R CNN
F 2 "TO_SOT_Packages_SMD:SOT-223" H 6325 6925 50  0001 C CNN
F 3 "" H 6125 6825 50  0000 C CNN
	1    6125 6825
	0    -1   1    0   
$EndComp
$Comp
L CONN_01X02 S2
U 1 1 58B4E2AD
P 1375 6875
F 0 "S2" V 1375 7100 50  0000 C CNN
F 1 "CONN_SOLDERABLE" V 1475 6875 50  0000 C CNN
F 2 "digital:CONN_SOLDERABLE" H 1375 6875 50  0001 C CNN
F 3 "" H 1375 6875 50  0000 C CNN
	1    1375 6875
	0    -1   -1   0   
$EndComp
$Comp
L GNDPWR #PWR047
U 1 1 58B59C34
P 8950 2500
F 0 "#PWR047" H 8950 2300 50  0001 C CNN
F 1 "GNDPWR" H 8950 2370 50  0000 C CNN
F 2 "" H 8950 2450 50  0000 C CNN
F 3 "" H 8950 2450 50  0000 C CNN
	1    8950 2500
	1    0    0    -1  
$EndComp
$Comp
L CONN_01X02 S3
U 1 1 58B5A193
P 925 7350
F 0 "S3" V 925 7600 50  0000 C CNN
F 1 "CONN_SOLDERABLE" V 1025 7350 50  0000 C CNN
F 2 "digital:CONN_SOLDERABLE" H 925 7350 50  0001 C CNN
F 3 "" H 925 7350 50  0000 C CNN
	1    925  7350
	0    -1   -1   0   
$EndComp
$Comp
L PWR_FLAG #FLG048
U 1 1 58B5D8E8
P 2125 7025
F 0 "#FLG048" H 2125 7120 50  0001 C CNN
F 1 "PWR_FLAG" H 2125 7205 50  0000 C CNN
F 2 "" H 2125 7025 50  0000 C CNN
F 3 "" H 2125 7025 50  0000 C CNN
	1    2125 7025
	1    0    0    -1  
$EndComp
$Comp
L LM2672M-5.0 U7
U 1 1 58B7448A
P 4650 2225
F 0 "U7" H 4250 2675 50  0000 L CNN
F 1 "LM2672M-5.0" H 4250 2575 50  0000 L CNN
F 2 "Housings_SOIC:SOIC-8_3.9x4.9mm_Pitch1.27mm" H 5000 1875 50  0001 C CIN
F 3 "" H 4650 2225 50  0000 C CNN
	1    4650 2225
	1    0    0    -1  
$EndComp
$Comp
L CP C14
U 1 1 58B7472E
P 3800 2750
F 0 "C14" H 3825 2850 50  0000 L CNN
F 1 "120u" H 3825 2650 50  0000 L CNN
F 2 "digital:condensator_horizontal_8_11_5" H 3838 2600 50  0001 C CNN
F 3 "" H 3800 2750 50  0000 C CNN
	1    3800 2750
	1    0    0    -1  
$EndComp
$Comp
L GNDPWR #PWR049
U 1 1 58B74994
P 3800 3175
F 0 "#PWR049" H 3800 2975 50  0001 C CNN
F 1 "GNDPWR" H 3800 3045 50  0000 C CNN
F 2 "" H 3800 3125 50  0000 C CNN
F 3 "" H 3800 3125 50  0000 C CNN
	1    3800 3175
	1    0    0    -1  
$EndComp
$Comp
L GNDPWR #PWR050
U 1 1 58B74E00
P 4650 3175
F 0 "#PWR050" H 4650 2975 50  0001 C CNN
F 1 "GNDPWR" H 4650 3045 50  0000 C CNN
F 2 "" H 4650 3125 50  0000 C CNN
F 3 "" H 4650 3125 50  0000 C CNN
	1    4650 3175
	1    0    0    -1  
$EndComp
$Comp
L D_Schottky D5
U 1 1 58B74F4B
P 5425 2925
F 0 "D5" H 5425 3025 50  0000 C CNN
F 1 "SR5100" H 5425 2825 50  0000 C CNN
F 2 "digital:Diode_DO-27_Horizontal_RM12" H 5425 2925 50  0001 C CNN
F 3 "" H 5425 2925 50  0000 C CNN
	1    5425 2925
	0    1    1    0   
$EndComp
$Comp
L GNDPWR #PWR051
U 1 1 58B750BB
P 5425 3175
F 0 "#PWR051" H 5425 2975 50  0001 C CNN
F 1 "GNDPWR" H 5425 3045 50  0000 C CNN
F 2 "" H 5425 3125 50  0000 C CNN
F 3 "" H 5425 3125 50  0000 C CNN
	1    5425 3175
	1    0    0    -1  
$EndComp
$Comp
L INDUCTOR_SMALL L1
U 1 1 58B753FD
P 5750 2425
F 0 "L1" H 5750 2525 50  0000 C CNN
F 1 "47u" H 5750 2375 50  0000 C CNN
F 2 "digital:inductance_murata_1200LRS" H 5750 2425 50  0001 C CNN
F 3 "" H 5750 2425 50  0000 C CNN
	1    5750 2425
	1    0    0    -1  
$EndComp
$Comp
L CP C15
U 1 1 58B758EF
P 6250 2925
F 0 "C15" H 6275 3025 50  0000 L CNN
F 1 "120u" H 6275 2825 50  0000 L CNN
F 2 "digital:condensator_horizontal_8_11_5" H 6288 2775 50  0001 C CNN
F 3 "" H 6250 2925 50  0000 C CNN
	1    6250 2925
	1    0    0    -1  
$EndComp
$Comp
L GNDPWR #PWR052
U 1 1 58B75B3D
P 6250 3175
F 0 "#PWR052" H 6250 2975 50  0001 C CNN
F 1 "GNDPWR" H 6250 3045 50  0000 C CNN
F 2 "" H 6250 3125 50  0000 C CNN
F 3 "" H 6250 3125 50  0000 C CNN
	1    6250 3175
	1    0    0    -1  
$EndComp
$Comp
L C_Small C13
U 1 1 58B75C79
P 5300 2225
F 0 "C13" H 5310 2295 50  0000 L CNN
F 1 "10n" H 5310 2145 50  0000 L CNN
F 2 "Capacitors_ThroughHole:C_Rect_L7_W2.5_P5" H 5300 2225 50  0001 C CNN
F 3 "" H 5300 2225 50  0000 C CNN
	1    5300 2225
	0    1    1    0   
$EndComp
Text Label 2850 7500 2    60   ~ 0
Vin
Wire Notes Line
	2550 925  2550 3950
Wire Notes Line
	2625 3950 2600 3950
Wire Wire Line
	9375 5500 9375 5675
Wire Wire Line
	9375 5125 9375 5200
Connection ~ 9375 5125
Wire Wire Line
	9650 5125 9650 5050
Wire Wire Line
	7975 1950 8650 1950
Wire Wire Line
	750  7075 1325 7075
Wire Wire Line
	9800 1950 9800 2050
Connection ~ 9800 1950
Wire Wire Line
	9500 2050 9500 1950
Connection ~ 9500 1950
Wire Wire Line
	9800 2425 9800 2350
Wire Wire Line
	9500 2425 9500 2350
Connection ~ 9500 2425
Wire Wire Line
	8950 2150 8950 2500
Connection ~ 8950 2425
Wire Wire Line
	5150 5750 5500 5750
Wire Wire Line
	5500 5950 5500 6425
Wire Wire Line
	5500 6425 6125 6425
Wire Wire Line
	5700 6150 5700 6200
Wire Wire Line
	4750 6100 4750 6050
Wire Wire Line
	4750 5400 4750 5450
Wire Wire Line
	5700 5475 5700 5550
Wire Wire Line
	4400 5850 4550 5850
Wire Wire Line
	3325 5650 4550 5650
Wire Wire Line
	4025 5275 4025 5200
Wire Wire Line
	4025 5200 3850 5200
Wire Wire Line
	3325 6050 4025 6050
Wire Wire Line
	6325 6925 6450 6925
Wire Wire Line
	5700 6925 5925 6925
Connection ~ 9375 5600
Wire Wire Line
	9075 5500 9075 5600
Connection ~ 9075 5600
Wire Wire Line
	9075 5200 9075 5125
Connection ~ 9075 5125
Wire Wire Line
	8450 2425 9800 2425
Wire Wire Line
	6350 5700 6350 5500
Wire Wire Line
	6350 5500 5700 5500
Connection ~ 5700 5500
Wire Wire Line
	6350 6000 6350 6175
Wire Wire Line
	6350 6175 5700 6175
Connection ~ 5700 6175
Wire Wire Line
	8350 5125 8100 5125
Wire Wire Line
	8650 5125 10025 5125
Wire Wire Line
	9075 5600 10000 5600
Wire Wire Line
	10025 5125 10025 5100
Connection ~ 9650 5125
Wire Wire Line
	5925 7025 5850 7025
Wire Wire Line
	5850 7025 5850 6925
Connection ~ 5850 6925
Wire Wire Line
	1425 7075 2125 7075
Wire Wire Line
	1775 7075 1775 7000
Wire Wire Line
	975  7550 1125 7550
Wire Wire Line
	1125 7550 1125 7575
Wire Wire Line
	2125 7075 2125 7025
Connection ~ 1775 7075
Wire Wire Line
	3100 2025 4150 2025
Wire Wire Line
	3800 2600 3800 2025
Connection ~ 3800 2025
Wire Wire Line
	3800 3175 3800 2900
Wire Wire Line
	4650 3175 4650 2625
Wire Wire Line
	5150 2425 5500 2425
Wire Wire Line
	5425 2225 5425 2775
Wire Wire Line
	5425 3175 5425 3075
Connection ~ 5425 2425
Wire Wire Line
	6000 2425 6800 2425
Wire Wire Line
	6250 2425 6250 2775
Wire Wire Line
	6250 3075 6250 3175
Wire Wire Line
	5150 2225 5200 2225
Wire Wire Line
	5400 2225 5425 2225
Wire Wire Line
	6050 2025 6050 2425
Connection ~ 6050 2425
Connection ~ 6250 2425
Connection ~ 6125 6425
Wire Wire Line
	6125 5850 6125 6625
Wire Wire Line
	6100 5850 6125 5850
$Comp
L ZENER D9
U 1 1 58B78735
P 3325 5850
F 0 "D9" H 3325 5950 50  0000 C CNN
F 1 "BZX79-C4V7,113" H 3325 5750 50  0000 C CNN
F 2 "Diodes_ThroughHole:Diode_DO-35_SOD27_Horizontal_RM10" H 3325 5850 50  0001 C CNN
F 3 "" H 3325 5850 50  0000 C CNN
	1    3325 5850
	0    1    1    0   
$EndComp
Wire Wire Line
	3625 5750 3625 5650
Connection ~ 3625 5650
Connection ~ 3625 6050
$Comp
L CP C11
U 1 1 5887130F
P 9500 2200
F 0 "C11" H 9525 2300 50  0000 L CNN
F 1 "1u" H 9525 2100 50  0000 L CNN
F 2 "Capacitors_ThroughHole:C_Radial_D5_L6_P2.5" H 9538 2050 50  0001 C CNN
F 3 "" H 9500 2200 50  0000 C CNN
	1    9500 2200
	1    0    0    -1  
$EndComp
$Comp
L CP C10
U 1 1 58B7959F
P 8450 2200
F 0 "C10" H 8475 2300 50  0000 L CNN
F 1 "1u" H 8475 2100 50  0000 L CNN
F 2 "Capacitors_ThroughHole:C_Radial_D5_L6_P2.5" H 8488 2050 50  0001 C CNN
F 3 "" H 8450 2200 50  0000 C CNN
	1    8450 2200
	1    0    0    -1  
$EndComp
Wire Wire Line
	8450 2050 8450 1950
Connection ~ 8450 1950
Wire Wire Line
	8450 2425 8450 2350
Wire Wire Line
	9250 1950 10325 1950
$Comp
L CONN_01X02 S1
U 1 1 58B7A83A
P 1375 6350
F 0 "S1" V 1375 6600 50  0000 C CNN
F 1 "CONN_SOLDERABLE" V 1475 6350 50  0000 C CNN
F 2 "digital:CONN_SOLDERABLE" H 1375 6350 50  0001 C CNN
F 3 "" H 1375 6350 50  0000 C CNN
	1    1375 6350
	0    -1   -1   0   
$EndComp
$Comp
L PWR_FLAG #FLG053
U 1 1 58B7A840
P 2125 6500
F 0 "#FLG053" H 2125 6595 50  0001 C CNN
F 1 "PWR_FLAG" H 2125 6680 50  0000 C CNN
F 2 "" H 2125 6500 50  0000 C CNN
F 3 "" H 2125 6500 50  0000 C CNN
	1    2125 6500
	1    0    0    -1  
$EndComp
Wire Wire Line
	775  6550 1325 6550
Wire Wire Line
	1425 6550 2125 6550
Wire Wire Line
	1775 6550 1775 6475
Wire Wire Line
	2125 6550 2125 6500
Connection ~ 1775 6550
$Comp
L +5V #PWR054
U 1 1 58B7A904
P 1775 6475
F 0 "#PWR054" H 1775 6325 50  0001 C CNN
F 1 "+5V" H 1775 6615 50  0000 C CNN
F 2 "" H 1775 6475 50  0000 C CNN
F 3 "" H 1775 6475 50  0000 C CNN
	1    1775 6475
	1    0    0    -1  
$EndComp
$Comp
L +3V3 #PWR055
U 1 1 58B7AC85
P 1775 7000
F 0 "#PWR055" H 1775 6850 50  0001 C CNN
F 1 "+3V3" H 1775 7140 50  0000 C CNN
F 2 "" H 1775 7000 50  0000 C CNN
F 3 "" H 1775 7000 50  0000 C CNN
	1    1775 7000
	1    0    0    -1  
$EndComp
$Comp
L +BATT #PWR056
U 1 1 58B7BD01
P 1900 5275
F 0 "#PWR056" H 1900 5125 50  0001 C CNN
F 1 "+BATT" H 1900 5415 50  0000 C CNN
F 2 "" H 1900 5275 50  0000 C CNN
F 3 "" H 1900 5275 50  0000 C CNN
	1    1900 5275
	1    0    0    -1  
$EndComp
Text GLabel 1675 4900 2    60   Input ~ 0
USBVCC
$Comp
L CONN_01X03 P2
U 1 1 58B7C006
P 2900 2025
F 0 "P2" H 2900 2225 50  0000 C CNN
F 1 "CONN_01X03" V 3000 2025 50  0000 C CNN
F 2 "Pin_Headers:Pin_Header_Angled_1x03" H 2900 2025 50  0001 C CNN
F 3 "" H 2900 2025 50  0000 C CNN
	1    2900 2025
	-1   0    0    1   
$EndComp
Wire Wire Line
	3100 1925 3150 1925
Wire Wire Line
	3150 1925 3150 1575
Wire Wire Line
	3150 1575 2050 1575
$Comp
L GNDPWR #PWR057
U 1 1 58B59717
P 1625 3450
F 0 "#PWR057" H 1625 3250 50  0001 C CNN
F 1 "GNDPWR" H 1625 3320 50  0000 C CNN
F 2 "" H 1625 3400 50  0000 C CNN
F 3 "" H 1625 3400 50  0000 C CNN
	1    1625 3450
	1    0    0    -1  
$EndComp
Text HLabel 1400 3425 0    60   Input ~ 0
GND_PWR
Wire Wire Line
	3100 2125 3150 2125
Wire Wire Line
	3150 2125 3150 2400
Wire Wire Line
	3150 2400 1625 2400
Wire Wire Line
	1625 2400 1625 2525
Wire Wire Line
	1150 2925 1400 2925
Wire Wire Line
	1800 2925 2125 2925
Wire Wire Line
	1625 3325 1625 3450
Wire Wire Line
	1400 3425 2050 3425
Connection ~ 1625 3425
Text Notes 1200 1275 0    60   ~ 0
From shield PCB
Text Notes 2575 1425 0    60   ~ 0
Jumper to select :\nUDC or UAC source
Text Notes 8400 1625 0    60   ~ 0
DC linear regulator for 3.3V supply
Wire Notes Line
	500  4225 11225 4225
Wire Notes Line
	6975 500  6975 6525
Text Notes 3450 4900 0    60   ~ 0
Auto switch, if if Vin is set, don't use +5V from USB
Wire Notes Line
	2975 4250 2975 7800
Text Label 775  6550 0    60   ~ 0
+5V_PWR
Text Label 750  7075 0    60   ~ 0
+3V3_PWR
Wire Wire Line
	6050 2025 5150 2025
Text Notes 525  6100 0    60   ~ 0
DESCRIPTION: \nThese jumpers allow the isolation of the feeder.\nTo be used during the test phase.
Text Notes 575  5750 0    60   ~ 0
JUMPER CONNECTORS
Wire Notes Line
	475  5650 2975 5650
Wire Notes Line
	1550 5775 575  5775
Text Notes 600  4350 0    60   ~ 0
TESTING PINS
Text Notes 550  4650 0    60   ~ 0
VERY IMPORTANT: \nThis pins can be used to implement testing probes.
Wire Notes Line
	600  4375 1200 4375
$Comp
L GNDPWR #PWR058
U 1 1 58B8037D
P 1375 5400
F 0 "#PWR058" H 1375 5200 50  0001 C CNN
F 1 "GNDPWR" H 1375 5270 50  0000 C CNN
F 2 "" H 1375 5350 50  0000 C CNN
F 3 "" H 1375 5350 50  0000 C CNN
	1    1375 5400
	1    0    0    -1  
$EndComp
$Comp
L TEST_1P W1
U 1 1 58B8051A
P 1200 4775
F 0 "W1" V 1250 4825 50  0000 C CNN
F 1 "Vin" V 1200 5100 50  0000 C CNN
F 2 "Measurement_Points:Measurement_Point_Square-TH_Big" H 1400 4775 50  0001 C CNN
F 3 "" H 1400 4775 50  0000 C CNN
	1    1200 4775
	0    -1   -1   0   
$EndComp
$Comp
L TEST_1P W2
U 1 1 58B80838
P 1200 4900
F 0 "W2" V 1250 4950 50  0000 C CNN
F 1 "USBVCC" V 1200 5225 50  0000 C CNN
F 2 "Measurement_Points:Measurement_Point_Square-TH_Big" H 1400 4900 50  0001 C CNN
F 3 "" H 1400 4900 50  0000 C CNN
	1    1200 4900
	0    -1   -1   0   
$EndComp
$Comp
L TEST_1P W3
U 1 1 58B808A8
P 1200 5025
F 0 "W3" V 1250 5075 50  0000 C CNN
F 1 "+5V" V 1200 5350 50  0000 C CNN
F 2 "Measurement_Points:Measurement_Point_Square-TH_Big" H 1400 5025 50  0001 C CNN
F 3 "" H 1400 5025 50  0000 C CNN
	1    1200 5025
	0    -1   -1   0   
$EndComp
$Comp
L TEST_1P W4
U 1 1 58B809EA
P 1200 5150
F 0 "W4" V 1250 5200 50  0000 C CNN
F 1 "+3.3V" V 1200 5475 50  0000 C CNN
F 2 "Measurement_Points:Measurement_Point_Square-TH_Big" H 1400 5150 50  0001 C CNN
F 3 "" H 1400 5150 50  0000 C CNN
	1    1200 5150
	0    -1   -1   0   
$EndComp
$Comp
L TEST_1P W5
U 1 1 58B809F0
P 1200 5275
F 0 "W5" V 1250 5325 50  0000 C CNN
F 1 "+BATT" V 1200 5600 50  0000 C CNN
F 2 "Measurement_Points:Measurement_Point_Square-TH_Big" H 1400 5275 50  0001 C CNN
F 3 "" H 1400 5275 50  0000 C CNN
	1    1200 5275
	0    -1   -1   0   
$EndComp
$Comp
L TEST_1P W6
U 1 1 58B809F6
P 1200 5400
F 0 "W6" V 1250 5450 50  0000 C CNN
F 1 "GNDPWR" V 1200 5725 50  0000 C CNN
F 2 "Measurement_Points:Measurement_Point_Square-TH_Big" H 1400 5400 50  0001 C CNN
F 3 "" H 1400 5400 50  0000 C CNN
	1    1200 5400
	0    -1   -1   0   
$EndComp
Wire Wire Line
	1375 5400 1200 5400
Wire Wire Line
	1675 4900 1200 4900
Wire Wire Line
	1675 4775 1200 4775
Wire Wire Line
	1675 5025 1200 5025
Wire Wire Line
	1675 5150 1200 5150
Wire Wire Line
	1200 5275 1900 5275
$Comp
L TEST_1P W7
U 1 1 58B82609
P 2200 5400
F 0 "W7" V 2250 5450 50  0000 C CNN
F 1 "GND" V 2200 5725 50  0000 C CNN
F 2 "Measurement_Points:Measurement_Point_Square-TH_Big" H 2400 5400 50  0001 C CNN
F 3 "" H 2400 5400 50  0000 C CNN
	1    2200 5400
	0    -1   -1   0   
$EndComp
Wire Wire Line
	2375 5400 2200 5400
$Comp
L GND #PWR059
U 1 1 58B82655
P 2375 5400
F 0 "#PWR059" H 2375 5150 50  0001 C CNN
F 1 "GND" H 2375 5250 50  0000 C CNN
F 2 "" H 2375 5400 50  0000 C CNN
F 3 "" H 2375 5400 50  0000 C CNN
	1    2375 5400
	1    0    0    -1  
$EndComp
$Comp
L D_Schottky D3
U 1 1 58B82BAA
P 1400 2725
F 0 "D3" H 1400 2825 50  0000 C CNN
F 1 "SR5100" H 1400 2625 50  0000 C CNN
F 2 "digital:Diode_DO-27_Horizontal_RM12" H 1400 2725 50  0001 C CNN
F 3 "" H 1400 2725 50  0000 C CNN
	1    1400 2725
	0    1    1    0   
$EndComp
$Comp
L D_Schottky D4
U 1 1 58B82C46
P 1800 2725
F 0 "D4" H 1800 2825 50  0000 C CNN
F 1 "SR5100" H 1800 2625 50  0000 C CNN
F 2 "digital:Diode_DO-27_Horizontal_RM12" H 1800 2725 50  0001 C CNN
F 3 "" H 1800 2725 50  0000 C CNN
	1    1800 2725
	0    1    1    0   
$EndComp
$Comp
L D_Schottky D6
U 1 1 58B82CFA
P 1400 3100
F 0 "D6" H 1400 3200 50  0000 C CNN
F 1 "SR5100" H 1400 3000 50  0000 C CNN
F 2 "digital:Diode_DO-27_Horizontal_RM12" H 1400 3100 50  0001 C CNN
F 3 "" H 1400 3100 50  0000 C CNN
	1    1400 3100
	0    1    1    0   
$EndComp
$Comp
L D_Schottky D7
U 1 1 58B82D99
P 1800 3100
F 0 "D7" H 1800 3200 50  0000 C CNN
F 1 "SR5100" H 1800 3000 50  0000 C CNN
F 2 "digital:Diode_DO-27_Horizontal_RM12" H 1800 3100 50  0001 C CNN
F 3 "" H 1800 3100 50  0000 C CNN
	1    1800 3100
	0    1    1    0   
$EndComp
Wire Wire Line
	1400 3325 1800 3325
Wire Wire Line
	1400 3325 1400 3250
Wire Wire Line
	1800 3325 1800 3250
Connection ~ 1625 3325
Wire Wire Line
	1800 2875 1800 2950
Connection ~ 1800 2925
Wire Wire Line
	1400 2875 1400 2950
Connection ~ 1400 2925
Wire Wire Line
	1800 2525 1800 2575
Wire Wire Line
	1400 2525 1800 2525
Wire Wire Line
	1400 2575 1400 2525
Connection ~ 1625 2525
NoConn ~ 4150 2225
NoConn ~ 4150 2325
NoConn ~ 4150 2425
$Comp
L PWR_FLAG #FLG060
U 1 1 58B8AAEC
P 3425 2000
F 0 "#FLG060" H 3425 2095 50  0001 C CNN
F 1 "PWR_FLAG" H 3425 2180 50  0000 C CNN
F 2 "" H 3425 2000 50  0000 C CNN
F 3 "" H 3425 2000 50  0000 C CNN
	1    3425 2000
	1    0    0    -1  
$EndComp
Wire Wire Line
	3425 2000 3425 2025
Connection ~ 3425 2025
$Comp
L GND #PWR061
U 1 1 58B8C169
P 9375 5675
F 0 "#PWR061" H 9375 5425 50  0001 C CNN
F 1 "GND" H 9375 5525 50  0000 C CNN
F 2 "" H 9375 5675 50  0000 C CNN
F 3 "" H 9375 5675 50  0000 C CNN
	1    9375 5675
	1    0    0    -1  
$EndComp
Text Label 6675 2425 2    60   ~ 0
+5V_PWR
Text Label 7975 1950 0    60   ~ 0
+5V_PWR
Text Label 10325 1950 2    60   ~ 0
+3V3_PWR
Text Label 1675 5025 2    60   ~ 0
+5V_PWR
Text Label 1675 5150 2    60   ~ 0
+3V3_PWR
$Comp
L GND #PWR062
U 1 1 58B8D5B6
P 4025 6075
F 0 "#PWR062" H 4025 5825 50  0001 C CNN
F 1 "GND" H 4025 5925 50  0000 C CNN
F 2 "" H 4025 6075 50  0000 C CNN
F 3 "" H 4025 6075 50  0000 C CNN
	1    4025 6075
	1    0    0    -1  
$EndComp
$Comp
L GND #PWR063
U 1 1 58B8D634
P 4750 6100
F 0 "#PWR063" H 4750 5850 50  0001 C CNN
F 1 "GND" H 4750 5950 50  0000 C CNN
F 2 "" H 4750 6100 50  0000 C CNN
F 3 "" H 4750 6100 50  0000 C CNN
	1    4750 6100
	1    0    0    -1  
$EndComp
$Comp
L GND #PWR064
U 1 1 58B8D6AB
P 5700 6200
F 0 "#PWR064" H 5700 5950 50  0001 C CNN
F 1 "GND" H 5700 6050 50  0000 C CNN
F 2 "" H 5700 6200 50  0000 C CNN
F 3 "" H 5700 6200 50  0000 C CNN
	1    5700 6200
	1    0    0    -1  
$EndComp
$Comp
L GNDPWR #PWR065
U 1 1 58B8E122
P 725 7575
F 0 "#PWR065" H 725 7375 50  0001 C CNN
F 1 "GNDPWR" H 725 7445 50  0000 C CNN
F 2 "" H 725 7525 50  0000 C CNN
F 3 "" H 725 7525 50  0000 C CNN
	1    725  7575
	1    0    0    -1  
$EndComp
Wire Wire Line
	725  7575 725  7550
Wire Wire Line
	725  7550 875  7550
$Comp
L PWR_FLAG #FLG066
U 1 1 58B9A4C8
P 2050 3425
F 0 "#FLG066" H 2050 3520 50  0001 C CNN
F 1 "PWR_FLAG" H 2050 3605 50  0000 C CNN
F 2 "" H 2050 3425 50  0000 C CNN
F 3 "" H 2050 3425 50  0000 C CNN
	1    2050 3425
	1    0    0    -1  
$EndComp
$Comp
L PWR_FLAG #FLG067
U 1 1 58B9B6B2
P 6800 2400
F 0 "#FLG067" H 6800 2495 50  0001 C CNN
F 1 "PWR_FLAG" H 6800 2580 50  0000 C CNN
F 2 "" H 6800 2400 50  0000 C CNN
F 3 "" H 6800 2400 50  0000 C CNN
	1    6800 2400
	1    0    0    -1  
$EndComp
Wire Wire Line
	6800 2425 6800 2400
$Comp
L PWR_FLAG #FLG068
U 1 1 58BA0E3C
P 10000 5575
F 0 "#FLG068" H 10000 5670 50  0001 C CNN
F 1 "PWR_FLAG" H 10000 5755 50  0000 C CNN
F 2 "" H 10000 5575 50  0000 C CNN
F 3 "" H 10000 5575 50  0000 C CNN
	1    10000 5575
	1    0    0    -1  
$EndComp
Wire Wire Line
	10000 5600 10000 5575
$Comp
L C C22
U 1 1 58BA125E
P 9675 5350
F 0 "C22" H 9700 5450 50  0000 L CNN
F 1 "100n" H 9700 5250 50  0000 L CNN
F 2 "Capacitors_ThroughHole:C_Rect_L7_W2.5_P5" H 9713 5200 50  0001 C CNN
F 3 "" H 9675 5350 50  0000 C CNN
	1    9675 5350
	1    0    0    -1  
$EndComp
Wire Wire Line
	9675 5200 9675 5125
Connection ~ 9675 5125
Wire Wire Line
	9675 5500 9675 5600
Connection ~ 9675 5600
$Comp
L MCP1700 U2
U 1 1 58DC18B8
P 8950 1950
F 0 "U2" H 9050 1800 50  0000 C CNN
F 1 "MCP1700" H 8950 2100 50  0000 C CNN
F 2 "TO_SOT_Packages_THT:TO-92_Horizontal1_Inline_Narrow_Oval" H 8950 1950 50  0001 C CNN
F 3 "" H 8950 1950 50  0000 C CNN
	1    8950 1950
	1    0    0    -1  
$EndComp
$Comp
L CONN_01X02 S4
U 1 1 58E21803
P 2425 7300
F 0 "S4" V 2425 7550 50  0000 C CNN
F 1 "CONN_SOLDERABLE" V 2525 7300 50  0000 C CNN
F 2 "digital:CONN_SOLDERABLE" H 2425 7300 50  0001 C CNN
F 3 "" H 2425 7300 50  0000 C CNN
	1    2425 7300
	0    -1   -1   0   
$EndComp
Wire Wire Line
	2475 7500 2850 7500
Wire Wire Line
	2375 7500 1925 7500
Text Label 1925 7500 0    60   ~ 0
Vin_PWR
Text Label 3575 2025 0    60   ~ 0
Vin_PWR
Wire Wire Line
	4025 6050 4025 6075
Wire Wire Line
	4025 5575 4025 5650
Connection ~ 4025 5650
Text Label 1675 4775 2    60   ~ 0
Vin_PWR
Text Notes 3475 2475 1    60   ~ 0
move D after jumper
$EndSCHEMATC
