{
    "packageDirectories": [
        {
            "path": "force-app",
            "default": true,
            "package": "desafio1",
            "versionName": "ver 0.1",
            "versionNumber": "0.1.0.NEXT"
        },
        {
            "path": "force-app",
            "package": "desafio2",
            "versionName": "ver 0.1",
            "versionNumber": "0.1.0.NEXT",
            "default": false
        },
        {
            "path": "force-app",
            "package": "desafio3",
            "versionName": "ver 0.1",
            "versionNumber": "0.1.0.NEXT",
            "default": false
        },
        {
            "path": "force-app",
            "package": "desafio3.1",
            "versionName": "ver 0.1",
            "versionNumber": "0.1.0.NEXT",
            "default": false
        }
    ],
    "namespace": "",
    "sfdcLoginUrl": "https://login.salesforce.com",
    "sourceApiVersion": "51.0",
    "packageAliases": {
        "desafio1": "0Ho5Y000000blL5SAI",
        "desafio2": "0Ho5Y000000blLASAY",
        "desafio3": "0Ho5Y000000blLKSAY",
        "desafio3.1": "0Ho5Y000000blLPSAY"
    }
}