0.12843138 0.011764706 0.006862745 3
0.13039216 0.012745098 0.007843138 3
0.12941177 0.011764706 0.007843138 3
0.12941177 0.011764706 0.007843138 3
0.13137256 0.012745098 0.007843138 3
0.12843138 0.011764706 0.007843138 3
0.12941177 0.012745098 0.007843138 3
0.13137256 0.01372549 0.00882353 3
0.13137256 0.01372549 0.00882353 3
0.13137256 0.012745098 0.007843138 3
0.13039216 0.012745098 0.00882353 3
0.13137256 0.012745098 0.00882353 3
0.13137256 0.012745098 0.007843138 3
0.13137256 0.012745098 0.007843138 3
0.13039216 0.012745098 0.007843138 3
0.13137256 0.01372549 0.00882353 3
0.11764706 0.010784314 0.006862745 3
0.120588236 0.010784314 0.007843138 3
0.11862745 0.010784314 0.007843138 3
0.1254902 0.01372549 0.007843138 3
0.1264706 0.012745098 0.00882353 3
0.1264706 0.011764706 0.00882353 3
0.12352941 0.010784314 0.007843138 3
0.12156863 0.011764706 0.00882353 3
0.11764706 0.01372549 0.00882353 3
0.09411765 0.01372549 0.010784314 3
0.08529412 0.012745098 0.009803922 3
0.0882353 0.012745098 0.010784314 3
0.087254904 0.014705882 0.010784314 3
0.08921569 0.014705882 0.010784314 3
0.087254904 0.01372549 0.009803922 3
0.087254904 0.01372549 0.009803922 3
0.0882353 0.01372549 0.010784314 3
0.08921569 0.01372549 0.009803922 3
0.09019608 0.014705882 0.010784314 3
0.0882353 0.01372549 0.009803922 3
0.08529412 0.01372549 0.010784314 3
0.087254904 0.01372549 0.010784314 3
0.08921569 0.014705882 0.011764706 3
0.087254904 0.01372549 0.009803922 3
0.087254904 0.01372549 0.009803922 3
0.08921569 0.01372549 0.009803922 3
0.09117647 0.015686275 0.010784314 3
0.08921569 0.01372549 0.010784314 3
0.08921569 0.01372549 0.009803922 3
0.0882353 0.014705882 0.010784314 3
0.09019608 0.01372549 0.009803922 3
0.09117647 0.014705882 0.009803922 3
0.09117647 0.014705882 0.009803922 3
0.09117647 0.014705882 0.010784314 3
0.087254904 0.01372549 0.009803922 3
0.09117647 0.014705882 0.010784314 3
0.09313726 0.014705882 0.010784314 3
0.09313726 0.015686275 0.011764706 3
0.09313726 0.014705882 0.010784314 3
0.092156865 0.014705882 0.010784314 3
0.09117647 0.01372549 0.009803922 3
0.092156865 0.014705882 0.010784314 3
0.092156865 0.01372549 0.009803922 3
0.09411765 0.014705882 0.010784314 3
0.09313726 0.01372549 0.011764706 3
0.09607843 0.01372549 0.009803922 3
0.12156863 0.01372549 0.009803922 3
0.12941177 0.01372549 0.00882353 3
0.13235295 0.01372549 0.007843138 3
0.12745099 0.012745098 0.009803922 3
0.1264706 0.012745098 0.007843138 3
0.1264706 0.012745098 0.007843138 3
0.13039216 0.012745098 0.007843138 3
0.1264706 0.011764706 0.007843138 3
0.12745099 0.011764706 0.007843138 3
0.124509804 0.010784314 0.006862745 3
0.124509804 0.011764706 0.007843138 3
0.13039216 0.01372549 0.00882353 3
0.13137256 0.011764706 0.00882353 3
0.13039216 0.011764706 0.007843138 3
0.12745099 0.012745098 0.007843138 3
0.12941177 0.012745098 0.007843138 3
0.13039216 0.011764706 0.007843138 3
0.13039216 0.012745098 0.00882353 3
0.13039216 0.01372549 0.007843138 3
0.12941177 0.012745098 0.00882353 3
0.13039216 0.01372549 0.00882353 3
0.13137256 0.01372549 0.00882353 3
0.011764706 0.014705882 0.009803922 2
0.011764706 0.01372549 0.009803922 2
0.011764706 0.01372549 0.00882353 2
0.010784314 0.012745098 0.007843138 2
0.011764706 0.01372549 0.009803922 2
0.011764706 0.01372549 0.00882353 2
0.010784314 0.012745098 0.00882353 2
0.011764706 0.012745098 0.00882353 2
0.010784314 0.012745098 0.007843138 2
0.011764706 0.012745098 0.009803922 2
0.010784314 0.012745098 0.00882353 2
0.012745098 0.01372549 0.009803922 2
0.010784314 0.012745098 0.00882353 2
0.011764706 0.01372549 0.009803922 2
0.009803922 0.011764706 0.00882353 2
0.00882353 0.009803922 0.007843138 2
0.009803922 0.011764706 0.00882353 2
0.010784314 0.011764706 0.00882353 2
0.010784314 0.011764706 0.00882353 2
0.010784314 0.012745098 0.009803922 2
0.011764706 0.01764706 0.006862745 2
0.006862745 0.009803922 0.005882353 2
0.00882353 0.012745098 0.005882353 2
0.014705882 0.014705882 0.009803922 2
0.00882353 0.01372549 0.004901961 2
0.010784314 0.012745098 0.00882353 2
0.010784314 0.012745098 0.009803922 2
0.011764706 0.016666668 0.00882353 2
0.01372549 0.01372549 0.011764706 2
0.015686275 0.014705882 0.010784314 2
0.01372549 0.014705882 0.00882353 2
0.010784314 0.01372549 0.00882353 2
0.009803922 0.012745098 0.00882353 2
0.00882353 0.010784314 0.006862745 2
0.010784314 0.011764706 0.00882353 2
0.010784314 0.010784314 0.007843138 2
0.011764706 0.014705882 0.007843138 2
0.010784314 0.012745098 0.007843138 2
0.00882353 0.012745098 0.006862745 2
0.007843138 0.010784314 0.005882353 2
0.007843138 0.010784314 0.005882353 2
0.00882353 0.009803922 0.005882353 2
0.00882353 0.015686275 0.006862745 2
0.012745098 0.015686275 0.011764706 2
0.006862745 0.006862745 0.007843138 2
0.006862745 0.007843138 0.007843138 2
0.006862745 0.007843138 0.00882353 2
0.006862745 0.006862745 0.007843138 2
0.005882353 0.006862745 0.006862745 2
0.006862745 0.007843138 0.00882353 2
0.007843138 0.00882353 0.00882353 2
0.006862745 0.00882353 0.00882353 2
0.007843138 0.007843138 0.00882353 2
0.007843138 0.00882353 0.00882353 2
0.15294118 0.14117648 0.10490196 1
0.14509805 0.13431373 0.1 1
0.15 0.1382353 0.10294118 1
0.1509804 0.1392157 0.10392157 1
0.15 0.1392157 0.10294118 1
0.14901961 0.1382353 0.10294118 1
0.15294118 0.14117648 0.10392157 1
0.15294118 0.14117648 0.10490196 1
0.15196079 0.14019608 0.10392157 1
0.15 0.1382353 0.101960786 1
0.15196079 0.1392157 0.10294118 1
0.15196079 0.1382353 0.101960786 1
0.1509804 0.13725491 0.1 1
0.14901961 0.13529412 0.09901961 1
0.1509804 0.13725491 0.10098039 1
0.14901961 0.13627452 0.1 1
0.15196079 0.14019608 0.101960786 1
0.15294118 0.14117648 0.10392157 1
0.15294118 0.14117648 0.10392157 1
0.14803922 0.13627452 0.1 1
0.15196079 0.14019608 0.10294118 1
0.14901961 0.13725491 0.101960786 1
0.15 0.1382353 0.10294118 1
0.14803922 0.13725491 0.101960786 1
0.15 0.1392157 0.10294118 1
0.1509804 0.1392157 0.10294118 1
0.15196079 0.14019608 0.10392157 1
0.15196079 0.14019608 0.10392157 1
0.15196079 0.14019608 0.10392157 1
0.1509804 0.1392157 0.10294118 1
0.15 0.1382353 0.101960786 1
0.1509804 0.13725491 0.1 1
0.14705883 0.13333334 0.097058825 1
0.14607844 0.13333334 0.097058825 1
0.14901961 0.13529412 0.1 1
0.14803922 0.13529412 0.09901961 1
0.14803922 0.13235295 0.09509804 1
0.14803922 0.13137256 0.09411765 1
0.14803922 0.13137256 0.09411765 1
0.14803922 0.13333334 0.09509804 1
0.14803922 0.13333334 0.09607843 1
0.14509805 0.12941177 0.092156865 1
0.14901961 0.13333334 0.09607843 1
0.14411765 0.12843138 0.092156865 1
0.14803922 0.13235295 0.09509804 1
0.14117648 0.1254902 0.09019608 1
0.14411765 0.12745099 0.092156865 1
0.14803922 0.13137256 0.09411765 1
0.14901961 0.13333334 0.09509804 1
0.14803922 0.13235295 0.09411765 1
0.14901961 0.13333334 0.09607843 1
0.15 0.13431373 0.09509804 1
0.003921569 0.029411765 0.025490196 4
0.003921569 0.028431373 0.026470589 4
0.003921569 0.028431373 0.026470589 4
0.003921569 0.028431373 0.025490196 4
0.003921569 0.028431373 0.026470589 4
0.003921569 0.028431373 0.026470589 4
0.003921569 0.029411765 0.025490196 4
0.003921569 0.028431373 0.026470589 4
0.003921569 0.028431373 0.025490196 4
0.003921569 0.029411765 0.026470589 4
0.003921569 0.030392157 0.02745098 4
0.004901961 0.030392157 0.02745098 4
0.003921569 0.032352943 0.028431373 4
0.004901961 0.03627451 0.03137255 4
0.005882353 0.04117647 0.03529412 4
0.006862745 0.043137256 0.03627451 4
0.007843138 0.046078432 0.04019608 4
0.00882353 0.04901961 0.04117647 4
0.007843138 0.04901961 0.04117647 4
0.00882353 0.05 0.042156864 4
0.007843138 0.051960785 0.04411765 4
0.00882353 0.052941177 0.04509804 4
0.00882353 0.055882353 0.047058824 4
0.00882353 0.056862745 0.047058824 4
0.00882353 0.05882353 0.04901961 4
0.00882353 0.056862745 0.048039217 4
0.009803922 0.056862745 0.048039217 4
0.010784314 0.0627451 0.051960785 4
0.009803922 0.05980392 0.04901961 4
0.010784314 0.060784314 0.05 4
0.009803922 0.05980392 0.04901961 4
0.00882353 0.05392157 0.04509804 4
0.010784314 0.06666667 0.05392157 4
0.011764706 0.06960785 0.056862745 4
0.011764706 0.06960785 0.055882353 4
0.011764706 0.06960785 0.057843138 4
0.011764706 0.07156863 0.057843138 4
0.012745098 0.07647059 0.061764706 4
0.01372549 0.07745098 0.0627451 4
0.014705882 0.08039216 0.064705886 4
0.012745098 0.0754902 0.061764706 4
0.012745098 0.0754902 0.061764706 4
0.012745098 0.07450981 0.061764706 4
0.01372549 0.078431375 0.063725494 4
0.014705882 0.08039216 0.064705886 4
0.014705882 0.08039216 0.064705886 4
0.01372549 0.07647059 0.061764706 4
0.01372549 0.07450981 0.060784314 4
0.01372549 0.07450981 0.060784314 4
0.012745098 0.07647059 0.061764706 4
0.012745098 0.07647059 0.061764706 4
0.011764706 0.0754902 0.060784314 4
0.011764706 0.07647059 0.0627451 4
0.012745098 0.07745098 0.0627451 4
0.012745098 0.07745098 0.063725494 4
0.01372549 0.078431375 0.0627451 4
0.012745098 0.07647059 0.061764706 4
0.012745098 0.07745098 0.063725494 4
0.014705882 0.08039216 0.06568628 4
0.014705882 0.07941177 0.064705886 4
0.012745098 0.07941177 0.064705886 4
0.014705882 0.07941177 0.064705886 4
0.014705882 0.08039216 0.06568628 4
0.01372549 0.08039216 0.06568628 4
0.01372549 0.023529412 0.043137256 5
0.01372549 0.02254902 0.043137256 5
0.01372549 0.023529412 0.04411765 5
0.012745098 0.021568628 0.042156864 5
0.012745098 0.021568628 0.042156864 5
0.012745098 0.02254902 0.042156864 5
0.012745098 0.021568628 0.04117647 5
0.012745098 0.02254902 0.042156864 5
0.01372549 0.02254902 0.04509804 5
0.012745098 0.02254902 0.04509804 5
0.01372549 0.024509804 0.046078432 5
0.01372549 0.023529412 0.04509804 5
0.014705882 0.024509804 0.04901961 5
0.014705882 0.024509804 0.05 5
0.012745098 0.02254902 0.047058824 5
0.01372549 0.030392157 0.048039217 5
0.014705882 0.034313727 0.055882353 5
0.01372549 0.033333335 0.056862745 5
0.015686275 0.03529412 0.057843138 5
0.016666668 0.03529412 0.056862745 5
0.014705882 0.034313727 0.057843138 5
0.014705882 0.034313727 0.056862745 5
0.015686275 0.03529412 0.057843138 5
0.016666668 0.03627451 0.05980392 5
0.015686275 0.037254903 0.05980392 5
0.016666668 0.03627451 0.05980392 5
0.015686275 0.03627451 0.05980392 5
0.016666668 0.03627451 0.05980392 5
0.016666668 0.037254903 0.060784314 5
0.016666668 0.03627451 0.05980392 5
0.015686275 0.03529412 0.05882353 5
0.016666668 0.037254903 0.05980392 5
0.016666668 0.03627451 0.057843138 5
0.016666668 0.037254903 0.05882353 5
0.016666668 0.032352943 0.04901961 5
0.014705882 0.025490196 0.050980393 5
0.015686275 0.025490196 0.04901961 5
0.014705882 0.025490196 0.05 5
0.015686275 0.025490196 0.05 5
0.014705882 0.025490196 0.048039217 5
0.015686275 0.02745098 0.05 5
0.014705882 0.025490196 0.04509804 5
0.014705882 0.024509804 0.04509804 5
0.01372549 0.023529412 0.043137256 5
0.10098039 0.051960785 0.015686275 6
0.10098039 0.050980393 0.015686275 6
0.10098039 0.050980393 0.015686275 6
0.101960786 0.052941177 0.015686275 6
0.101960786 0.052941177 0.016666668 6
0.10098039 0.051960785 0.015686275 6
0.097058825 0.04901961 0.014705882 6
0.097058825 0.04901961 0.014705882 6
0.09607843 0.05 0.015686275 6
0.097058825 0.04901961 0.014705882 6
0.097058825 0.05 0.014705882 6
0.09803922 0.05 0.015686275 6
0.09607843 0.04901961 0.01372549 6
0.09803922 0.05 0.015686275 6
0.09509804 0.048039217 0.01372549 6
0.09411765 0.048039217 0.014705882 6
0.09803922 0.04901961 0.015686275 6
0.097058825 0.04901961 0.015686275 6
0.097058825 0.048039217 0.015686275 6
0.09607843 0.04901961 0.014705882 6
0.09509804 0.047058824 0.014705882 6
0.09509804 0.047058824 0.014705882 6
0.09313726 0.046078432 0.014705882 6
0.09411765 0.046078432 0.014705882 6
0.09607843 0.04901961 0.014705882 6
0.09313726 0.046078432 0.014705882 6
0.097058825 0.048039217 0.014705882 6
0.09901961 0.05 0.015686275 6
0.09803922 0.05 0.014705882 6
0.1 0.050980393 0.015686275 6
0.09901961 0.05 0.014705882 6
0.09803922 0.04901961 0.015686275 6
0.09901961 0.05 0.014705882 6
0.1 0.050980393 0.015686275 6
0.097058825 0.04901961 0.01372549 6
0.09803922 0.04901961 0.014705882 6
0.09803922 0.04901961 0.015686275 6
0.10098039 0.05 0.015686275 6
0.1 0.050980393 0.015686275 6
0.101960786 0.051960785 0.015686275 6
0.1 0.05 0.014705882 6
0.10098039 0.050980393 0.015686275 6
0.0 0.0 0.0 7
0.0 0.0 0.0 7
0.0 0.0 0.0 7
0.0 0.0 0.0 7
0.0 0.0 0.0 7
9.803922E-4 9.803922E-4 0.0 7
0.0 0.0 0.0 7
9.803922E-4 9.803922E-4 0.0 7
0.0 0.0 0.0 7
0.0 0.0 0.0 7
0.0 0.0 0.0 7
0.0 0.0 0.0 7
0.0 0.0 0.0 7
0.0 9.803922E-4 0.0 7
0.0 0.0 0.0 7
0.0 9.803922E-4 0.0 7
0.0 0.0 0.0 7
0.0 0.0 0.0 7
0.0 9.803922E-4 0.0 7
0.0 9.803922E-4 0.0 7
0.0 0.0 0.0 7
0.0 0.0 0.0 7
0.0 0.0 0.0 7
0.0 0.0 0.0 7
0.0 0.0 0.0 7
0.0 0.0 0.0 7
0.0 0.0 0.0 7
0.0 0.0 0.0 7
0.0 0.0 0.0 7
0.0 0.0 0.0 7
0.0 0.0 0.0 7
0.0 0.0 0.0 7
0.0 0.0 0.0 7
0.0 0.0 0.0 7
0.0 0.0 0.0 7
0.0 0.0 0.0 7
0.0 9.803922E-4 0.0 7
0.0 0.0 0.0 7
0.0 0.0 0.0 7
0.0 0.0 0.0 7
0.0 0.0 0.0 7
0.0 0.0 0.0 7
0.0 0.0 0.0 7
0.0 0.0 0.0 7
0.0 0.0 0.0 7
0.0 0.0 0.0 7
0.0 0.0 0.0 7
0.01372549 0.03137255 0.04901961 5
0.012745098 0.030392157 0.047058824 5
0.012745098 0.030392157 0.047058824 5
0.012745098 0.030392157 0.047058824 5
0.014705882 0.03137255 0.04901961 5
0.01372549 0.032352943 0.04901961 5
0.012745098 0.030392157 0.047058824 5
0.012745098 0.030392157 0.048039217 5
0.01372549 0.032352943 0.04901961 5
0.014705882 0.033333335 0.05 5
0.014705882 0.033333335 0.050980393 5
0.01372549 0.03137255 0.04901961 5
0.01372549 0.032352943 0.04901961 5
0.012745098 0.03137255 0.048039217 5
0.012745098 0.029411765 0.046078432 5
0.01372549 0.030392157 0.047058824 5
0.01372549 0.030392157 0.047058824 5
0.012745098 0.029411765 0.046078432 5
0.011764706 0.029411765 0.046078432 5
0.012745098 0.030392157 0.04509804 5
0.014705882 0.03137255 0.046078432 5
0.012745098 0.030392157 0.046078432 5
0.01372549 0.03137255 0.05 5
0.01372549 0.032352943 0.04901961 5
0.012745098 0.029411765 0.04509804 5
0.012745098 0.029411765 0.046078432 5
0.012745098 0.030392157 0.046078432 5
0.012745098 0.028431373 0.04509804 5
0.012745098 0.02745098 0.043137256 5
0.009803922 0.020588236 0.033333335 5
0.007843138 0.019607844 0.032352943 5
0.011764706 0.02745098 0.04117647 5
0.009803922 0.024509804 0.037254903 5
0.01372549 0.028431373 0.043137256 5
0.010784314 0.024509804 0.037254903 5
0.009803922 0.023529412 0.03627451 5
0.012745098 0.028431373 0.043137256 5
0.011764706 0.026470589 0.04117647 5
0.012745098 0.030392157 0.047058824 5
0.01372549 0.03137255 0.048039217 5
0.014705882 0.032352943 0.04901961 5
0.014705882 0.032352943 0.05 5