{
  "ReRoutes": [
    {
      "DownstreamPathTemplate": "/api/films/{id}",
      "DownstreamScheme": "http",
      "DownstreamHostAndPorts": [
        {
          "Host": "films.api",
          "Port": 80
        }
      ],
      "UpstreamPathTemplate": "/films/{id}",
      "UpstreamHttpMethod": [ "Get" ],
      "RateLimitOptions": {
        "EnableRateLimiting": true,
        "Period": "1s",
        "PeriodTimespan": 1,
        "Limit": 1
      },
      "FileCacheOptions": {
        "TtlSeconds": 15,
        "Region": "local"
      },
      "QoSOptions": {
        "ExceptionsAllowedBeforeBreaking": 3,
        "DurationOfBreak": 5,
        "TimeoutValue": 5000
      }
    },
    {
      "DownstreamPathTemplate": "/api/films",
      "DownstreamScheme": "http",
      "DownstreamHostAndPorts": [
        {
          "Host": "films.api",
          "Port": 80
        }
      ],
      "UpstreamPathTemplate": "/films",
      "UpstreamHttpMethod": [ "Get" ],
      "RateLimitOptions": {
        "EnableRateLimiting": true,
        "Period": "1s",
        "PeriodTimespan": 1,
        "Limit": 1
      },
      "FileCacheOptions": {
        "TtlSeconds": 15,
        "Region": "local"
      },
      "QoSOptions": {
        "ExceptionsAllowedBeforeBreaking": 3,
        "DurationOfBreak": 5,
        "TimeoutValue": 5000
      }
    },
    {
      "DownstreamPathTemplate": "/api/people/{id}",
      "DownstreamScheme": "http",
      "DownstreamHostAndPorts": [
        {
          "Host": "people.api",
          "Port": 80
        }
      ],
      "UpstreamPathTemplate": "/people/{id}",
      "UpstreamHttpMethod": [ "Get" ],
      "RateLimitOptions": {
        "EnableRateLimiting": true,
        "Period": "1s",
        "PeriodTimespan": 1,
        "Limit": 1
      },
      "FileCacheOptions": {
        "TtlSeconds": 15,
        "Region": "local"
      },
      "QoSOptions": {
        "ExceptionsAllowedBeforeBreaking": 3,
        "DurationOfBreak": 5,
        "TimeoutValue": 5000
      }
    },
    {
      "DownstreamPathTemplate": "/api/people",
      "DownstreamScheme": "http",
      "DownstreamHostAndPorts": [
        {
          "Host": "people.api",
          "Port": 80
        }
      ],
      "UpstreamPathTemplate": "/people",
      "UpstreamHttpMethod": [ "Get" ],
      "RateLimitOptions": {
        "EnableRateLimiting": true,
        "Period": "1s",
        "PeriodTimespan": 1,
        "Limit": 1
      },
      "FileCacheOptions": {
        "TtlSeconds": 15,
        "Region": "local"
      },
      "QoSOptions": {
        "ExceptionsAllowedBeforeBreaking": 3,
        "DurationOfBreak": 5,
        "TimeoutValue": 5000
      }
    }
  ]
}
