%YAML 1.1
%TAG !u! tag:unity3d.com,2011:
--- !u!114 &11400000
MonoBehaviour:
  m_ObjectHideFlags: 0
  m_CorrespondingSourceObject: {fileID: 0}
  m_PrefabInstance: {fileID: 0}
  m_PrefabAsset: {fileID: 0}
  m_GameObject: {fileID: 0}
  m_Enabled: 1
  m_EditorHideFlags: 0
  m_Script: {fileID: 11500000, guid: 9c059e314db74fc47aaa3dc4e45107fd, type: 3}
  m_Name: DesignPatternTypeDesc
  m_EditorClassIdentifier: 
  _designPatternsTypeDesc:
  - _title: Creacionales
    _description: Proveeen diferentes formas de crear objetos
  - _title: Estructurales
    _description: Describen formas de componer objetos para formar nuevas estructuras
      flexibles y eficientes
  - _title: Comportamiento
    _description: Gestionan algoritmos y responsabilidades entre objetos
