{
    "AWSTemplateFormatVersion": "2010-09-09",
    "Description": "Monolitico App",
    "Metadata": {
    },
    "Parameters": {
        "KeyPairName": {
            "Type": "AWS::EC2::KeyPair::KeyName",
            "Description": "Archivo para conexion a EC2",
            "ConstraintDescription": "Debe existir previamente un archivo keypair"
        },
        "userMasterBD": {
            "Type": "String",
            "Description": "Usuario ROOT BD",
            "NoEcho": true,
            "Default": "root"
        },
        "passwordMasterBD": {
            "Type": "String",
            "Description": "Password ROOT BD",
            "NoEcho": true
        },
        "emailRemitente": {
            "Type": "String",
            "Description": "email ses que enviará correos"
        },
        "emailDestinatario": {
            "Type": "String",
            "Description": "email ses que recibirá correos de la notificacion"
        },
        "tipoDeInstancia" : {
            "Type" : "String",
            "Default" : "t2.micro"
        },
        "capacidadDeseadaMonolitico": {
            "Type": "String",
            "Description": "cantidad de EC2 a crear para el grupo auto scaling",
            "Default": "1"
        },
        "capacidadMinimaMonolitico": {
            "Type": "String",
            "Description": "cantidad minima de EC2 a crear para el grupo auto scaling",
            "Default": "1"
        },
        "capacidadMaximaMonolitico": {
            "Type": "String",
            "Description": "cantidad maxima de EC2 a crear para el grupo auto scaling",
            "Default": "10"
        }
    },
    "Mappings": {
        "AWSRegionToAMI": {
            "us-east-1": {
                "AMIID": "ami-0080e4c5bc078760e"
            }
        }
    },
    "Conditions": {},
    "Resources": {
        "monoliticoTargetGroup": {
            "Type": "AWS::ElasticLoadBalancingV2::TargetGroup",
            "Properties": {
                "HealthCheckIntervalSeconds": 30,
                "HealthCheckProtocol": "HTTP",
                "HealthCheckPath": "/status/verificar",
                "HealthCheckTimeoutSeconds": 10,
                "HealthyThresholdCount": 3,
                "Matcher": {
                    "HttpCode": "200-204"
                },
                "Name": "tgMonolitico",
                "Port": 8080,
                "Protocol": "HTTP",
                "TargetGroupAttributes": [
                    {
                        "Key": "deregistration_delay.timeout_seconds",
                        "Value": "20"
                    }
                ],
                "Targets": [],
                "UnhealthyThresholdCount": 3,
                "VpcId": {
                    "Fn::ImportValue": "infraestructura-idVPC"
                },
                "Tags": [
                    {
                        "Key": "Name",
                        "Value": "monolitico"
                    }
                ]
            }
        },
        "launchConfiguration": {
            "Type": "AWS::AutoScaling::LaunchConfiguration",
            "Properties": {
                "KeyName": {
                    "Ref": "KeyPairName"
                },
                "IamInstanceProfile": { "Ref": "instanceProfileMonolito" },
                "ImageId": {
                    "Fn::FindInMap": [
                        "AWSRegionToAMI",
                        {
                            "Ref": "AWS::Region"
                        },
                        "AMIID"
                    ]
                },
                "UserData": { "Fn::Base64" :
                    { "Fn::Join" : [
                        "", [
                            "#!/bin/bash -xe \n",
                            "yum update -y \n",
                            "yum install java-1.8.0 -y \n",
                            "yum remove java-1.7.0-openjdk -y \n",
                            "echo 'export host=",{"Fn::ImportValue": "basedatos-endpointRDS"},"' >> ~/.bash_profile \n",
                            "echo 'export username=",{"Ref": "userMasterBD"},"' >> ~/.bash_profile \n",
                            "echo 'export password=",{"Ref": "passwordMasterBD"},"' >> ~/.bash_profile \n",
                            "echo 'export clientId=",{"Fn::ImportValue": "cognito-client-angular"},"' >> ~/.bash_profile \n",
                            "echo 'export userPoolId=",{"Fn::ImportValue": "cognito-pool-id"},"' >> ~/.bash_profile \n",
                            "echo 'export nameQueue=",{"Fn::ImportValue": "infraestructura-myqueue"},"' >> ~/.bash_profile \n",
                            "echo 'export aws_Region=",{ "Ref": "AWS::Region" },"' >> ~/.bash_profile \n",
                            "source ~/.bash_profile \n", 
                            "wget https://gitlab.com/luisgust.123/tarea/raw/master/app-aws.jar \n",
                            "nohup java -Djava.security.egd=file:/dev/./urandom -jar app-aws.jar | tee output.log & "
                            ]
                        ]
                    }
                  },
                "SecurityGroups": [
                    { "Fn::ImportValue": "infraestructura-sgMonolito" }
                ],
                "InstanceType": { "Ref": "tipoDeInstancia" }
            }
        },
        "autoScalingMonolito": {
            "Type": "AWS::AutoScaling::AutoScalingGroup",
            "Properties": {
                "VPCZoneIdentifier": [
                    {
                       "Fn::ImportValue" : "infraestructura-subnetPublica1"
                    },
                    {
                        "Fn::ImportValue" : "infraestructura-subnetPublica2"
                    }
                ],
                "LaunchConfigurationName": {
                    "Ref": "launchConfiguration"
                },
                "MinSize": { "Ref" : "capacidadMinimaMonolitico" },
                "DesiredCapacity": { "Ref" : "capacidadDeseadaMonolitico" },
                "MaxSize": { "Ref" : "capacidadMaximaMonolitico" },
                "TargetGroupARNs": [
                    {
                        "Ref": "monoliticoTargetGroup"
                    }
                ],
                "MetricsCollection": [
                    {
                        "Granularity": "1Minute",
                        "Metrics": [
                            "GroupMinSize",
                            "GroupMaxSize"
                        ]
                    }
                ],
                "Tags": [
                    {
                        "Key" : "Name",
                        "Value" : "cfn-monolito",
                        "PropagateAtLaunch" : true
                     }
                ]
            }
        },
        "roleMonolito": {
            "Type": "AWS::IAM::Role",
            "Properties": {
                "AssumeRolePolicyDocument": {
                    "Version": "2012-10-17",
                    "Statement": [
                        {
                            "Effect": "Allow",
                            "Principal": {
                                "Service": [
                                    "ec2.amazonaws.com"
                                ]
                            },
                            "Action": [
                                "sts:AssumeRole"
                            ]
                        }
                    ]
                },
                "Path": "/"
            }
        },
        "policyMonolito": {
            "Type": "AWS::IAM::Policy",
            "Properties": {
                "PolicyName": "policyMonolito",
                "PolicyDocument": {
                    "Version": "2012-10-17",
                    "Statement": [
                        {
                            "Effect": "Allow",
                            "Action": [
                                "cognito-idp:AdminInitiateAuth",
                                "cognito-idp:ConfirmForgotPassword",
                                "cognito-idp:GlobalSignOut",
                                "cognito-idp:AdminRespondToAuthChallenge",
                                "cognito-idp:InitiateAuth",
                                "cognito-idp:AdminGetUser"
                            ],
                            "Resource": { 
                                "Fn::Sub" : "arn:aws:cognito-idp:${AWS::Region}:*:userpool/*"
                            }
                        },
                        {
                            "Effect": "Allow",
                            "Action": [
                                "sns:Publish",
                                "sns:ListTopics"
                            ],
                            "Resource": "*"
                        },
                        {
                            "Effect": "Allow",
                            "Action": [
                                "sqs:DeleteMessage",
                                "sqs:ListQueues",
                                "sqs:GetQueueUrl",
                                "sqs:SendMessage",
                                "sqs:receiveMessage",
                                "ses:SendEmail"
                            ],
                            "Resource": "*"
                        }
                    ]
                },
                "Roles": [
                    {
                        "Ref": "roleMonolito"
                    }
                ]
            }
        },
        "instanceProfileMonolito": {
            "Type": "AWS::IAM::InstanceProfile",
            "Properties": {
                "Path": "/",
                "Roles": [
                    {
                        "Ref": "roleMonolito"
                    }
                ]
            }
        },
        "monoliticoAlbListenerRule": {
            "Type": "AWS::ElasticLoadBalancingV2::ListenerRule",
            "Properties": {
                "Actions": [
                    {
                        "Type": "forward",
                        "TargetGroupArn": {
                            "Ref": "monoliticoTargetGroup"
                        }
                    }
                ],
                "Conditions": [
                    {
                        "Field": "path-pattern",
                        "Values": [
                            "/*"
                        ]
                    }
                ],
                "ListenerArn": { "Fn::ImportValue": "infraestructura-arnListenerHttpMyBalancer" },
                "Priority": 10
            }
        }
    },
    "Outputs": {
        "monoliticoTargetGroup": {
            "Description": "grupo de destino - monolitico",
            "Value": {
                "Ref": "monoliticoTargetGroup"
            }
        }
    }
}