<?xml version="1.0" standalone="no"?>
<!-- Generator: Adobe Fireworks 10, Export SVG Extension by Aaron Beall (http://fireworks.abeall.com) . Version: 0.6.1  -->
<!DOCTYPE svg PUBLIC "-//W3C//DTD SVG 1.1//EN" "http://www.w3.org/Graphics/SVG/1.1/DTD/svg11.dtd">
<svg id="communicative_event-P%E1gina%201" viewBox="0 0 207 118" style="background-color:#ffffff00" version="1.1"
	xmlns="http://www.w3.org/2000/svg" xmlns:xlink="http://www.w3.org/1999/xlink" xml:space="preserve"
	x="0px" y="0px" width="207px" height="118px"
>
	<g id="Capa%201">
		<rect x="1" y="1" width="205" height="116" stroke="#000000" stroke-width="2" fill="none" rx="11.6" ry="11.6"/>
		<path id="L%EDnea" d="M 1.5 27.5 L 206.5 27.5 " stroke="#000000" stroke-width="2" fill="none"/>
		<path id="L%EDnea2" d="M 1.5 91.5 L 206.5 91.5 " stroke="#000000" stroke-width="2" fill="none"/>
	</g>
</svg>