<svg width="141" height="126" viewBox="0 0 141 126" fill="#717171" xmlns="http://www.w3.org/2000/svg">
<path fill-rule="evenodd" clip-rule="evenodd" d="M38.5777 117.014C38.5421 118.294 38.4292 122.895 38.6918 123.836C39.3762 126.29 42.0571 125.937 43.5376 125.937L99.0535 125.939C101.367 125.936 103.68 125.935 105.993 125.937C107.752 125.939 111.163 126.248 112.476 125.477C114.223 124.45 113.855 122.39 113.855 119.942V29.7418C113.855 27.4767 114.258 25.0648 112.841 23.8451C111.528 22.7157 108.61 23.123 106.661 23.123C97.3634 23.1224 88.0663 23.123 78.7691 23.123C78.3536 23.0185 78.3611 22.4905 78.1265 21.7423L72.816 4.68153C72.0854 2.47049 71.9038 0.108943 69.2966 0.000722992C68.193 -0.0453015 47.0738 6.69168 44.1421 7.58791C35.7983 10.1385 27.4881 12.8235 19.176 15.2983C15.0322 16.5316 10.9033 17.8837 6.74946 19.1382C5.01443 19.6625 1.94865 20.3435 0.825653 21.3523C-0.905633 22.9078 0.531803 25.7085 1.14196 27.7037C6.20793 44.2694 11.5465 60.8195 16.6156 77.4636C19.1536 85.7959 21.7452 94.0025 24.3481 102.345C24.8821 104.056 28.6242 116.818 29.2736 117.663C31.4966 120.556 34.7614 117.661 38.5777 117.015V117.014Z" fill="#717171"/>
<path fill-rule="evenodd" clip-rule="evenodd" d="M12.4354 56.6268C14.4543 63.3519 16.5787 70.0702 18.6868 76.732L30.3815 114.31C31.4353 117.752 30.2711 117.115 38.8427 114.594C41.425 113.835 43.8269 113.016 46.3817 112.264C56.183 109.379 66.4734 106.029 76.3277 102.999C81.262 101.483 86.298 99.9028 91.3022 98.3703C92.2362 98.0842 98.3091 96.3788 98.5936 95.9204C98.9517 95.3433 96.9053 89.5834 96.5734 88.4869C95.0711 83.5175 93.5058 78.5244 91.9286 73.5563C85.6448 53.7683 79.6193 33.6407 73.3318 13.737L69.8293 2.59593C69.2834 1.67979 67.0767 2.78811 66.1571 3.07297L2.52687 22.777C1.72205 23.302 2.80699 25.6672 3.05343 26.4633C6.42117 37.3518 8.4201 43.2486 12.4354 56.6268Z" fill="white"/>
<path fill-rule="evenodd" clip-rule="evenodd" d="M85.3124 44.921C88.1841 44.9807 91.1045 44.9322 93.9813 44.9316C95.4493 44.931 96.9173 44.9322 98.3853 44.9322C99.5676 44.9322 101.5 44.7562 101.917 45.7924C102.767 47.9002 96.2865 47.2875 94.9152 47.2875C91.9755 47.2882 89.0314 47.3031 86.0922 47.2863L87.5877 52.1879C90.0801 52.209 92.5707 52.1854 95.0488 52.1854C96.654 52.1854 101.349 51.7619 101.897 52.9933C102.834 55.0955 97.2217 54.5613 95.9827 54.5613C93.5676 54.5613 90.782 54.6881 88.4137 54.5438C88.3906 55.3542 89.5972 58.3639 89.8075 59.4728C91.9187 59.41 94.1279 59.456 96.2491 59.4616C97.6853 59.4654 101.368 59.0692 101.9 60.305C102.708 62.1814 98.4471 61.8294 97.1837 61.8294C95.0225 61.8294 92.7847 61.886 90.6335 61.8201L92.1028 66.726C93.8652 66.764 95.6658 66.7397 97.4501 66.7397C98.7559 66.7397 101.482 66.4586 101.922 67.6092C102.215 68.3736 101.402 68.8463 100.779 69.0042C100.044 69.1902 93.8521 69.1056 92.8826 69.0932L94.3806 73.9879C96.0994 74.0862 101.504 73.4543 101.935 74.9047C102.58 77.0747 96.5947 76.2307 95.1504 76.3961L96.6234 81.2641C98.3398 81.2697 101.317 80.8449 101.974 82.291C101.917 84.0312 99.0416 83.6661 97.4102 83.6263L98.8913 88.5453C99.9818 88.5466 101.587 88.5037 101.925 89.4173C102.351 90.5667 100.664 90.9056 99.6574 90.9075C100.186 93.0806 102.547 97.1146 98.7578 98.361C96.0507 99.251 93.2214 100.106 90.5012 100.913C84.978 102.552 79.5545 104.296 73.8965 106.04L49.1425 113.692C47.7612 114.125 46.3775 114.551 44.965 114.986C43.9736 115.292 41.5367 115.927 40.8292 116.311C40.5741 117.202 40.634 122.862 40.9478 123.576C42.0358 123.966 78.7179 123.75 83.1712 123.75L109.729 123.751C112.02 123.762 111.663 123.773 111.663 120.473V30.2728C111.663 28.8728 112.04 26.2674 111.298 25.4091C110.879 25.1473 96.9965 25.3015 95.3152 25.3009C89.989 25.299 84.5837 25.2058 79.2669 25.3053C79.7635 27.6146 81.5753 32.467 82.294 35.1526C83.13 38.2779 84.4408 41.6918 85.3111 44.9204L85.3124 44.921Z" fill="white"/>
<path fill-rule="evenodd" clip-rule="evenodd" d="M136.896 66.8592C136.427 66.5576 134.21 66.3194 133.581 66.2255C132.539 66.07 131.172 65.7857 130.147 65.741C129.706 66.6341 128.077 78.6657 127.773 80.7263C127.405 83.2296 127.013 85.7324 126.619 88.2426C126.151 91.2292 125.977 93.2456 129.185 93.7643C132.952 94.3738 133.076 91.8169 133.431 89.5518C134.567 82.3147 135.989 73.9109 136.895 66.8586L136.896 66.8592Z" fill="#717171"/>
<path fill-rule="evenodd" clip-rule="evenodd" d="M56.6904 27.2556L47.3939 30.1191C44.2639 31.085 41.2124 32.0254 38.0337 33.0298C36.5757 33.4907 27.3035 36.226 26.4594 36.6639C24.0917 37.8929 25.3152 42.0363 28.4826 41.201L44.7698 36.1433C46.2335 35.5798 47.9292 35.2011 49.3604 34.7489C49.7834 34.6152 50.081 34.4765 50.4478 34.349C50.7916 34.2296 51.3157 34.1531 51.7075 34.0343C53.2665 33.5622 54.8849 33.069 56.3935 32.5808C58.0187 32.0546 59.7313 31.8257 59.9309 29.9903C60.1312 28.1475 58.5702 26.7288 56.6898 27.2556H56.6904Z" fill="#717171"/>
<path fill-rule="evenodd" clip-rule="evenodd" d="M73.0117 51.0894C71.5693 51.3824 50.0807 58.1641 47.8921 58.8302L29.0489 64.6505C28.0488 64.9739 26.7187 65.2407 26.1166 65.8539C24.973 67.0201 26.325 67.8585 27.8803 67.4797C30.2929 66.8926 37.4857 64.5267 40.4174 63.6236L71.7976 53.9218C72.784 53.6139 74.1434 53.3222 74.7012 52.6897C75.783 51.4614 74.335 50.8207 73.013 51.0894H73.0117Z" fill="#717171"/>
<path fill-rule="evenodd" clip-rule="evenodd" d="M70.7291 44.166C68.3558 44.7425 60.9871 47.1538 58.1603 48.0445L26.6858 57.7762C25.5984 58.1095 24.4392 58.3515 23.8552 59.0785C22.9025 60.2646 24.3942 60.8641 25.7331 60.5326C28.2804 59.902 35.2942 57.6057 38.2545 56.6728L69.7321 46.9461C70.8289 46.6096 71.9931 46.3546 72.5733 45.6462C73.6308 44.3538 71.9606 43.8674 70.7291 44.1666V44.166Z" fill="#717171"/>
<path fill-rule="evenodd" clip-rule="evenodd" d="M44.9317 69.3869C44.6802 68.3469 44.2416 69.3048 43.5972 68.9434C44.0981 68.6299 44.4612 68.5441 45.1388 68.8159L45.2186 69.7065C46.1102 69.5797 56.249 66.3704 57.8623 65.8361C60.2531 65.0444 75.6837 60.5097 76.4704 59.9158C77.6352 59.0369 77.4162 57.9131 75.7055 57.9641C74.6673 57.9952 61.5015 62.222 59.938 62.717C51.5317 65.3771 43.191 67.8419 34.8758 70.4622C33.444 70.9131 29.7812 71.8516 28.7374 72.463C27.66 73.0937 27.4946 74.5292 29.2534 74.5341C30.2435 74.5372 37.6147 72.0886 38.9099 71.6887C39.9811 71.3584 40.9924 71.022 42.073 70.729L43.186 70.3714C43.4811 70.2053 43.6452 69.9161 44.1481 69.7874C44.9978 69.5703 44.7844 69.7271 44.931 69.3875L44.9317 69.3869Z" fill="#717171"/>
<path fill-rule="evenodd" clip-rule="evenodd" d="M68.4119 37.3034C55.9885 40.8759 43.099 45.2625 30.6381 48.9439C28.4825 49.5807 26.4144 50.2574 24.3168 50.8937C23.1751 51.2401 22.0515 51.4727 21.5755 52.2943C20.7925 53.6477 22.7877 53.8374 23.7691 53.5283C31.99 50.9385 40.6427 48.3201 48.9292 45.7582C55.0689 43.8607 61.7207 41.9084 67.7756 39.9299C68.8131 39.591 70.1189 39.3783 70.5525 38.5672C71.3055 37.1585 69.4925 36.9918 68.4119 37.3028V37.3034Z" fill="#717171"/>
<path fill-rule="evenodd" clip-rule="evenodd" d="M130.182 65.0406L136.948 66.0196C137.292 65.2645 140.049 46.341 140.418 43.8346C140.805 41.2105 141.851 38.4043 139.59 37.1778C139.572 38.923 138.912 42.0514 138.62 43.9067L136.047 60.8002C135.879 61.9122 135.533 62.9664 134.179 62.8116C132.045 62.5671 133.063 59.3952 133.412 57.0355C133.743 54.7946 134.1 52.4959 134.452 50.2332C134.911 47.287 136.066 38.8086 136.61 36.5913C133.858 37.1256 134.055 39.6389 133.628 42.3929C133.241 44.8857 132.871 47.3965 132.487 49.8818C131.723 54.8251 130.711 60.1334 130.182 65.0419L130.182 65.0406Z" fill="#717171"/>
<path fill-rule="evenodd" clip-rule="evenodd" d="M99.7166 108.633C98.0346 109.704 96.5167 108.892 94.9108 109.098C93.2082 109.316 92.8726 110.785 90.7414 110.463C90.4999 110.163 90.4157 109.789 90.1474 109.44C88.8323 109.176 88.4168 109.955 87.6793 110.357C87.6587 109.026 87.9089 106.237 86.7229 105.872C85.0784 105.365 83.0694 109.023 83.707 111.026C83.8287 111.409 84.092 111.584 84.4557 111.26C84.9798 110.794 84.5992 110.488 84.4938 110.139C84.0839 108.774 86.6268 104.556 86.8302 108.38C86.9294 110.246 87.1079 110.88 86.2275 111.817C83.5086 114.711 84.1182 119.402 85.0397 119.38C85.827 119.037 86.839 115.562 87.096 114.547C87.2638 113.884 87.4772 111.969 87.6244 111.609C87.776 111.238 89.1361 110.328 89.7694 110.21C90.2441 111.781 89.4612 112.677 90.6447 112.478L90.8774 111.367C93.6992 110.885 91.6348 111.395 94.2401 110.353C96.0082 109.646 97.7139 110.351 100.083 109.397C100.931 109.055 100.811 108.809 101.853 108.903C102.939 109.001 105.267 109.217 106.128 108.922L106.161 108.33L102.208 108.174C102.293 107.854 105.027 105.498 103.35 103.684C101.678 101.875 93.1321 101.121 95.5628 105.857C96.6221 107.921 98.6204 108.05 99.716 108.632L99.7166 108.633Z" fill="#717171"/>
<path fill-rule="evenodd" clip-rule="evenodd" d="M137.548 36.1576C136.482 36.5389 136.556 37.7449 136.363 39.0037L133.099 60.3796C132.883 61.7342 133.308 63.0384 134.884 62.552C135.875 62.246 135.831 60.8746 136.023 59.645L139.291 38.3183C139.524 36.9071 138.994 35.6396 137.547 36.1576H137.548Z" fill="#717171"/>
<path fill-rule="evenodd" clip-rule="evenodd" d="M53.2952 72.4089C47.11 74.1765 39.6676 76.5437 33.3645 78.5339C32.307 78.8679 31.0206 79.126 30.3904 79.8319C29.2631 81.0951 30.907 81.7245 32.3076 81.3402L45.5559 77.2539C47.0725 76.7576 54.319 74.8041 55.1831 73.9445C56.3953 72.7392 54.8349 71.9692 53.2952 72.4089Z" fill="#717171"/>
<path fill-rule="evenodd" clip-rule="evenodd" d="M127.345 106.802C128.545 106.08 128.583 105.257 129.042 103.819C129.577 102.146 132.535 93.9799 132.668 93.0439C131.781 94.0042 131.213 94.5372 129.225 94.2374C128.108 94.0689 127.485 93.8611 126.828 93.0545C126.639 92.8219 126.713 92.8797 126.568 92.6514L126.236 92.2024C126.206 96.2264 126.477 99.835 126.488 103.71C126.491 104.913 126.39 106.217 127.345 106.802Z" fill="#717171"/>
<path fill-rule="evenodd" clip-rule="evenodd" d="M97.3426 103.146C95.2101 103.816 96.2127 105.755 97.3457 106.605C97.8966 107.018 98.5985 107.331 99.3159 107.571C100.311 107.904 100.838 108.23 101.589 107.568C106.156 103.547 99.1163 102.588 97.3426 103.145V103.146Z" fill="white"/>
</svg>
