<svg width="124" height="97" viewBox="0 0 124 97" fill="none" xmlns="http://www.w3.org/2000/svg">
<g clip-path="url(#clip0)">
<path fill-rule="evenodd" clip-rule="evenodd" d="M58.4814 31.2211C58.4814 39.6203 59.763 44.9538 64.2526 51.6628C64.7538 52.4119 65.3597 53.1738 65.9497 53.8487C68.0372 56.2374 69.4601 57.7384 72.0683 59.6221C73.4295 60.6052 75.4176 61.8867 77.0959 62.603C84.7962 65.8904 91.5555 66.6882 99.8807 64.6218C102.077 64.0767 103.721 63.3422 105.556 62.5314C106.431 62.145 107.146 61.6599 108.061 61.1531C112.059 58.937 117.347 53.7659 119.552 49.5884C123.185 42.7048 124 39.7881 124 31.2209C124 24.8396 120.551 16.5144 116.291 11.746C115.902 11.31 115.758 11.2336 115.366 10.7293C114.134 9.14166 111.761 7.18666 110.073 6.07255L104.994 3.14247C95.7691 -1.47788 83.6327 -0.617203 74.7473 4.52867C72.8685 5.61677 69.7293 8.0059 68.1185 9.54909C62.9141 14.5343 58.4814 23.842 58.4814 31.2211Z" fill="#717171"/>
<path fill-rule="evenodd" clip-rule="evenodd" d="M0 22.4828V89.4753C0 90.6495 0.767472 91.4172 1.94135 91.4172H50.4736V93.6017H30.09C27.7388 93.6017 27.7388 96.9997 30.09 96.9997H91.7259C93.5602 96.9997 93.5602 93.6017 91.7259 93.6017H70.129V91.4172H118.418C121.384 91.4172 120.602 87.1681 120.602 83.4071V52.338C120.384 52.5899 120.59 52.2899 120.296 52.7593L118.003 56.2918C115.399 59.7982 110.848 62.9302 107.013 64.9597C107.013 68.1962 107.013 71.4324 107.013 74.6689C107.013 77.6059 107.544 82.0179 106.528 84.1352C105.984 84.262 105.97 84.378 105.315 84.378H14.8022C14.0177 84.378 13.589 83.4969 13.589 82.679V29.2791C13.589 27.2617 15.2664 27.5706 17.2282 27.5791L56.0549 27.5798L57.368 22.3396C57.6494 21.6048 57.811 21.336 57.9963 20.5407H5.58149C3.13639 20.5404 0.000230127 20.0283 0.000230127 22.4825L0 22.4828Z" fill="#717171"/>
<path fill-rule="evenodd" clip-rule="evenodd" d="M81.5342 51.1248C82.9363 50.3827 104.559 33.6873 105.072 32.9203L81.5342 14.7158V51.1248Z" fill="#FEFEFE"/>
</g>
<defs>
<clipPath id="clip0">
<rect width="124" height="96.875" fill="white" transform="translate(0 0.125)"/>
</clipPath>
</defs>
</svg>
