<svg width="51" height="44" viewBox="0 0 51 44" fill="none" xmlns="http://www.w3.org/2000/svg">
<g clip-path="url(#clip0)">
<path fill-rule="evenodd" clip-rule="evenodd" d="M49.9673 0.0292631L41.927 2.15972C41.3177 2.32121 41.1137 3.07439 41.5597 3.5154L43.5728 5.50638L32.8717 16.0345L26.9958 10.2236L18.4117 18.7128L13.3773 13.7342L-0.000488281 26.964L1.97111 28.9138L13.3773 17.6338L18.4117 22.6124L26.9958 14.1232L32.8665 19.929L45.5444 7.45617L47.4455 9.33636C47.8916 9.77737 48.6531 9.57554 48.8162 8.97305L50.9706 1.02177C51.1338 0.419136 50.5764 -0.132083 49.9672 0.0294051L49.9673 0.0292631Z" fill="#717171"/>
<path fill-rule="evenodd" clip-rule="evenodd" d="M13.4375 27.9172H6.60642C5.81939 27.9172 5.17383 28.5691 5.17383 29.3474V42.6135C5.17383 43.3918 5.81939 44 6.60642 44H13.4375C14.2245 44 14.9149 43.3918 14.9149 42.6135V29.3474C14.9149 28.569 14.2245 27.9172 13.4375 27.9172Z" fill="#717171"/>
<path fill-rule="evenodd" clip-rule="evenodd" d="M29.3145 23.1005H22.4835C21.6964 23.1005 21.0234 23.7182 21.0234 24.4965V42.6135C21.0234 43.3918 21.6964 44 22.4835 44H29.3145C30.1016 44 30.7645 43.3918 30.7645 42.6135V24.4965C30.7645 23.7182 30.1016 23.1005 29.3145 23.1005Z" fill="#717171 "/>
<path fill-rule="evenodd" clip-rule="evenodd" d="M45.1921 17.9573H38.361C37.574 17.9573 36.8735 18.6119 36.8735 19.3903V42.6135C36.8735 43.3918 37.574 44 38.361 44H45.1921C45.9791 44 46.6146 43.3918 46.6146 42.6135V19.3903C46.6146 18.6119 45.9791 17.9573 45.1921 17.9573Z" fill="#717171 "/>
</g>
<defs>
<clipPath id="clip0">
<rect width="51" height="44" fill="white"/>
</clipPath>
</defs>
</svg>
