<svg width="140" height="43" viewBox="0 0 140 43" fill="none" xmlns="http://www.w3.org/2000/svg">
<path d="M27.3136 1.12015C27.1564 1.07089 26.9888 1.16941 26.9468 1.33275L26.5617 2.84689C26.5224 3.00245 26.6089 3.16061 26.7582 3.20728C35.839 6.05407 41.3016 15.6445 39.2764 25.1856C39.2423 25.3412 39.334 25.4968 39.486 25.5382L40.9584 25.9323C41.1182 25.9738 41.2807 25.8727 41.3173 25.7068C43.6177 15.03 37.4922 4.27288 27.311 1.12015H27.3136Z" fill="#fff"/>
<path d="M24.7592 0.445608C14.4549 -1.77634 4.13225 4.50838 1.08785 14.9025C1.04069 15.0659 1.13501 15.237 1.29483 15.2785L2.76725 15.6726C2.91659 15.714 3.07116 15.6233 3.1157 15.4703C5.86142 6.204 15.0575 0.598578 24.2588 2.54311C24.4108 2.57422 24.5601 2.48088 24.5994 2.32791L24.9845 0.816365C25.0265 0.650432 24.9269 0.481906 24.7645 0.445608H24.7592Z" fill="#41B490"/>
<path d="M14.8192 39.7248C5.94272 36.8184 0.597993 27.4328 2.47127 18.0472C2.50271 17.8917 2.41101 17.7387 2.26167 17.6972L0.791871 17.3031C0.632053 17.259 0.466995 17.3628 0.432936 17.5313C-1.71019 28.0499 4.29214 38.5892 14.2611 41.8094C14.4183 41.8612 14.5886 41.7627 14.6305 41.5968L15.0157 40.0852C15.055 39.9322 14.9685 39.7741 14.8218 39.7274L14.8192 39.7248Z" fill="#fff"/>
<path d="M40.2827 27.9492L38.8129 27.5551C38.6635 27.5162 38.5116 27.6043 38.4644 27.7547C35.6375 36.8862 26.5148 42.3853 17.3894 40.4564C17.2375 40.4252 17.0881 40.5186 17.0488 40.6716L16.6663 42.1831C16.6244 42.349 16.724 42.5176 16.8864 42.5539C27.1121 44.7602 37.3588 38.5844 40.487 28.3303C40.5368 28.167 40.4425 27.9932 40.2827 27.9518V27.9492Z" fill="#41B490"/>
<path d="M16.0771 23.8843C16.0771 23.3139 16.5277 22.8498 17.0831 22.8498H37.3643C37.6865 22.8498 37.9485 22.5854 37.959 22.2535C37.9643 22.1057 37.9643 21.9554 37.9643 21.805C37.9643 14.3043 33.3453 7.91586 26.8739 5.4839C26.4862 5.33871 26.0722 5.63168 26.0722 6.05689V19.7256C26.0722 20.296 25.6216 20.7601 25.0662 20.7601H4.78503C4.46277 20.7601 4.20078 21.0246 4.1903 21.3564C4.18506 21.5042 4.18506 21.6546 4.18506 21.805C4.18506 29.3031 8.80405 35.6915 15.2754 38.1261C15.6631 38.2712 16.0771 37.9783 16.0771 37.5531V23.8843V23.8843Z" fill="#fff"/>
<path d="M53.7308 16.8034C54.0243 16.8034 54.3387 16.8734 54.674 17.0108C55.0094 17.1508 55.3238 17.3219 55.6172 17.5267H55.5989C55.9028 17.7575 56.1386 18.053 56.3036 18.4134C56.4687 18.7764 56.5499 19.2094 56.5499 19.7176V20.262C56.5499 21.2524 56.2329 21.9836 55.5989 22.4529C55.2923 22.694 54.9832 22.8703 54.6662 22.9792C54.3491 23.0881 54.0374 23.1425 53.7334 23.1425H50.7388C50.4323 23.1425 50.1231 23.0881 49.8061 22.9792C49.4891 22.8703 49.1773 22.6966 48.8734 22.4529C48.2394 21.994 47.9224 21.2628 47.9224 20.262V20.0442C47.9224 19.5257 48.2446 19.2716 48.8917 19.282C49.5494 19.282 49.8769 19.5361 49.8769 20.0442V20.2439C49.8769 20.5343 49.9633 20.8065 50.1415 21.058C50.317 21.3121 50.6288 21.4391 51.0742 21.4391H53.3981C53.8435 21.4391 54.1553 21.3121 54.3308 21.058C54.5063 20.8039 54.5954 20.5317 54.5954 20.2439V19.7357C54.5954 19.5801 54.5745 19.4272 54.5325 19.282C54.4906 19.1368 54.4251 19.0072 54.3308 18.8931C54.2365 18.779 54.1133 18.6857 53.9614 18.6131C53.8094 18.5405 53.6208 18.5042 53.3981 18.5042H50.8279C50.2306 18.5042 49.6018 18.2864 48.9442 17.8534C48.3206 17.4438 48.0114 16.7359 48.0114 15.7326V15.1155C48.0114 14.6333 48.0927 14.2081 48.2577 13.8373C48.4228 13.4691 48.656 13.171 48.9625 12.9402H48.9442C49.2376 12.7354 49.5494 12.5669 49.8769 12.4321C50.2044 12.2998 50.5214 12.2324 50.8279 12.2324H53.6444C53.9509 12.2324 54.2627 12.2998 54.5876 12.4321C54.9098 12.5643 55.2242 12.7328 55.5307 12.9402H55.5124C55.8189 13.171 56.0521 13.4691 56.2172 13.8373C56.3822 14.2055 56.4634 14.6307 56.4634 15.1155V15.2788C56.4634 15.5329 56.3796 15.717 56.2172 15.8311C56.0521 15.9452 55.8111 16.01 55.4941 16.0204C54.8496 16.0333 54.5247 15.7844 54.5247 15.2788V15.1337C54.5247 14.8329 54.433 14.5581 54.2522 14.3092C54.0714 14.0629 53.7623 13.9384 53.3274 13.9384H51.1423C50.7074 13.9384 50.4008 14.0629 50.2175 14.3092C50.0367 14.5555 49.945 14.8329 49.945 15.1337V15.5692C49.945 15.8829 50.0367 16.1681 50.2175 16.4196C50.3982 16.6737 50.7074 16.8008 51.1423 16.8008H53.7308V16.8034Z" fill="#fff"/>
<path d="M61.4913 23.1119C61.1271 23.1119 60.7813 23.0601 60.4512 22.959C60.1237 22.8579 59.8067 22.7075 59.5001 22.5156V22.5338C58.9238 22.1604 58.6382 21.4708 58.6382 20.4674V19.5807C58.6382 19.0855 58.7246 18.6551 58.8949 18.2843C59.0652 17.9162 59.3037 17.6232 59.6076 17.4054H59.5892C59.8827 17.2006 60.1944 17.045 60.5219 16.9439C60.8494 16.8428 61.1664 16.7909 61.473 16.7909H65.3636V15.1057C65.3636 14.8049 65.2719 14.5275 65.0912 14.2812C64.9078 14.0349 64.6012 13.9104 64.1663 13.9104H62.107C61.6616 13.9104 61.3525 14.0219 61.1822 14.2449C61.0119 14.4679 60.9254 14.7323 60.9254 15.0331V15.1783C60.9254 15.8057 60.5979 16.1194 59.9403 16.1194C59.2827 16.1194 58.9552 15.8057 58.9552 15.1783V15.0149C58.9552 14.5197 59.039 14.1023 59.212 13.7652C59.3822 13.4282 59.6128 13.143 59.9062 12.9148H59.8879C60.1944 12.71 60.5141 12.5415 60.8468 12.4067C61.1822 12.2744 61.5018 12.207 61.8057 12.207H64.4833C64.7768 12.207 65.0912 12.2744 65.4265 12.4067C65.7619 12.5389 66.0763 12.7074 66.3697 12.9148H66.3514C66.6553 13.1456 66.8911 13.4438 67.0561 13.8119C67.2212 14.1801 67.3024 14.6053 67.3024 15.0901V22.3523C67.3024 22.933 66.9801 23.2208 66.333 23.2208C66.2046 23.2208 66.0841 23.2157 65.9715 23.2027C65.8588 23.1897 65.7592 23.1586 65.6728 23.1042C65.5863 23.0497 65.5156 22.9719 65.4606 22.8682C65.4082 22.7671 65.382 22.6297 65.382 22.4612L65.3636 18.4943H61.8057C61.5463 18.4943 61.3472 18.5255 61.2084 18.5851C61.0669 18.6447 60.9569 18.7432 60.873 18.8755C60.7787 19.0803 60.7106 19.241 60.6713 19.3551C60.6294 19.4692 60.6084 19.5988 60.6084 19.744V20.4492C60.6084 20.763 60.7001 21.0015 60.8809 21.1648C61.0616 21.3282 61.376 21.4085 61.8241 21.4085H63.7969C64.2318 21.4085 64.4493 21.6911 64.4493 22.2589C64.4493 22.5001 64.3969 22.7023 64.2894 22.8656C64.1846 23.029 64.0196 23.1094 63.7969 23.1094H61.4913V23.1119Z" fill="#fff"/>
<path d="M71.5863 22.4339C71.5863 23.0017 71.2641 23.2843 70.6169 23.2843C69.9593 23.2843 69.6318 23.0017 69.6318 22.4339V9.44709C69.6318 8.87928 69.9593 8.59668 70.6169 8.59668C71.2615 8.59668 71.5863 8.87928 71.5863 9.44709V22.4339Z" fill="#fff"/>
<path d="M75.9535 20.2438C75.9535 20.5342 76.0453 20.8064 76.226 21.0579C76.4068 21.312 76.716 21.439 77.1509 21.439H79.3516C79.7865 21.439 80.0931 21.3276 80.2765 21.1046C80.4573 20.8816 80.549 20.6249 80.549 20.3346V20.1349C80.549 19.5671 80.8712 19.2845 81.5183 19.2845C82.1628 19.2845 82.4877 19.5671 82.4877 20.1349V20.3527C82.4877 20.8609 82.4091 21.2757 82.2493 21.6024C82.0921 21.9291 81.8537 22.2117 81.5367 22.4528C80.9131 22.9117 80.2922 23.1399 79.6713 23.1399H76.7133C76.0898 23.1399 75.4872 22.9117 74.9003 22.4528C74.62 22.2117 74.3999 21.9057 74.248 21.5376C74.096 21.1694 74.02 20.7442 74.02 20.2594V15.0973C74.02 14.1198 74.3135 13.3939 74.9003 12.922C75.1938 12.7042 75.4951 12.5331 75.8068 12.4061C76.1186 12.279 76.4199 12.2168 76.7133 12.2168H79.6713C79.9516 12.2168 80.2634 12.2738 80.604 12.3879C80.9446 12.502 81.2616 12.6576 81.555 12.8494C81.8354 13.0542 82.0633 13.3394 82.2336 13.6998C82.4039 14.0628 82.4903 14.4906 82.4903 14.9858V16.7748C82.4903 17.0522 82.4117 17.3011 82.2519 17.5163C82.0947 17.7341 81.8039 17.843 81.3795 17.843H77.5753C77.1535 17.843 76.9308 17.5604 76.9072 16.9926C76.9072 16.4248 77.1299 16.1422 77.5753 16.1422H80.5699L80.5516 15.1154C80.5516 14.8121 80.4599 14.5399 80.2791 14.291C80.0957 14.0447 79.7892 13.9202 79.3543 13.9202H77.1535C76.7186 13.9202 76.412 14.0447 76.2286 14.291C76.0479 14.5373 75.9562 14.8121 75.9562 15.1154V20.2412L75.9535 20.2438Z" fill="#fff"/>
<path d="M90.4447 16.8034C90.7381 16.8034 91.0525 16.8734 91.3879 17.0108C91.7233 17.1508 92.035 17.3219 92.3311 17.5267H92.3127C92.6167 17.7575 92.8525 18.053 93.0175 18.4134C93.1826 18.7764 93.2638 19.2094 93.2638 19.7176V20.262C93.2638 21.2524 92.9468 21.9836 92.3127 22.4529C92.0062 22.694 91.6971 22.8703 91.38 22.9792C91.063 23.0881 90.7512 23.1425 90.4473 23.1425H87.4527C87.1462 23.1425 86.837 23.0881 86.52 22.9792C86.203 22.8703 85.8912 22.6966 85.5873 22.4529C84.9532 21.994 84.6362 21.2628 84.6362 20.262V20.0442C84.6362 19.5257 84.9585 19.2716 85.6056 19.282C86.2632 19.282 86.5907 19.5361 86.5907 20.0442V20.2439C86.5907 20.5343 86.6798 20.8065 86.8553 21.058C87.0309 21.3121 87.3427 21.4391 87.7881 21.4391H90.112C90.5574 21.4391 90.8691 21.3121 91.0447 21.058C91.2202 20.8039 91.3093 20.5317 91.3093 20.2439V19.7357C91.3093 19.5801 91.2883 19.4272 91.2464 19.282C91.2045 19.1368 91.139 19.0072 91.0447 18.8931C90.9504 18.779 90.8272 18.6857 90.6753 18.6131C90.5233 18.5405 90.3347 18.5042 90.112 18.5042H87.5418C86.9444 18.5042 86.3156 18.2864 85.658 17.8534C85.0345 17.4438 84.7253 16.7359 84.7253 15.7326V15.1155C84.7253 14.6333 84.8065 14.2081 84.9716 13.8373C85.1366 13.4691 85.3698 13.171 85.6764 12.9402H85.658C85.9515 12.7354 86.2632 12.5669 86.5907 12.4321C86.9182 12.2998 87.2352 12.2324 87.5418 12.2324H90.3582C90.6648 12.2324 90.9766 12.2998 91.3014 12.4321C91.6237 12.5643 91.9381 12.7328 92.2446 12.9402H92.2263C92.5328 13.171 92.766 13.4691 92.9311 13.8373C93.0961 14.2055 93.1773 14.6307 93.1773 15.1155V15.2788C93.1773 15.5329 93.0935 15.717 92.9311 15.8311C92.766 15.9452 92.525 16.01 92.2079 16.0204C91.5634 16.0333 91.2386 15.7844 91.2386 15.2788V15.1337C91.2386 14.8329 91.1469 14.5581 90.9661 14.3092C90.7827 14.0629 90.4761 13.9384 90.0412 13.9384H87.8562C87.4213 13.9384 87.1147 14.0629 86.9313 14.3092C86.7479 14.5555 86.6588 14.8329 86.6588 15.1337V15.5692C86.6588 15.8829 86.7505 16.1681 86.9313 16.4196C87.1121 16.6737 87.4213 16.8008 87.8562 16.8008H90.4447V16.8034Z" fill="#fff"/>
<path d="M49.9453 36.248C49.9453 36.5384 50.037 36.8107 50.2177 37.0622C50.3985 37.3162 50.7077 37.4433 51.1426 37.4433H53.3433C53.7783 37.4433 54.0848 37.3318 54.2682 37.1088C54.4516 36.8859 54.5407 36.6292 54.5407 36.3388V36.1392C54.5407 35.5714 54.8629 35.2862 55.5101 35.2862C56.1546 35.2862 56.4794 35.5714 56.4794 36.1392V36.3569C56.4794 36.8651 56.4008 37.2799 56.241 37.6066C56.0838 37.9333 55.8454 38.2159 55.5284 38.457C54.9048 38.9159 54.2839 39.1441 53.663 39.1441H50.705C50.0815 39.1441 49.4789 38.9159 48.892 38.457C48.6117 38.2159 48.3916 37.91 48.2397 37.5418C48.0877 37.1736 48.0117 36.7484 48.0117 36.2636V31.1015C48.0117 30.1241 48.3052 29.3981 48.892 28.9288C49.1855 28.7111 49.4868 28.5399 49.7985 28.4129C50.1103 28.2859 50.4116 28.2236 50.705 28.2236H53.663C53.9433 28.2236 54.2551 28.2807 54.5957 28.3948C54.9363 28.5088 55.2533 28.6644 55.5467 28.8563C55.8271 29.0611 56.055 29.3463 56.2253 29.7067C56.3956 30.0696 56.4821 30.4974 56.4821 30.9926V32.7816C56.4821 33.059 56.4035 33.3079 56.2436 33.5257C56.0865 33.7435 55.7956 33.8524 55.3712 33.8524H51.567C51.1452 33.8524 50.9225 33.5698 50.8989 33.002C50.8989 32.4342 51.1216 32.1516 51.567 32.1516H54.5616L54.5433 31.1249C54.5433 30.8215 54.4516 30.5467 54.2708 30.3004C54.09 30.0541 53.7809 29.9296 53.346 29.9296H51.1452C50.7103 29.9296 50.4037 30.0541 50.2204 30.3004C50.037 30.5493 49.9479 30.8241 49.9479 31.1249V36.2506L49.9453 36.248Z" fill="#fff"/>
<path d="M67.1821 36.2662C67.1821 37.2566 66.8651 37.9878 66.231 38.457C65.6101 38.9159 64.9865 39.1441 64.3656 39.1441H61.4077C60.7841 39.1441 60.1815 38.9159 59.5947 38.457C59.3143 38.2159 59.0969 37.91 58.9423 37.5418C58.7903 37.1736 58.7144 36.7484 58.7144 36.2636V31.1015C58.7144 30.1241 59.0078 29.3981 59.5947 28.9288C59.8881 28.7111 60.1894 28.5399 60.5012 28.4129C60.8129 28.2859 61.1142 28.2236 61.4077 28.2236H64.3656C64.646 28.2236 64.9577 28.2807 65.2983 28.3948C65.6389 28.5088 65.9559 28.6644 66.2494 28.8563C66.5323 29.0611 66.7576 29.3463 66.9279 29.7067C67.0982 30.0696 67.1821 30.4974 67.1821 30.9926V31.8975C67.1821 32.4757 66.8598 32.766 66.2127 32.766C65.5682 32.766 65.2433 32.4757 65.2433 31.8975V31.1197C65.2433 30.8189 65.1516 30.5441 64.9708 30.2952C64.7901 30.0489 64.4809 29.9244 64.046 29.9244H61.8452C61.4103 29.9244 61.1038 30.0489 60.9204 30.2952C60.7396 30.5441 60.6479 30.8189 60.6479 31.1197V36.2455C60.6479 36.5358 60.7396 36.8081 60.9204 37.0596C61.1038 37.3137 61.4103 37.4407 61.8452 37.4407H64.046C64.4809 37.4407 64.7874 37.3137 64.9708 37.0596C65.1542 36.8055 65.2433 36.5332 65.2433 36.2455V35.4132C65.2433 34.8454 65.5656 34.5628 66.2127 34.5628C66.8572 34.5628 67.1821 34.8454 67.1821 35.4132V36.2636V36.2662Z" fill="#fff"/>
<path d="M75.0182 28.2419C75.3221 28.2419 75.6365 28.3093 75.9614 28.4415C76.2836 28.5737 76.598 28.7448 76.9045 28.9497H76.8862C77.1901 29.1778 77.4259 29.4786 77.591 29.8467C77.756 30.2149 77.8372 30.6401 77.8372 31.1249V36.2689C77.8372 37.2593 77.5202 37.9904 76.8862 38.4597C76.2626 38.9186 75.6417 39.1468 75.0182 39.1468H72.2017C71.8952 39.1468 71.586 39.0923 71.269 38.9834C70.952 38.8745 70.6402 38.7008 70.3363 38.4571C69.7023 37.9982 69.3853 37.2671 69.3853 36.2663V31.1223C69.3853 30.6401 69.4665 30.2149 69.6315 29.8441C69.7966 29.476 70.0298 29.1778 70.3363 28.9471H70.318C70.6114 28.7422 70.9232 28.5737 71.2507 28.4389C71.5782 28.3067 71.8952 28.2393 72.2017 28.2393H75.0182V28.2419ZM74.7012 37.4434C75.1361 37.4434 75.4426 37.3163 75.626 37.0622C75.8068 36.8081 75.8985 36.5359 75.8985 36.2481V31.1405C75.8985 30.8397 75.8068 30.5649 75.626 30.316C75.4426 30.0697 75.1361 29.9453 74.7012 29.9453H72.5187C72.0838 29.9453 71.7773 30.0697 71.5939 30.316C71.4105 30.5649 71.3214 30.8397 71.3214 31.1405V36.2481C71.3214 36.5385 71.4131 36.8081 71.5939 37.0622C71.7747 37.3163 72.0838 37.4434 72.5187 37.4434H74.7012Z" fill="#fff"/>
<path d="M85.7782 32.8073C86.0716 32.8073 86.386 32.8773 86.7214 33.0147C87.0567 33.1547 87.3711 33.3258 87.6646 33.5306H87.6462C87.9501 33.7614 88.1859 34.0569 88.351 34.4173C88.5161 34.7803 88.5973 35.2133 88.5973 35.7215V36.2633C88.5973 37.2538 88.2803 37.9849 87.6462 38.4542C87.3397 38.6953 87.0305 38.8716 86.7135 38.9805C86.3965 39.0894 86.0847 39.1438 85.7808 39.1438H82.7862C82.4797 39.1438 82.1705 39.0894 81.8535 38.9805C81.5365 38.8716 81.2247 38.6979 80.9208 38.4542C80.2867 37.9953 79.9697 37.2641 79.9697 36.2633V36.0456C79.9697 35.527 80.292 35.2729 80.9391 35.2833C81.5967 35.2833 81.9242 35.5374 81.9242 36.0456V36.2452C81.9242 36.5356 82.0107 36.8078 82.1888 37.0593C82.3644 37.3134 82.6761 37.4404 83.1215 37.4404H85.4455C85.8909 37.4404 86.2026 37.3134 86.3782 37.0593C86.5537 36.8052 86.6428 36.533 86.6428 36.2452V35.737C86.6428 35.5789 86.6218 35.4285 86.5799 35.2833C86.538 35.1381 86.4725 35.0085 86.3782 34.8944C86.2838 34.7803 86.1607 34.687 86.0087 34.6144C85.8568 34.5418 85.6682 34.5055 85.4455 34.5055H82.8753C82.2779 34.5055 81.6491 34.2877 80.9915 33.8547C80.368 33.4451 80.0588 32.7373 80.0588 31.7339V31.1194C80.0588 30.6372 80.14 30.2094 80.3051 29.8412C80.4701 29.473 80.7033 29.1723 81.0099 28.9441H80.9915C81.285 28.7393 81.5967 28.5708 81.9242 28.436C82.2517 28.3037 82.5687 28.2363 82.8753 28.2363H85.6917C85.9983 28.2363 86.31 28.3037 86.6349 28.436C86.9572 28.5682 87.2716 28.7393 87.5781 28.9441H87.5598C87.8663 29.1749 88.0995 29.473 88.2645 29.8412C88.4296 30.2094 88.5108 30.6346 88.5108 31.1194V31.2828C88.5108 31.5368 88.427 31.7209 88.2645 31.835C88.0995 31.9491 87.8584 32.0139 87.5414 32.0243C86.8969 32.0372 86.572 31.7883 86.572 31.2828V31.1376C86.572 30.8368 86.4803 30.562 86.2996 30.3131C86.1188 30.0668 85.8096 29.9423 85.3747 29.9423H83.1897C82.7548 29.9423 82.4482 30.0668 82.2648 30.3131C82.0814 30.5594 81.9923 30.8368 81.9923 31.1376V31.5731C81.9923 31.8869 82.084 32.1721 82.2648 32.4235C82.4456 32.6776 82.7548 32.8047 83.1897 32.8047H85.7782V32.8073Z" fill="#fff"/>
<path d="M91.4479 41.6829C91.0366 41.6829 90.8191 41.4002 90.7955 40.8324C90.7955 40.2646 91.013 39.982 91.4479 39.982H92.2234C92.6347 39.982 92.9046 39.855 93.033 39.6009L93.2792 38.9294L93.3683 38.639L89.9335 29.3831V29.4012C89.8392 29.1108 89.8602 28.8645 89.9938 28.6597C90.13 28.4549 90.337 28.3045 90.62 28.206C90.8322 28.1463 91.0025 28.1152 91.1309 28.1152C91.4715 28.1152 91.6837 28.3201 91.7649 28.7323L93.1561 32.2999L94.3351 35.2711L96.2188 28.7686C96.3236 28.333 96.5725 28.1178 96.9577 28.1178C97.052 28.1178 97.204 28.1489 97.4162 28.2086C97.6965 28.2941 97.9009 28.4315 98.024 28.626C98.1471 28.8205 98.1733 29.0486 98.1026 29.3157C97.5734 31.1643 97.0363 33.0232 96.4913 34.8952C95.9464 36.7671 95.4093 38.6209 94.88 40.4565C94.8224 40.5887 94.7307 40.7261 94.6076 40.8636C94.4844 41.001 94.322 41.1358 94.1229 41.2628C93.9238 41.3899 93.6775 41.491 93.384 41.5714C93.0906 41.6491 92.75 41.688 92.3623 41.688H91.4479V41.6829Z" fill="#fff"/>
<path d="M105.323 32.8073C105.617 32.8073 105.931 32.8773 106.264 33.0147C106.599 33.1547 106.911 33.3258 107.207 33.5306H107.189C107.493 33.7614 107.728 34.0569 107.893 34.4173C108.059 34.7803 108.14 35.2133 108.14 35.7215V36.2633C108.14 37.2538 107.823 37.9849 107.189 38.4542C106.882 38.6953 106.573 38.8716 106.256 38.9805C105.939 39.0894 105.627 39.1438 105.323 39.1438H102.329C102.022 39.1438 101.713 39.0894 101.396 38.9805C101.079 38.8716 100.767 38.6979 100.463 38.4542C99.8292 37.9953 99.5122 37.2641 99.5122 36.2633V36.0456C99.5122 35.527 99.8345 35.2729 100.482 35.2833C101.139 35.2833 101.467 35.5374 101.467 36.0456V36.2452C101.467 36.5356 101.556 36.8078 101.731 37.0593C101.907 37.3134 102.219 37.4404 102.664 37.4404H104.988C105.433 37.4404 105.745 37.3134 105.921 37.0593C106.096 36.8052 106.185 36.533 106.185 36.2452V35.737C106.185 35.5789 106.164 35.4285 106.122 35.2833C106.08 35.1381 106.015 35.0085 105.921 34.8944C105.826 34.7803 105.703 34.687 105.551 34.6144C105.399 34.5418 105.211 34.5055 104.988 34.5055H102.418C101.82 34.5055 101.192 34.2877 100.534 33.8547C99.9104 33.4451 99.6013 32.7373 99.6013 31.7339V31.1194C99.6013 30.6372 99.6825 30.2094 99.8476 29.8412C100.013 29.473 100.246 29.1723 100.552 28.9441H100.534C100.827 28.7393 101.139 28.5708 101.467 28.436C101.794 28.3037 102.111 28.2363 102.418 28.2363H105.234C105.541 28.2363 105.853 28.3037 106.177 28.436C106.5 28.5682 106.814 28.7393 107.121 28.9441H107.102C107.409 29.1749 107.642 29.473 107.807 29.8412C107.972 30.2094 108.053 30.6346 108.053 31.1194V31.2828C108.053 31.5368 107.969 31.7209 107.807 31.835C107.642 31.9491 107.401 32.0139 107.084 32.0243C106.439 32.0372 106.115 31.7883 106.115 31.2828V31.1376C106.115 30.8368 106.023 30.562 105.842 30.3131C105.661 30.0668 105.352 29.9423 104.917 29.9423H102.732C102.297 29.9423 101.991 30.0668 101.807 30.3131C101.624 30.5594 101.535 30.8368 101.535 31.1376V31.5731C101.535 31.8869 101.627 32.1721 101.807 32.4235C101.988 32.6776 102.297 32.8047 102.732 32.8047H105.321L105.323 32.8073Z" fill="#fff"/>
<path d="M112.738 29.9452V36.5385C112.738 36.8522 112.803 37.0933 112.932 37.2618C113.06 37.4304 113.335 37.5159 113.76 37.5159H114.218C114.677 37.5159 114.894 37.7934 114.87 38.3482C114.87 38.916 114.653 39.1986 114.218 39.1986H113.636C113.262 39.1986 112.908 39.1467 112.581 39.0456C112.25 38.9419 111.936 38.7941 111.63 38.6023V38.6204C111.053 38.2341 110.768 37.547 110.768 36.554V29.9426H110.081C109.659 29.9426 109.437 29.66 109.413 29.0922C109.413 28.5244 109.636 28.2418 110.081 28.2418H110.768V26.3051C110.768 25.7243 111.103 25.4365 111.771 25.4365C112.416 25.4365 112.74 25.7269 112.74 26.3051V28.2418H114.202C114.661 28.2418 114.878 28.527 114.855 29.0922C114.855 29.66 114.637 29.9426 114.202 29.9426H112.74L112.738 29.9452Z" fill="#fff"/>
<path d="M118.337 36.248C118.337 36.5384 118.429 36.8107 118.609 37.0622C118.79 37.3162 119.099 37.4433 119.534 37.4433H121.735C122.17 37.4433 122.476 37.3318 122.66 37.1088C122.841 36.8859 122.932 36.6292 122.932 36.3388V36.1392C122.932 35.5714 123.255 35.2862 123.902 35.2862C124.546 35.2862 124.871 35.5714 124.871 36.1392V36.3569C124.871 36.8651 124.792 37.2799 124.633 37.6066C124.475 37.9333 124.237 38.2159 123.92 38.457C123.296 38.9159 122.676 39.1441 122.055 39.1441H119.097C118.473 39.1441 117.871 38.9159 117.284 38.457C117.003 38.2159 116.783 37.91 116.631 37.5418C116.479 37.1736 116.403 36.7484 116.403 36.2636V31.1015C116.403 30.1241 116.697 29.3981 117.284 28.9288C117.577 28.7111 117.878 28.5399 118.19 28.4129C118.502 28.2859 118.803 28.2236 119.097 28.2236H122.055C122.335 28.2236 122.647 28.2807 122.987 28.3948C123.328 28.5088 123.645 28.6644 123.938 28.8563C124.219 29.0611 124.447 29.3463 124.617 29.7067C124.787 30.0696 124.874 30.4974 124.874 30.9926V32.7816C124.874 33.059 124.795 33.3079 124.635 33.5257C124.478 33.7435 124.187 33.8524 123.763 33.8524H119.959C119.534 33.8524 119.314 33.5698 119.291 33.002C119.291 32.4342 119.513 32.1516 119.959 32.1516H122.953L122.935 31.1249C122.935 30.8215 122.843 30.5467 122.662 30.3004C122.479 30.0541 122.172 29.9296 121.738 29.9296H119.537C119.102 29.9296 118.795 30.0541 118.612 30.3004C118.429 30.5493 118.339 30.8241 118.339 31.1249V36.2506L118.337 36.248Z" fill="#fff"/>
<path d="M132.566 31.2682C132.566 31.1126 132.542 30.9571 132.495 30.8067C132.448 30.6563 132.39 30.5137 132.319 30.3815C132.168 30.0911 131.851 29.9459 131.368 29.9459H130.242C129.76 29.9459 129.438 30.0911 129.272 30.3815C129.131 30.6589 129.06 30.9545 129.06 31.2682V38.4422C129.06 39.01 128.738 39.2926 128.091 39.2926C127.423 39.2926 127.087 39.01 127.087 38.4422V31.1049C127.087 30.1145 127.404 29.3911 128.038 28.9322C128.683 28.4733 129.312 28.2451 129.922 28.2451H131.701C131.971 28.2451 132.27 28.2996 132.6 28.4085C132.927 28.5174 133.244 28.6859 133.551 28.9166C133.844 28.6885 134.153 28.5174 134.476 28.4085C134.798 28.2996 135.107 28.2451 135.401 28.2451H137.161C137.785 28.2451 138.406 28.4733 139.029 28.9322C139.674 29.3781 139.999 30.1041 139.999 31.1049V38.4422C139.999 39.01 139.671 39.2926 139.013 39.2926C138.356 39.2926 138.028 39.01 138.028 38.4422V31.2682C138.028 31.1126 138.01 30.9545 137.976 30.7963C137.942 30.6408 137.876 30.4956 137.782 30.3608L137.8 30.3789C137.706 30.2208 137.588 30.1093 137.449 30.0445C137.308 29.977 137.104 29.9459 136.834 29.9459H135.725C135.233 29.9459 134.908 30.0911 134.756 30.3815C134.601 30.646 134.525 30.9441 134.525 31.2682V38.4422C134.525 39.01 134.203 39.2926 133.556 39.2926C132.898 39.2926 132.571 39.01 132.571 38.4422V31.2682H132.566Z" fill="#fff"/>
</svg>
