{
    "shortid": "SkKBCK39l",
    "name": "invoice-logo.png",
    "creationDate": {
        "$$date": 1656353891175
    },
    "modificationDate": {
        "$$date": 1656353891175
    },
    "_id": "4qLl1priQHxE8sdX",
    "$entitySet": "assets"
}