{
    "name": "ReporteTicket",
    "engine": "handlebars",
    "recipe": "chrome-pdf",
    "data": null,
    "shortid": "-dXrl9KY9O",
    "chrome": {
        "printBackground": true,
        "landscape": true,
        "format": "A4",
        "marginLeft": "1cm",
        "marginRight": "1cm"
    },
    "creationDate": {
        "$$date": 1656356788053
    },
    "modificationDate": {
        "$$date": 1659143881736
    },
    "inheritedReadPermissions": [],
    "inheritedEditPermissions": [],
    "_id": "3USubRyrg2qex4rg",
    "scripts": [
        {
            "shortid": "VuNvvXYIxh"
        }
    ],
    "$entitySet": "templates"
}