220 Welcome.
ad_history.0.action_type:new
ad_history.0.state:reg
ad_history.0.transition:initial
ad_history.0.timestamp:{{.+}}
ad_history.0.admin:
ad_history.1.action_type:new
ad_history.1.state:unverified
ad_history.1.transition:verifymail
ad_history.1.timestamp:{{.+}}
ad_history.1.admin:
ad_history.2.action_type:new
ad_history.2.state:pending_review
ad_history.2.transition:cleared_by
ad_history.2.timestamp:{{.+}}
ad_history.2.admin:
ad_history.3.action_type:new
ad_history.3.state:pending_review
ad_history.3.transition:newqueue
ad_history.3.timestamp:{{.+}}
ad_history.3.admin:
ad_history.4.action_type:new
ad_history.4.state:approved
ad_history.4.transition:ad evaluation
ad_history.4.timestamp:{{.+}}
ad_history.4.admin:Implio
status:TRANS_OK
end
