info:filtered:6
info:after_docs:0
info:to_id:4711
info:idrange:before:1
info:idrange:after:0
info:lines:2
id	order	suborder	attronly	attrind	body	status
5	1	4	a	quick	fox bumps onto the crazy dog	active
3	2	0	i	mad	a mer himp he se into inutels shere	active
