<svg xmlns="http://www.w3.org/2000/svg" width="33" height="26" viewBox="0 0 33 26">
    <g fill="none" fill-rule="evenodd" stroke="#00B5E2" stroke-width="1.109" transform="translate(1 1)">
        <ellipse cx="13.156" cy="22.075" rx="1.759" ry="1.698"/>
        <ellipse cx="25.921" cy="22.075" rx="1.759" ry="1.698"/>
        <path stroke-linecap="round" d="M0 0h4.736c.302 0 .622.23.72.525l5.682 17.134a.82.82 0 0 0 .738.525h16.412"/>
        <path d="M9.732 5.502c-.088-.287.082-.52.392-.52H30.43c.304 0 .48.245.396.535l-2.807 9.737a.782.782 0 0 1-.707.536H13.403c-.304 0-.626-.246-.71-.522L9.732 5.502z"/>
    </g>
</svg>
