220 Welcome.
ad_subject:Chery Tiggo 2007 
region:15
action_type:if_pack_inmo
pack_result:-1
ref_auth_code:123123123
ref_placements_type:VN
ref_pay_type:credit
ref_external_response:1
ref_remote_addr:0.0.0.0
pay_log:PAID 00175a (1, cuentaprosincupos@yapo.cl, 7000 kr) (ad_id: 133)
status:TRANS_OK
end
