220 Welcome.
ad_category:1220
unit_price:2900
date_start:{{.*}}
date_end:{{.*}}
execution_0:{{.*}}
execution_1:{{.*}}
execution_2:{{.*}}
execution_3:{{.*}}
execution_4:{{.*}}
execution_5:{{.*}}
execution_6:{{.*}}
execution_7:{{.*}}
execution_8:{{.*}}
execution_9:{{.*}}
execution_10:{{.*}}
execution_11:{{.*}}
execution_12:{{.*}}
execution_13:{{.*}}
execution_14:{{.*}}
execution_15:{{.*}}
execution_16:{{.*}}
execution_17:{{.*}}
execution_18:{{.*}}
execution_19:{{.*}}
execution_20:{{.*}}
execution_21:{{.*}}
execution_22:{{.*}}
execution_23:{{.*}}
execution_24:{{.*}}
execution_25:{{.*}}
execution_26:{{.*}}
execution_27:{{.*}}
execution_28:{{.*}}
execution_29:{{.*}}
execution_30:{{.*}}
execution_31:{{.*}}
execution_32:{{.*}}
execution_33:{{.*}}
execution_34:{{.*}}
execution_35:{{.*}}
execution_36:{{.*}}
execution_37:{{.*}}
execution_38:{{.*}}
execution_39:{{.*}}
execution_40:{{.*}}
execution_41:{{.*}}
execution_42:{{.*}}
execution_43:{{.*}}
execution_44:{{.*}}
execution_45:{{.*}}
execution_46:{{.*}}
execution_47:{{.*}}
execution_48:{{.*}}
execution_49:{{.*}}
execution_50:{{.*}}
execution_51:{{.*}}
execution_52:{{.*}}
execution_53:{{.*}}
execution_54:{{.*}}
execution_55:{{.*}}
execution_56:{{.*}}
execution_57:{{.*}}
execution_58:{{.*}}
execution_59:{{.*}}
execution_60:{{.*}}
execution_61:{{.*}}
execution_62:{{.*}}
execution_63:{{.*}}
execution_64:{{.*}}
execution_65:{{.*}}
execution_66:{{.*}}
execution_67:{{.*}}
execution_68:{{.*}}
execution_69:{{.*}}
execution_70:{{.*}}
execution_71:{{.*}}
execution_72:{{.*}}
execution_73:{{.*}}
execution_74:{{.*}}
execution_75:{{.*}}
execution_76:{{.*}}
execution_77:{{.*}}
execution_78:{{.*}}
execution_79:{{.*}}
execution_80:{{.*}}
execution_81:{{.*}}
execution_82:{{.*}}
execution_83:{{.*}}
execution_84:{{.*}}
execution_85:{{.*}}
execution_86:{{.*}}
execution_87:{{.*}}
execution_88:{{.*}}
execution_89:{{.*}}
execution_90:{{.*}}
execution_91:{{.*}}
execution_92:{{.*}}
execution_93:{{.*}}
execution_94:{{.*}}
execution_95:{{.*}}
execution_96:{{.*}}
execution_97:{{.*}}
execution_98:{{.*}}
execution_99:{{.*}}
execution_100:{{.*}}
execution_101:{{.*}}
execution_102:{{.*}}
execution_103:{{.*}}
execution_104:{{.*}}
execution_105:{{.*}}
execution_106:{{.*}}
execution_107:{{.*}}
execution_108:{{.*}}
execution_109:{{.*}}
execution_110:{{.*}}
execution_111:{{.*}}
execution_112:{{.*}}
execution_113:{{.*}}
execution_114:{{.*}}
execution_115:{{.*}}
execution_116:{{.*}}
execution_117:{{.*}}
execution_118:{{.*}}
execution_119:{{.*}}
total_bumps:120
total_price:348000
status:TRANS_OK
end
