Executing: category_params
challenge: {{.*}}

[+] response calculated: {{.*}}

{
    "es": [
        {
            "id": "5000", 
            "categories": [
                {
                    "name": "Muebles", 
                    "parent": "5000", 
                    "price": "0", 
                    "total_images": "6", 
                    "extra_images": {
                        "max": "5", 
                        "price": "0"
                    }, 
                    "show_price_on_newad": "1", 
                    "id": "5020", 
                    "types": [
                        {
                            "default": false, 
                            "list": [
                                {
                                    "group": "pricelist.3", 
                                    "name": "ps", 
                                    "label": "Precio m\u00edn", 
                                    "values": [
                                        {
                                            "id": "0", 
                                            "value": "$ 0"
                                        }, 
                                        {
                                            "id": "1", 
                                            "value": "$ 10.000"
                                        }, 
                                        {
                                            "id": "2", 
                                            "value": "$ 30.000"
                                        }, 
                                        {
                                            "id": "3", 
                                            "value": "$ 50.000"
                                        }, 
                                        {
                                            "id": "4", 
                                            "value": "$ 75.000"
                                        }, 
                                        {
                                            "id": "5", 
                                            "value": "$ 100.000"
                                        }, 
                                        {
                                            "id": "6", 
                                            "value": "$ 150.000"
                                        }, 
                                        {
                                            "id": "7", 
                                            "value": "$ 200.000"
                                        }, 
                                        {
                                            "id": "8", 
                                            "value": "$ 250.000"
                                        }, 
                                        {
                                            "id": "9", 
                                            "value": "$ 300.000"
                                        }, 
                                        {
                                            "id": "10", 
                                            "value": "$ 400.000"
                                        }, 
                                        {
                                            "id": "11", 
                                            "value": "$ 500.000"
                                        }, 
                                        {
                                            "id": "12", 
                                            "value": "$ 750.000"
                                        }, 
                                        {
                                            "id": "13", 
                                            "value": "$ 1.000.000"
                                        }, 
                                        {
                                            "id": "14", 
                                            "value": "$ 1.500.000"
                                        }, 
                                        {
                                            "id": "15", 
                                            "value": "$ 2.000.000"
                                        }, 
                                        {
                                            "id": "16", 
                                            "value": "$ 2.500.000"
                                        }, 
                                        {
                                            "id": "17", 
                                            "value": "$ 3.000.000"
                                        }, 
                                        {
                                            "id": "18", 
                                            "value": "$ 4.000.000"
                                        }, 
                                        {
                                            "id": "19", 
                                            "value": "$ 5.000.000"
                                        }, 
                                        {
                                            "id": "20", 
                                            "value": "M\u00e1s de $ 5.000.000"
                                        }
                                    ], 
                                    "translate": "pricelist", 
                                    "type": "multidropdownlist"
                                }, 
                                {
                                    "group": "pricelist.3", 
                                    "name": "pe", 
                                    "label": "Precio m\u00e1x", 
                                    "values": [
                                        {
                                            "id": "0", 
                                            "value": "$ 0"
                                        }, 
                                        {
                                            "id": "1", 
                                            "value": "$ 10.000"
                                        }, 
                                        {
                                            "id": "2", 
                                            "value": "$ 30.000"
                                        }, 
                                        {
                                            "id": "3", 
                                            "value": "$ 50.000"
                                        }, 
                                        {
                                            "id": "4", 
                                            "value": "$ 75.000"
                                        }, 
                                        {
                                            "id": "5", 
                                            "value": "$ 100.000"
                                        }, 
                                        {
                                            "id": "6", 
                                            "value": "$ 150.000"
                                        }, 
                                        {
                                            "id": "7", 
                                            "value": "$ 200.000"
                                        }, 
                                        {
                                            "id": "8", 
                                            "value": "$ 250.000"
                                        }, 
                                        {
                                            "id": "9", 
                                            "value": "$ 300.000"
                                        }, 
                                        {
                                            "id": "10", 
                                            "value": "$ 400.000"
                                        }, 
                                        {
                                            "id": "11", 
                                            "value": "$ 500.000"
                                        }, 
                                        {
                                            "id": "12", 
                                            "value": "$ 750.000"
                                        }, 
                                        {
                                            "id": "13", 
                                            "value": "$ 1.000.000"
                                        }, 
                                        {
                                            "id": "14", 
                                            "value": "$ 1.500.000"
                                        }, 
                                        {
                                            "id": "15", 
                                            "value": "$ 2.000.000"
                                        }, 
                                        {
                                            "id": "16", 
                                            "value": "$ 2.500.000"
                                        }, 
                                        {
                                            "id": "17", 
                                            "value": "$ 3.000.000"
                                        }, 
                                        {
                                            "id": "18", 
                                            "value": "$ 4.000.000"
                                        }, 
                                        {
                                            "id": "19", 
                                            "value": "$ 5.000.000"
                                        }, 
                                        {
                                            "id": "20", 
                                            "value": "M\u00e1s de $ 5.000.000"
                                        }
                                    ], 
                                    "translate": "pricelist", 
                                    "type": "multidropdownlist"
                                }
                            ], 
                            "id": "a", 
                            "label": "all"
                        }
                    ]
                }
            ], 
            "name": "Hogar"
        }
    ]
}
