<svg xmlns="http://www.w3.org/2000/svg" width="40" height="40" viewBox="0 0 40 40">
    <g fill="none" fill-rule="evenodd">
        <path fill="#25D366" d="M39.737 19.79c0 10.892-8.83 19.722-19.723 19.722C9.122 39.512.291 30.682.291 19.79.291 8.897 9.121.067 20.014.067c10.892 0 19.723 8.83 19.723 19.723"/>
        <g fill="#FFF">
            <path fill-rule="nonzero" d="M9.564 28.63l4.9-1.36.704-.195.644.346a9.304 9.304 0 0 0 4.417 1.106 9.354 9.354 0 1 0-9.354-9.354c0 1.699.452 3.327 1.297 4.755l.393.665-.205.745-1.317 4.77-1.05.29-.719-.717.29-1.05zm-.508-9.457C9.056 13.003 14.058 8 20.229 8c6.17 0 11.173 5.002 11.173 11.173 0 6.17-5.003 11.173-11.173 11.173-1.91 0-3.706-.479-5.278-1.323L9 30.674l1.606-5.82a11.121 11.121 0 0 1-1.55-5.681z"/>
            <path d="M17.438 14.712l.743 1.772s.305.706-.362 1.259c-.667.553-.21 1.107-.21 1.107s.828 1.503 3.208 2.938c0 0 .635.44 1.193-.15 0 0 .38-.383.702-.788 0 0 .4-.555 1.002-.174 0 0 .889.497 1.756.947 0 0 .795.323.445 1.167 0 0-1.003 2.23-3.502 1.704 0 0-1.8-.185-3.388-1.34-.244-.177-.317-.221-.877-.675-.043-.035-.308-.28-.351-.319a13.692 13.692 0 0 1-.78-.768c-1.276-1.375-1.83-2.542-1.83-2.542s-.615-1.238-.702-1.978c0 0-.3-1.614 1.065-2.542 0 0 1.316-1.01 1.888.382z"/>
        </g>
    </g>
</svg>
