220 Welcome.
token:.+
ad.0.ad_id:1
ad.0.action_id:1
ad.0.list_id:7910234
ad.0.list_time:.+
ad.0.subject:Testannons 1
ad.0.status:active
ad.0.category:2020
ad.0.type:s
ad.0.body:Apartamentito wapo
ad.0.phone:08-111111
ad.0.phone_hidden:f
ad.0.price:300
ad.0.company_ad:0
ad.1.ad_id:3
ad.1.action_id:2
ad.1.list_id:7910666
ad.1.list_time:20.*
ad.1.subject:Testannons 3, paid, refused, edited and accepted
ad.1.status:active
ad.1.category:2080
ad.1.type:k
ad.1.body:Category Professional vehicles, to buy, changed priced from 8000 to 9000 euros, with no images nor url, and no parameters, Cyclades Islands
ad.1.phone:08-111111
ad.1.phone_hidden:f
ad.1.price:9000
ad.1.company_ad:0
status:TRANS_OK
end
