
<svg width="10px" height="10px" viewBox="0 0 10 10" version="1.1" xmlns="http://www.w3.org/2000/svg" xmlns:xlink="http://www.w3.org/1999/xlink">
    <defs>
        <rect id="iconLoweredPricePath" x="0" y="0" width="9.51612903" height="9.50248756" rx="2.85"></rect>
        <mask id="iconLoweredPriceMask" maskContentUnits="userSpaceOnUse" maskUnits="objectBoundingBox" x="0" y="0" width="9.51612903" height="9.50248756" fill="white">
            <use xlink:href="#iconLoweredPricePath"></use>
        </mask>
    </defs>
    <g stroke="none" stroke-width="1" fill="none" fill-rule="evenodd">
        <g transform="translate(-124, -74)">
            <g transform="translate(0.000000, 20)">
                <g transform="translate(124, 54)">
                    <path d="M1.98515494,1.9823092 L5.60100836,5.59297926" stroke="#52C300" stroke-width="0.95" stroke-linecap="square"></path>
                    <use stroke="#52C300" mask="url(#iconLoweredPriceMask)" stroke-width="1.9" xlink:href="#iconLoweredPricePath"></use>
                    <polyline fill="#52C300" points="3.56854839 6.1673956 6.38611227 3.56343284 7.13709677 7.12445439"></polyline>
                </g>
            </g>
        </g>
    </g>
</svg>

