{{.*}}
{{.*}}

{{.*}}
<?xml version="1.0" ?>
<list>
	 
	<company_ads/>
	 
	<numperpage>
<![CDATA[50]]>	</numperpage>
	 
	<private_ads>
<![CDATA[0]]>	</private_ads>
	 
	<search_total>
<![CDATA[0]]>	</search_total>
	 
	<total>
<![CDATA[0]]>	</total>
	 
	<ads>
		 
	</ads>
	 
</list>

