Indexer\[http://.+/stats\]: 
STATE: .+
COUNT: .+
DELTA CACHE SIZE: 

Indexes:
active	checksum: .+ ndocs: 110 to: 111 
pending	checksum: .+ ndocs: 125 to: 126 


Clients:
status				client			client_state	client_state_reason
distributed 126		http://.+			INSYNC	
failed 126		http://.+			DOWN	Couldn't connect to server




