220 Welcome.
ad_id:27
list_id:8000007
list_time:2013-07-30 12:22:09
subject:Depto amoblado un ambiente
category:1240
price:380000
ad_status:published
ad_media_id:
image_count:0
daily_bump:
weekly_bump:
label:
gallery_date:
ad_pack_status:
autobump:
paid:t
views:0
mails:0
region:15
on_asearch:1
ad_id:20
list_id:8000000
list_time:2013-07-30 12:22:09
subject:Depto stgo centro
category:1220
price:25000000
ad_status:published
ad_media_id:
image_count:0
daily_bump:
weekly_bump:
label:
gallery_date:
ad_pack_status:
autobump:
paid:t
views:0
mails:0
region:15
on_asearch:1
page_ads:2
n_ads:2
status:TRANS_OK
end
