<svg xmlns="http://www.w3.org/2000/svg" width="40" height="40" viewBox="0 0 40 40">
    <g fill="none" fill-rule="evenodd">
        <path fill="#1DA1F2" d="M39.737 19.79c0 10.892-8.83 19.722-19.723 19.722C9.122 39.512.291 30.682.291 19.79.291 8.897 9.121.067 20.014.067c10.892 0 19.723 8.83 19.723 19.723"/>
        <path fill="#FFF" d="M28.966 11.873a7.848 7.848 0 0 1-2.536.991 3.937 3.937 0 0 0-2.914-1.291c-2.202 0-3.99 1.833-3.99 4.093 0 .32.035.632.103.932-3.317-.171-6.258-1.799-8.228-4.278a4.167 4.167 0 0 0-.54 2.06c0 1.42.704 2.672 1.776 3.406a3.913 3.913 0 0 1-1.81-.51v.05c0 1.984 1.377 3.64 3.204 4.014a3.805 3.805 0 0 1-1.052.144 3.89 3.89 0 0 1-.75-.073c.507 1.626 1.98 2.81 3.727 2.84a7.88 7.88 0 0 1-5.91 1.698 11.111 11.111 0 0 0 6.12 1.837c7.343 0 11.357-6.235 11.357-11.645 0-.178-.004-.356-.01-.53a8.197 8.197 0 0 0 1.99-2.119 7.818 7.818 0 0 1-2.292.645 4.087 4.087 0 0 0 1.755-2.264"/>
    </g>
</svg>
