Executing: category_params
challenge: {{.*}}

[+] response calculated: {{.*}}

{
    "es": [
        {
            "id": "1120", 
            "categories": [
                {
                    "subcategories": [], 
                    "id": "1120", 
                    "parent": "1120", 
                    "name": ""
                }
            ], 
            "name": ""
        }
    ]
}
