220 Welcome.
token:.+
total:5
result.0.timestamp:.+
result.0.voucher_action_id:103
result.0.action_type:fill
result.0.amount:250
result.0.resulting_balance:290
result.1.timestamp:.+
result.1.voucher_action_id:102
result.1.action_type:pay
result.1.amount:-90
result.1.resulting_balance:40
result.1.ad_subject:Voucher
result.1.ad_type:new
result.1.payments:ad_action
result.2.timestamp:.+
result.2.voucher_action_id:101
result.2.action_type:pay
result.2.amount:-90
result.2.resulting_balance:130
result.2.ad_subject:Voucher
result.2.ad_type:new
result.2.payments:ad_action
result.3.timestamp:.+
result.3.voucher_action_id:100
result.3.action_type:pay
result.3.amount:-30
result.3.resulting_balance:220
result.3.ad_subject:Voucher
result.3.ad_type:new
result.3.payments:ad_action
result.4.timestamp:.+
result.4.voucher_action_id:1
result.4.action_type:fill
result.4.amount:250
result.4.resulting_balance:250
status:TRANS_OK
end
