220 Welcome.
token:.+
list_type:general
blocked_item.0.item_id:100
blocked_item.0.value:svara.inte@blocket.se
blocked_item.0.list_id:10
blocked_item.0.notice:En fin liten notis 
blocked_item.0.username:blocket1
status:TRANS_OK
end
