Mail queue test 0
Mail queue test 1
Mail queue test 10
Mail queue test 11
Mail queue test 12
Mail queue test 13
Mail queue test 14
Mail queue test 15
Mail queue test 16
Mail queue test 17
Mail queue test 18
Mail queue test 19
Mail queue test 2
Mail queue test 20
Mail queue test 21
Mail queue test 22
Mail queue test 23
Mail queue test 24
Mail queue test 25
Mail queue test 26
Mail queue test 27
Mail queue test 28
Mail queue test 29
Mail queue test 3
Mail queue test 30
Mail queue test 31
Mail queue test 32
Mail queue test 33
Mail queue test 34
Mail queue test 35
Mail queue test 36
Mail queue test 37
Mail queue test 38
Mail queue test 39
Mail queue test 4
Mail queue test 40
Mail queue test 41
Mail queue test 42
Mail queue test 43
Mail queue test 44
Mail queue test 45
Mail queue test 46
Mail queue test 47
Mail queue test 48
Mail queue test 49
Mail queue test 5
Mail queue test 50
Mail queue test 51
Mail queue test 52
Mail queue test 53
Mail queue test 54
Mail queue test 55
Mail queue test 56
Mail queue test 57
Mail queue test 58
Mail queue test 59
Mail queue test 6
Mail queue test 60
Mail queue test 61
Mail queue test 62
Mail queue test 63
Mail queue test 64
Mail queue test 65
Mail queue test 66
Mail queue test 67
Mail queue test 68
Mail queue test 69
Mail queue test 7
Mail queue test 70
Mail queue test 71
Mail queue test 72
Mail queue test 73
Mail queue test 74
Mail queue test 75
Mail queue test 76
Mail queue test 77
Mail queue test 78
Mail queue test 79
Mail queue test 8
Mail queue test 80
Mail queue test 81
Mail queue test 82
Mail queue test 83
Mail queue test 84
Mail queue test 85
Mail queue test 86
Mail queue test 87
Mail queue test 88
Mail queue test 89
Mail queue test 9
Mail queue test 90
Mail queue test 91
Mail queue test 92
Mail queue test 93
Mail queue test 94
Mail queue test 95
Mail queue test 96
Mail queue test 97
Mail queue test 98
Mail queue test 99
