Executing: deletead
challenge: {{.*}}

[+] response calculated: {{.*}}

{
    "status": "TRANS_ERROR", 
    "salted_passwd": "Tu contrase\u00f1a contiene caracteres inv\u00e1lidos", 
    "deletion_reason": "ERROR_DELETION_REASON_INVALID", 
    "error": "Tu contrase\u00f1a contiene caracteres inv\u00e1lidos"
}
