
replace replaces every occurence of 1st argument with 2nd argument in the 3rd argument.
dbc

strpad adds spaces at the end to make the returned string at least argument 2 chars long.
!hello     !

numpad adds zeros at the beginning to make the returned string at least argument 2 chars long.
!0000001234!

slice returns part of the 1st argument from the position given in second argument to position given in 3rd argument.
ll

substring returns part of the 1st argument from the position given in the second argument and the number of characters given in 3rd argument.
The third argument is optional, if not given the rest of the string is returned from 2nd argument.
llo 
llo there

streql and strcaseeql returns 1 if all the arguments are equal in strcmp or strcasecmp, otherwise 0.
Any number of arguments can be given (at least 2).
1
1
There's also strcmp similar to the C version.
-1
0
1

add, divide, multiply, modulo does the same as &(arg1 OP arg2) and are deprecated.
7 7
2 2
10 10
1 1

percent is the same as &(100 * arg1 / arg2), except that a number of decimals can be given as third arg.
78.18

divide still has a use since it takes a third argument, which can either be "ceil" or the number of decimals
to round down to.
3
2.5
2

Pretty number formatting
1 234 567 890
001 234 567 890
001,234,567,890

random_range returns a random value between 1st arg (inclusive) and 2nd arg (exclusive).
[0-9]+

random_token returns one of its arguments randomly.
[a-c]

concat concatenates all arguments into a single return value, for use for other function calls etc.
It is now deprecated as you should be able to use template blocks wherever you use this.
test test

str_len returns the length of the given string(s).
5
Also comes in an UTF-8 version
15

strpos returns the index of the first occurance of arg2 in arg1, strrpos returns the index of the last occurance.
0 5
strstrptrs is like in_array, but for a string. It returns the offset of the substring or empty string, similar to strpos.
Third argument is the list of field delimeters (each character is a valid delimeter):
10

strcount returns the number of occurrences of arg2 in arg1. strcount will return 0 if arg2 is an empty string.
3 0


include includes another template, but use the include filter instead.
test 


format_date converts the current time or the date given in arg 2 according to the strftime format in arg 1.
format_ts does the same for the given timestamp in arg 2.
2009-07-03 21:31
2009-07-0[34] ..:..

sum_array sums the integer values of the list given.
Argument 2 is a flag to indicate that the list is actually a list with variable names to use to lookup the value.
6



6

weekday returns the weekday number for a given date (1 - 7 for mon - sun).
3

clean_qs removes variables from a query string. It support html-encoded query strings as well.
b=2
clean_url_qs does the same, but on URLs (ie it searches for ? first).
/foobar?b=2
/foobar?b=2
/foobar?b=2
/foobar?a=b

define_month_days defines a list of dates for a given month.

2009-07-01 2009-07-02 2009-07-03 2009-07-04 2009-07-05 2009-07-06 2009-07-07 2009-07-08 2009-07-09 2009-07-10 2009-07-11 2009-07-12 2009-07-13 2009-07-14 2009-07-15 2009-07-16 2009-07-17 2009-07-18 2009-07-19 2009-07-20 2009-07-21 2009-07-22 2009-07-23 2009-07-24 2009-07-25 2009-07-26 2009-07-27 2009-07-28 2009-07-29 2009-07-30 2009-07-31 

define_list defines a numeric list, the name is given in the first argument.
With two arguments the value is from 0 to the second argument exclusive.
With three arguments the second is the start value and the third the end value.
With four arguments the last one is used for stepping.

0 1 

now returns the current date.
....-..-.. ..:..:..

undef removes variables. It is deprecated and might cause crashes in certain situations.



timediff diffs the given timestamp (if one argument) or date + format (if two arguments) to current time.
[0-9]+
[0-9]+

dump_timers outputs recorded template_timers if those are enabled, otherwise it's undefined.
It only works after a template has returned completely.


str_in check the first argument against all the rest and returns 1 if it
matches any of them, otherwise 0.
1

strip_tags removes < and > and everything inbetween.
hello there

ifnull returns the first argument that is not an empty string.
Only use it for heavy functions since it is slower than a simple if.
itwasnull
itwasnull

vtree_js produces as js array from a vtree node.
vtree_js_arrays will use an array instead of object if it detects numeric keys.
{"1": {"keys": {"1": "x1","2": "list1"},"test": {"one": {"value": "answer:yes"},"two": {"value": "answer:nope"}}}}
{
	"1": {
		"keys": {
			"1": "x1",
			"2": "list1"
		},
		"test": {
			"one": {
				"value": "answer:yes"
			},
			"two": {
				"value": "answer:nope"
			}
		}
	}
}
{"1": {"default": "answer:yes\nno\tmaybe"}}
[{"keys": ["x1","list1"],"test": {"one": {"value": "answer:yes"},"two": {"value": "answer:nope"}}}]
You can also specify the path as strings.
In that case the node should be given with each step as a separate argument.
[{"keys": ["x1","list1"],"test": {"one": {"value": "answer:yes"},"two": {"value": "answer:nope"}}}]

utf8_to_latin1 converts strings.
εδφ

maxint and minint checks all of the arguments for the highest or lowest value.
4711
17

fmultiply and fcmp has eventually be added. Please do not use them for money.
17.270000 == 17.27
-1 0 1

timestamp is a simple wrapper for time(NULL) in case %TSNOW is not available.
.+

