220 Welcome.
token:X.+
subtotal.published:0
subtotal.pending_review:0
subtotal.refused:0
subtotal.unpaid_unverified:0
subtotal.deleted:1
subtotal.hidden:0
subtotal.disabled:0
subtotal.deactivated:0
total:1
ad.0.filter:deleted
ad.0.ad.ad_id:15
ad.0.ad.list_id:7944711
ad.0.ad.list_time:2005-06-17 12:13:14
ad.0.ad.can_edit_ad:t
ad.0.ad.status:deleted
ad.0.ad.type:sell
ad.0.ad.name:Blocket
ad.0.ad.phone:08-2394424
ad.0.ad.region:1
ad.0.ad.city:0
ad.0.ad.category:5020
ad.0.ad.user_id:9
ad.0.ad.passwd:trattskalle
ad.0.ad.phone_hidden:0
ad.0.ad.company_ad:0
ad.0.ad.subject:Deleted 15
ad.0.ad.body:Hello, this is a deleted ad.
ad.0.ad.price:300
ad.0.ad.orig_list_time:2005-06-17 12:13:14
ad.0.ad.orig_price:300
ad.0.ad.has_active_pack:0
ad.0.images.0.name:2177618189.jpg
ad.0.images.0.digest_present:0
ad.0.images.1.name:5177618001.jpg
ad.0.images.1.digest_present:0
ad.0.images.2.name:5177618002.jpg
ad.0.images.2.digest_present:0
ad.0.actions.action_id:2
ad.0.actions.action_type:delete
ad.0.actions.current_state:.*
ad.0.actions.state:deleted
ad.0.actions.transition:user_deleted
ad.0.actions.timestamp:2005-06-18 12:13:14
ad.0.actions.remote_addr:127.0.0.1
ad.0.actions.queue:normal
ad.0.actions.locked:0
ad.0.actions.has_parent:f
ad.0.actions.reg_state_id:72
ad.0.actions.regtime:2005-06-17 12:13:14
ad.0.actions.paytime:2005-06-17 12:13:14
ad.0.actions.publishtime:2005-06-17 12:13:14
ad.0.users.name:Blocket
ad.0.users.uid:7
ad.0.users.email:user9_uid7@blocket.se
ad.0.users.account:0
ad.0.user_params.first_inserted_ad:20.*
ad.0.uid.count:1
ad.0.pre_refuse_action_type.action_type:delete
ad.0.uf.value:22245,5290
ad.0.is_in_list.whitelist:f
status:TRANS_OK
end
