220 Welcome.
ad_subject:Testannons 12
region:11
action_type:new
pack_result:-1
pay_status:0
pay_log:PAID 80015 (08858223, ....-..-.. ..:..:.., user5_uid3@blocket.se, 40 kr) (ad_id: 12)
status:TRANS_OK
end
