ad_id,category,job_category
126,7020,1|2|3
127,7020,20
128,7020,4|5|6
131,7020,1
132,7020,2
133,7020,3
134,7020,4
135,7020,5
136,7020,6
137,7020,7
138,7020,8
139,7020,9
140,7020,10
141,7020,11
142,7020,12
143,7020,13
144,7020,14
145,7020,15
150,7020,1|2|3|4|5|6|7|8|9|10|11|12|13|14|15
