220 Welcome.
ad_id:148
list_id:8000102
list_time:2015-03-18 11:03:50
subject:Autorrad Ruda 2009
category:2020
price:12000
ad_status:pack_show
ad_media_id:
image_count:0
daily_bump:
weekly_bump:
label:
gallery_date:
ad_pack_status:1
autobump:
paid:t
views:0
mails:0
region:10
on_asearch:1
ad_id:200
list_id:8000199
list_time:2015-03-18 10:54:08
subject:American Truck
category:2040
price:1200000
ad_status:disabled
ad_media_id:
image_count:0
daily_bump:
weekly_bump:
label:
gallery_date:
ad_pack_status:0
autobump:
paid:t
views:0
mails:0
region:0
on_asearch:0
ad_id:146
list_id:8000099
list_time:2015-03-18 10:54:08
subject:American Motors Cherokee 2014
category:2020
price:1200000
ad_status:disabled
ad_media_id:
image_count:0
daily_bump:
weekly_bump:
label:
gallery_date:
ad_pack_status:0
autobump:
paid:t
views:0
mails:0
region:0
on_asearch:0
ad_id:127
list_id:8000086
list_time:2015-03-17 18:31:59
subject:Acadian Sedan 1978
category:2020
price:123123
ad_status:disabled
ad_media_id:1108523319
image_count:1
daily_bump:
weekly_bump:
label:
gallery_date:
ad_pack_status:0
autobump:
paid:t
views:0
mails:0
region:0
on_asearch:0
ad_id:126
list_id:8000085
list_time:2015-03-17 17:55:09
subject:Acadian Sedan 1978
category:2020
price:
ad_status:disabled
ad_media_id:
image_count:0
daily_bump:
weekly_bump:
label:
gallery_date:
ad_pack_status:0
autobump:
paid:t
views:0
mails:0
region:0
on_asearch:0
ad_id:147
list_id:8000101
list_time:2015-03-18 11:01:26
subject:Mesa
category:5020
price:120000
ad_status:published
ad_media_id:
image_count:0
daily_bump:
weekly_bump:
label:
gallery_date:
ad_pack_status:
autobump:
paid:t
views:0
mails:0
region:10
on_asearch:1
ad_id:91
list_id:8000070
list_time:2013-08-30 12:23:57
subject:Libro 3
category:6120
price:14000
ad_status:published
ad_media_id:
image_count:0
daily_bump:
weekly_bump:
label:
gallery_date:
ad_pack_status:
autobump:
paid:t
views:0
mails:0
region:15
on_asearch:1
ad_id:71
list_id:8000051
list_time:2013-08-23 12:22:09
subject:El joven manos de tijera poster pelicula 54 x 41
category:6160
price:1200
ad_status:published
ad_media_id:
image_count:0
daily_bump:
weekly_bump:
label:
gallery_date:
ad_pack_status:
autobump:
paid:t
views:0
mails:0
region:15
on_asearch:1
ad_id:79
list_id:8000059
list_time:2013-08-23 12:22:09
subject:Cinegrama star wars - natalie portman
category:6120
price:1200
ad_status:published
ad_media_id:
image_count:0
daily_bump:
weekly_bump:
label:
gallery_date:
ad_pack_status:
autobump:
paid:t
views:0
mails:0
region:15
on_asearch:1
ad_id:70
list_id:8000050
list_time:2013-08-23 12:22:09
subject:Maquina Singer antigua
category:6160
price:75000
ad_status:published
ad_media_id:
image_count:0
daily_bump:
weekly_bump:
label:
gallery_date:
ad_pack_status:
autobump:
paid:t
views:0
mails:0
region:15
on_asearch:1
ad_id:82
list_id:8000062
list_time:2013-08-23 12:22:09
subject:Libro para Psicologo Manual Diagnostico
category:6120
price:70000
ad_status:published
ad_media_id:
image_count:0
daily_bump:
weekly_bump:
label:
gallery_date:
ad_pack_status:
autobump:
paid:t
views:0
mails:0
region:15
on_asearch:1
page_ads:11
n_ads:11
n_pack_ads:5
status:TRANS_OK
end
