
Search filter tests for values with colon.

as__info_count_level_0 -> indonly , indonly , indonly , 
as__info_count_level_1 -> for:all , bumps:onto , jumps:over , 
as__info_count_level_2 -> 1 , 2 , 3 , 
as__info_filtered -> 6 , 
as__info_lines -> 6 , 
as__info_to_id -> 4711 , 
as_attrind -> smink:the , liked:a , ไทย:ได้ , grown:fox , the:time , brown:fox , 
as_attronly -> in:and , i:mad , พูด:ภาษา , a:quick , now:is , the:quick , 
as_id -> 4 , 3 , 6 , 5 , 2 , 1 , 
as_order -> 5 , 2 , 1 , 1 , 1 , 1 , 
as_suborder -> 3 , 0 , 6 , 4 , 0 , 0 , 


as__info_count_level_0 -> indonly
as__info_count_level_1 -> for:all
as__info_count_level_2 -> 1
as__info_filtered -> 6
as__info_lines -> 6
as__info_to_id -> 4711
as_attrind -> smink:the
as_attronly -> in:and
as_id -> 4
as_order -> 5
as_suborder -> 3
as__info_count_level_0 -> indonly
as__info_count_level_1 -> bumps:onto
as__info_count_level_2 -> 2
as__info_filtered -> 6
as__info_lines -> 6
as__info_to_id -> 4711
as_attrind -> liked:a
as_attronly -> i:mad
as_id -> 3
as_order -> 2
as_suborder -> 0
as__info_count_level_0 -> indonly
as__info_count_level_1 -> jumps:over
as__info_count_level_2 -> 3
as__info_filtered -> 6
as__info_lines -> 6
as__info_to_id -> 4711
as_attrind -> ไทย:ได้
as_attronly -> พูด:ภาษา
as_id -> 6
as_order -> 1
as_suborder -> 6
as__info_count_level_0 -> indonly
as__info_count_level_1 -> for:all
as__info_count_level_2 -> 1
as__info_filtered -> 6
as__info_lines -> 6
as__info_to_id -> 4711
as_attrind -> grown:fox
as_attronly -> a:quick
as_id -> 5
as_order -> 1
as_suborder -> 4
as__info_count_level_0 -> indonly
as__info_count_level_1 -> bumps:onto
as__info_count_level_2 -> 2
as__info_filtered -> 6
as__info_lines -> 6
as__info_to_id -> 4711
as_attrind -> the:time
as_attronly -> now:is
as_id -> 2
as_order -> 1
as_suborder -> 0
as__info_count_level_0 -> indonly
as__info_count_level_1 -> jumps:over
as__info_count_level_2 -> 3
as__info_filtered -> 6
as__info_lines -> 6
as__info_to_id -> 4711
as_attrind -> brown:fox
as_attronly -> the:quick
as_id -> 1
as_order -> 1
as_suborder -> 0


{
	"conf": {
		"foo": {
			"bar": "17"
		},
		"footprint": "c2feb70412a328545570e444b63631d7e01d71bd",
		"test": {
			"conf": "4711"
		}
	},
	"info": {
		"conf_query": "F:init ",
		"count_level": {
			"indonly": {
				"bumps:onto": "2",
				"for:all": "1",
				"jumps:over": "3"
			}
		},
		"filtered": "6",
		"footprint": "c2feb70412a328545570e444b63631d7e01d71bd",
		"lines": "6",
		"query": "0 count_level:indonly:- attrind:- *:*",
		"to_id": "4711"
	},
	"row": {
		"0": {
			"attrind": "smink:the",
			"attronly": "in:and",
			"id": "4",
			"order": "5",
			"suborder": "3"
		},
		"1": {
			"attrind": "liked:a",
			"attronly": "i:mad",
			"id": "3",
			"order": "2",
			"suborder": "0"
		},
		"2": {
			"attrind": "ไทย:ได้",
			"attronly": "พูด:ภาษา",
			"id": "6",
			"order": "1",
			"suborder": "6"
		},
		"3": {
			"attrind": "grown:fox",
			"attronly": "a:quick",
			"id": "5",
			"order": "1",
			"suborder": "4"
		},
		"4": {
			"attrind": "the:time",
			"attronly": "now:is",
			"id": "2",
			"order": "1",
			"suborder": "0"
		},
		"5": {
			"attrind": "brown:fox",
			"attronly": "the:quick",
			"id": "1",
			"order": "1",
			"suborder": "0"
		}
	}
}


