
<svg width="62px" height="68px" viewBox="0 0 62 68" version="1.1" xmlns="http://www.w3.org/2000/svg" xmlns:xlink="http://www.w3.org/1999/xlink">
	<g stroke="none" stroke-width="1" fill="none" fill-rule="evenodd">
		<g transform="translate(-51, -139)">
			<g transform="translate(51, 139)">
				<path d="M1.92640073,17.5455636 C1.92640073,17.5455636 0,18.9090545 0,21.2649333 L0,47.909297 C0,49.6918424 1.28738431,51.9101212 2.88232774,52.8337091 C5.44047153,54.3149939 26.1425255,66.0339273 28.062692,67.1472364 C29.9838974,68.259503 32.190842,67.5120848 32.190842,67.5120848 C32.190842,67.5120848 29.934023,66.4352606 29.934023,65.4407879 L29.934023,37.9739515 C29.934023,36.5937818 28.8908157,35.4898545 27.5130339,34.3838424 C26.1383693,33.2809576 5.22746606,21.6881576 3.85280146,20.5831879 C2.47813686,19.4792606 1.92640073,17.5455636 1.92640073,17.5455636" fill="#CF4C00"></path>
				<path d="M30.1984615,34.7313867 C31.9482235,36.4878715 31.9482235,36.8787806 31.9482235,38.2443564 C31.9482235,39.6109745 32.3378677,64.4008655 32.3378677,65.3765745 C32.3378677,66.3533261 34.0564582,67.4040897 35.0622597,67.1330594 C36.065983,66.8630715 57.2387272,54.2507806 58.9916064,53.0801382 C60.7403294,51.9084533 61.1299735,50.1519685 61.1299735,48.9802836 C61.1299735,47.8096412 61.3253151,24.1914352 61.3253151,22.4349503 C61.3253151,20.677423 59.9631192,19.7006715 58.211279,20.2865139 C56.461517,20.8713139 36.228075,33.7556776 34.6746936,34.34152 C33.1150779,34.92632 30.1984615,34.7313867 30.1984615,34.7313867" fill="#F65B00"></path>
				<path d="M60.7398099,18.7254836 C57.8221544,18.335617 57.4345883,18.920417 55.4884456,19.7001503 C53.543342,20.4819685 34.8674376,31.8037382 33.5052416,32.3885382 C32.1440847,32.9743806 30.3912055,33.1693139 27.8631942,31.9986715 C25.3320657,30.8269867 6.07533175,19.7001503 4.51779416,18.7254836 C2.96233467,17.7497745 2.96233467,16.3821139 4.12815,15.6023806 C5.29708248,14.8216048 28.0564577,2.13321697 29.0290095,1.54737455 C30.0026004,0.962574545 31.7544405,0.182841212 33.3119781,1.15646545 C34.8674376,2.13321697 57.8221544,15.4074473 58.7947062,16.1871806 C59.7693361,16.9679564 60.7398099,18.7254836 60.7398099,18.7254836" fill="#FF8637"></path>
				<path d="M54.7038581,41.7550327 L54.5085165,47.4206085 L48.6659322,50.9387903 L48.6659322,45.2721721 L54.7038581,41.7550327 Z M54.7038581,28.2994206 L50.8084556,30.4499418 L51.0027581,33.3530933 L46.7478439,32.9621842 L33.8927038,50.3519055 L34.7862877,53.0872267 L36.8165935,51.9165842 L36.8165935,61.6559539 L41.2949038,59.1437115 L41.2949038,49.1791782 L46.1618191,46.6387903 L46.1618191,56.4083903 L56.8453424,50.1569721 L56.8453424,39.2146448 L59.9614567,37.2600994 L59.9614567,35.3055539 L54.5085165,34.1328267 L54.7038581,28.2994206 Z" fill="#FFFFFF"></path>
				<path d="M24.4425341,23.6077818 C24.5703373,23.6004848 24.6773596,23.6755394 24.8924432,23.8339879 L25.8410968,24.3604121 C26.333607,24.6460364 26.37413,24.6314424 25.8410968,24.9118545 L24.8924432,25.463297 C24.4643541,25.7113939 24.3936986,25.7781091 23.9676877,25.463297 L23.0190341,24.9118545 C22.5254848,24.6251879 22.4839227,24.637697 23.0190341,24.3604121 L23.9676877,23.8339879 C24.1827713,23.7099394 24.3136917,23.6161212 24.4425341,23.6077818 M21.7451574,22.0305939 C21.8719216,22.0212121 22.0069983,22.0733333 22.2200038,22.229697 L23.1437202,22.780097 C23.6362304,23.0678061 23.6767534,23.0281939 23.1437202,23.3086061 L22.2200038,23.8600485 C21.7919147,24.107103 21.6984001,24.1738182 21.2703111,23.8600485 L20.3195793,23.3086061 C19.8281081,23.0219394 19.7886242,23.0615515 20.3195793,22.780097 L21.2703111,22.229697 C21.4843556,22.1056485 21.6183932,22.0389333 21.7451574,22.0305939 M27.3134322,22.0034909 C27.4422746,21.9961939 27.5482578,22.0733333 27.7654195,22.229697 L28.7109559,22.7571636 C29.2076224,23.0427879 29.2460673,23.0281939 28.7109559,23.3086061 L27.7654195,23.8600485 C27.3362914,24.107103 27.2656359,24.1738182 26.8396249,23.8600485 L25.8909713,23.3086061 C25.3953439,23.0219394 25.3548209,23.0354909 25.8909713,22.7571636 L26.8396249,22.229697 C27.0547085,22.1056485 27.186668,22.0139152 27.3134322,22.0034909 M24.6170946,20.4252606 C24.745937,20.4179636 24.8789355,20.4700848 25.091941,20.6274909 L26.0156574,21.1778909 C26.5081676,21.4624727 26.5476516,21.4249455 26.0156574,21.7032727 L25.091941,22.2557576 C24.6617738,22.5038545 24.5703373,22.5705697 24.1422483,22.2557576 L23.2174928,21.7032727 C22.7249826,21.4176485 22.6854986,21.4572606 23.2174928,21.1778909 L24.1422483,20.6274909 C24.3562928,20.5034424 24.4903304,20.4346424 24.6170946,20.4252606 M18.9230946,20.4252606 C19.0508979,20.4179636 19.1828574,20.4700848 19.3969019,20.6274909 L20.3465946,21.1778909 C20.8401439,21.4624727 20.8806669,21.4499636 20.3465946,21.7293333 L19.3969019,22.2807758 C18.9688129,22.5299152 18.8763373,22.5945455 18.4482483,22.2807758 L17.5255709,21.7293333 C17.0309826,21.4437091 16.9914986,21.4572606 17.5255709,21.1778909 L18.4482483,20.6274909 C18.6633319,20.5034424 18.7952914,20.4346424 18.9230946,20.4252606 M30.1105578,20.4002424 C30.2383611,20.3929455 30.3474614,20.4700848 30.5615059,20.6274909 L31.5091205,21.1528727 C32.0037089,21.4374545 32.0452709,21.4249455 31.5091205,21.7032727 L30.5615059,22.2557576 C30.1313388,22.5038545 30.0638005,22.5705697 29.6367505,22.2557576 L28.6880968,21.7032727 C28.1914304,21.4176485 28.1529855,21.4322424 28.6880968,21.1528727 L29.6367505,20.6274909 C29.850795,20.5034424 29.9837935,20.4096242 30.1105578,20.4002424 M27.4152592,18.8230545 C27.5409844,18.8136727 27.675022,18.8657939 27.8880275,19.0232 L28.8117439,19.5736 C29.3052932,19.8613091 29.3458162,19.821697 28.8117439,20.1010667 L27.8880275,20.6525091 C27.4599384,20.9006061 27.3653848,20.9662788 26.9383348,20.6525091 L26.0156574,20.1010667 C25.5210691,19.8144 25.4805461,19.8519273 26.0156574,19.5736 L26.9383348,19.0232 C27.1534184,18.8991515 27.2874559,18.8303515 27.4152592,18.8230545 M21.79711,18.8230545 C21.9217961,18.8136727 22.0547946,18.8657939 22.2709173,19.0232 L23.2174928,19.5736 C23.7120811,19.8613091 23.7526041,19.8456727 23.2174928,20.1260848 L22.2709173,20.6764848 C21.8407501,20.9256242 21.7732118,20.9902545 21.3461618,20.6764848 L20.3975081,20.1260848 C19.9029198,19.8404606 19.8623968,19.8519273 20.3975081,19.5736 L21.3461618,19.0232 C21.5602063,18.8991515 21.6661895,18.8303515 21.79711,18.8230545 M24.5921574,17.2198061 C24.7189216,17.2093818 24.8539983,17.261503 25.0659647,17.4189091 L26.0156574,17.9703515 C26.5081676,18.2570182 26.5476516,18.2434667 26.0156574,18.5217939 L25.0659647,19.0732364 C24.6368366,19.3213333 24.5703373,19.3880485 24.1422483,19.0732364 L23.1935946,18.5217939 C22.7000454,18.2372121 22.6605614,18.2486788 23.1935946,17.9703515 L24.1422483,17.4189091 C24.3562928,17.295903 24.4653932,17.227103 24.5921574,17.2198061 M36.3552549,10.4044364 C36.9371235,10.3481455 37.5034063,10.6160485 38.4769972,11.1810424 L42.173941,13.3096727 C44.7487096,14.5084606 43.5673085,14.6210424 41.5484322,15.7896 L36.6545016,18.6468848 C34.6823826,20.0437333 34.3093632,20.1271273 32.3601034,18.9981818 L28.6880968,16.8685091 C26.1133282,15.6707636 27.2656359,15.5571394 29.2865903,14.386497 L34.2054581,11.531297 C35.1935957,10.8328727 35.7713081,10.4586424 36.3552549,10.4044364 M36.6545016,7.5982303 C35.9874308,7.6409697 32.8640432,9.4641697 31.741868,10.1136 L17.0289045,18.6354182 C14.5767439,20.0583273 12.1245833,21.4781091 17.0289045,24.3208 L19.4810651,25.7405818 C24.3853862,28.5811879 26.8375468,27.1614061 29.2897074,25.7405818 L44.00371,17.2166788 C46.7935622,15.7562424 49.0244049,14.4542545 46.444441,12.9583758 L48.9163435,11.531297 L46.444441,10.1021333 L43.9953976,11.531297 L41.5505103,10.1136 C40.4345695,9.28904242 37.3215724,7.55340606 36.6545016,7.5982303" fill="#FFFFFF"></path>
				<path d="M23.265497,45.9964485 C23.6250086,46.1997212 23.9543878,46.4582424 24.2203849,46.7688848 C24.9310959,47.5924 24.8022535,48.9850788 24.2203849,49.2321333 C23.2156225,49.6574424 20.3322557,48.356497 19.9633926,46.7647152 C19.6184276,45.2719636 21.7058813,45.1176848 23.265497,45.9964485 M5.58500354,35.7535879 C7.14461923,36.6834303 9.25181485,39.2665576 8.90892799,40.3600606 C8.54110391,41.5254909 5.63279989,39.4729576 4.63011558,37.8811758 C4.04720792,36.9617576 3.91836558,35.4189697 4.63011558,35.4189697 C4.89715172,35.4189697 5.22549186,35.5409333 5.58500354,35.7535879 M14.3826492,33.9210061 C17.2088681,35.559697 20.0350871,37.7112606 21.8523875,39.8169576 C23.4733072,41.6912364 23.7424214,44.1815879 23.7424214,44.1815879 C17.5070758,39.5511394 11.2769254,35.8943152 5.04157982,33.3466303 C5.04157982,33.3466303 5.29095208,31.1617091 6.91083274,31.1617091 C8.73748456,31.1617091 11.5553911,32.2812727 14.3826492,33.9210061 M14.4252503,32.5085212 C11.2021138,30.6373697 7.97274296,29.3718667 5.88840646,29.3718667 C4.04305172,29.3729091 3.76042982,33.2590667 3.76042982,33.2590667 C3.76042982,33.2590667 3.75419551,29.3604 1.61998456,29.3583152 C-0.512148285,29.3583152 1.63245318,31.829903 1.63245318,31.829903 L2.71930062,33.7010545 L1.63245318,34.314 L1.63245318,44.1857576 C1.61998456,46.6573455 5.88840646,46.6542182 5.88840646,46.6542182 L8.0163831,46.6656848 L20.8112583,54.0762788 L22.940274,56.5301455 C22.940274,56.5301455 27.2149302,61.4837455 27.2180473,59.0090303 L27.2180473,49.1362303 L26.1976992,47.3026061 L27.2180473,46.6521333 C27.2180473,46.6521333 29.3481021,46.6573455 27.2149302,44.1847152 C25.076563,41.7110424 25.0900707,45.6149212 25.0900707,45.6149212 C25.0900707,45.6149212 24.7877068,41.3837212 22.9381959,39.2467515 C20.8652889,36.8450061 17.6483868,34.375503 14.4252503,32.5085212" fill="#FFFFFF"></path>
			</g>
		</g>
	</g>
</svg>

