<svg xmlns="http://www.w3.org/2000/svg" xmlns:xlink="http://www.w3.org/1999/xlink" width="63" height="63" viewBox="0 0 63 63">
    <defs>
        <path id="a" d="M0 .37h62.63V63H0z"/>
    </defs>
    <g fill="none" fill-rule="evenodd">
        <mask id="b" fill="#fff">
            <use xlink:href="#a"/>
        </mask>
        <path fill="#5F259F" d="M57.726 14.532c-.309.247-.637.475-.98.688v-5.106c0-2.13-1.73-3.861-3.86-3.861h-3.672c.802-2.367 3.061-4.045 5.633-4.045a5.952 5.952 0 0 1 5.945 5.945c0 2.612-1.03 4.757-3.066 6.379zm-12.89 4.322c.89.204 1.883.327 2.93.364a3.006 3.006 0 0 1-2.724 1.743 3.007 3.007 0 0 1-3.003-3.003 3.007 3.007 0 0 1 3.003-3.003 3.01 3.01 0 0 1 2.948 2.428 13.966 13.966 0 0 1-2.743-.322.92.92 0 1 0-.41 1.793zM54.91 33.281c0 .802-.312 1.556-.88 2.123L28.865 60.572a2.026 2.026 0 0 1-2.861 0L2.43 36.997a2.024 2.024 0 0 1 0-2.86L27.596 8.97a2.983 2.983 0 0 1 2.122-.879h23.168c1.116 0 2.023.908 2.023 2.023v6.04c-1.603.659-3.37 1.04-5.068 1.176a4.847 4.847 0 0 0-4.8-4.213 4.847 4.847 0 0 0-4.84 4.84 4.847 4.847 0 0 0 4.84 4.842 4.849 4.849 0 0 0 4.684-3.612c1.72-.114 3.508-.455 5.184-1.06v15.154zM54.847.37c-3.576 0-6.69 2.478-7.547 5.883H29.718a4.81 4.81 0 0 0-3.423 1.418L1.13 32.837a3.865 3.865 0 0 0 0 5.46l23.573 23.574A3.849 3.849 0 0 0 27.432 63c.99 0 1.98-.377 2.73-1.13L55.33 36.705a4.81 4.81 0 0 0 1.417-3.423V17.33c.757-.388 1.471-.84 2.124-1.36 2.46-1.96 3.76-4.663 3.76-7.817C62.63 3.86 59.138.37 54.846.37z" mask="url(#b)"/>
    </g>
</svg>
