Executing: view
challenge: {{.*}}

[+] response calculated: {{.*}}

{
    "body": "Soy muy diestro programando en Basic y Pascal", 
    "category": "7040", 
    "ad_id": "8000004", 
    "name": "Boris Cruchet", 
    "parameters": [
        {
            "id": "communes", 
            "value": "297"
        }, 
        {
            "id": "job_category", 
            "value": "20|24"
        }
    ], 
    "area": "", 
    "region": "15", 
    "subject": "Busco empleo de programador", 
    "phone": "1234567890", 
    "not_editable": [
        "ad_id", 
        "area", 
        "category", 
        "company_ad", 
        "email", 
        "list_time", 
        "name", 
        "region", 
        "type"
    ], 
    "phone_hidden": "0", 
    "company_ad": "0", 
    "images": [
        "https://{{.*}}/images/0/0"
    ], 
    "ad_status": "active", 
    "no_salesmen": "", 
    "type": "s", 
    "email": "boris@schibsted.cl", 
    "list_time": "2012-11-07 18:44:52"
}
