220 Welcome.
token:.*
refund_search.0.doc_num:2
refund_search.0.payment_method:webpay
refund_search.0.user_name:Usuario 01
refund_search.0.email:user.01@schibsted.cl
refund_search.0.ad_id:118
refund_search.0.category:8020
refund_search.0.product_id:102
refund_search.0.price:3600
refund_search.0.refund_first_name:User2
refund_search.0.refund_last_name:One2
refund_search.0.refund_rut:100000-4
refund_search.0.refund_email:user.01@schibsted.cl
refund_search.0.refund_bank_account_type:2
refund_search.0.refund_bank_id:3
refund_search.0.refund_bank_account_number:5151515151551
refund_search.0.refund_date:2015-07-13 11:26:02.848486
refund_search.0.refund_status:pending
refund_search.0.refund_id:3
refund_search.1.doc_num:6
refund_search.1.payment_method:webpay
refund_search.1.user_name:blocket
refund_search.1.email:prepaid5@blocket.se
refund_search.1.ad_id:95
refund_search.1.category:6120
refund_search.1.product_id:101
refund_search.1.price:2700
refund_search.1.refund_first_name:Blocketa
refund_search.1.refund_last_name:Five
refund_search.1.refund_rut:100000-4
refund_search.1.refund_email:prepaid5@blocket.se
refund_search.1.refund_bank_account_type:3
refund_search.1.refund_bank_id:10
refund_search.1.refund_bank_account_number:123124-124124-124
refund_search.1.refund_date:2015-07-13 11:31:14.86915
refund_search.1.refund_status:pending
refund_search.1.refund_id:5
status:TRANS_OK
end
