220 Welcome.
ad_id:122
subject:Test 07
body:asdad asdasdaasd
category:8020
price:0
currency:peso
image:0100012349.jpg
email:user.01@schibsted.cl
account_id:7
require_password:t
ad_status:active
list_id:8000082
list_time:2014-03-31 17:22:15
pack_status:
has_duplicates:1
status:TRANS_OK
end
