Executing: rules
challenge: {{.*}}

[+] response calculated: {{.*}}

{
    "es": {
        "rules": [
            {
                "description": "No se permite publicar avisos en el mismo art\u00edculo, servicio o trabajo m\u00e1s de una vez. Si el usuario quiere publicar un aviso de un producto anunciado anteriormente deber\u00e1 eliminar el primero antes de volver a publicar. Del mismo modo, no se permite publicar avisos con los mismos elementos, servicios o puestos de trabajo en diferentes categor\u00edas o regiones.", 
                "title": "No est\u00e1n permitidos los avisos duplicados"
            }, 
            {
                "description": "No se permite publicar enlaces a otros sitios, avisos de subastas en l\u00ednea, correos electr\u00f3nicos, cuentas de sistemas de mensajer\u00eda o redes sociales.", 
                "title": "Enlaces, correos, sistemas de mensajer\u00eda o redes sociales"
            }, 
            {
                "description": "El precio del producto o servicio debe ser el final. No se permiten avisos con precios en cuotas, m2 o por partes. Yapo.cl se reserva el derecho a modificar o borrar precios incoherentes que no tengan relaci\u00f3n con el producto ofrecido.", 
                "title": "Precio"
            }, 
            {
                "description": "Es aquel publicado por una persona natural que no comercializa su producto o servicio a trav\u00e9s de un uso avanzado del sitio.", 
                "title": "Aviso 'Persona'"
            }, 
            {
                "description": "Es aquel publicado por una persona natural o jur\u00eddica que comercializa su producto o servicio a trav\u00e9s de un uso avanzado del sitio.\n\nSe considera que un usuario le da un uso avanzado al sitio cuando cumple alguna de las siguientes condiciones: Supera 5 avisos activos en cualquiera de las siguientes categor\u00edas: Veh\u00edculos, sin contabilizar los avisos publicados en la categor\u00eda de Accesorios y piezas para veh\u00edculos; Servicios, negocios y empleo, sin contabilizar los avisos publicados en Busco empleo. O, supera los 3 avisos activos en las subcategor\u00edas de Inmuebles, Vendo o Arriendo.\n\nEn caso que cumpla algunas de las condiciones anteriores todos los avisos publicados por el usuario pasar\u00e1n a ser de tipo 'Profesional'.\n\nYapo.cl se reserva el derecho de decidir cuando un aviso debe ser clasificado como 'Persona' o 'Profesional'.", 
                "title": "Aviso 'Profesional'"
            }, 
            {
                "content": {
                    "items": [
                        "Alimentos perecibles.", 
                        "Bebidas o licores abiertos.", 
                        "Paquetes de viajes y pasajes.", 
                        "Pornograf\u00eda.", 
                        "Productos de sex shop.", 
                        "Solicitudes de donaciones.", 
                        "Cigarros y cualquier producto a base de tabaco.", 
                        "Entradas de cualquier tipo (eventos, festivales, shows, fiestas , deportes, cine, etc.)", 
                        "Cuentas corrientes, cr\u00e9ditos, d\u00e9bitos.", 
                        "Medicamentos.", 
                        "Masajes que no sean de empresa o personas sin certificaci\u00f3n.", 
                        "Acciones, t\u00edtulos, productos financieros, seguros y planes de salud.", 
                        "Recetas m\u00e9dicas, cosm\u00e9ticas y qu\u00edmicas, productos de hospitales, vitaminas, quema grasas, pastillas rejuvenecedoras.", 
                        "Ropa interior, sabanas y toallas usadas, toallas sanitarias tipo Anion.", 
                        "Cilindros de oxigeno o de gas.", 
                        "Lentes de contacto.", 
                        "Bases de datos de correos electr\u00f3nicos.", 
                        "Registros personales o de empresas.", 
                        "Documentos de identificaci\u00f3n (CI, pasaporte, diplomas, etc.).", 
                        "Autos con orden de embargo.", 
                        "Tarot, esoterismo.", 
                        "Marketing de multi-nivel, piramidal y trabajos desde casa o comisi\u00f3n.", 
                        "Aprobaci\u00f3n y registro en organismos gubernamentales como: registro civil, municipios, etc.", 
                        "Cupones de descuentos, km a\u00e9reos.", 
                        "Licencias concedidas por organismos p\u00fablicos.", 
                        "Hacking y Cracking.", 
                        "Art\u00edculos de beneficencia (sin permiso Yapo).", 
                        "Decodificadores de tv por cable gratis.", 
                        "Avisos de citas.", 
                        "Sustancias qu\u00edmicas y peligrosas.", 
                        "Flora y fauna en peligro de extinci\u00f3n o sin debida autorizaci\u00f3n del entidades gubernamentales.", 
                        "Productos que infrinjan la ley de protecci\u00f3n del patrimonio hist\u00f3rico y cultural del pa\u00eds.", 
                        "Apuestas, bingos y cualquier juego de azar.", 
                        "Integrantes para equipos deportivos, bandas, etc.", 
                        "Acupuntura", 
                        "Gorgojos", 
                        "Apiterapia", 
                        "Hongos tibetanos", 
                        "Ara\u00f1as pollitos", 
                        "Ibox, Dongles, IKS/SKS", 
                        "Armas con postones (y de fuego)", 
                        "Fotocopias de libro (Producto original)", 
                        "Art\u00edculos nazis", 
                        "Jeringas", 
                        "Auriculoterapia", 
                        "Libros en PDF (Producto original)", 
                        "Autos sin papeles y con orden de embargo", 
                        "Mel\u00f3n de reuma", 
                        "Bosque nativo", 
                        "Moringa", 
                        "Socios capitalistas", 
                        "Membres\u00edas", 
                        "Celulares bloqueados por IMEI / chip bloqueado", 
                        "Yacimientos", 
                        "Cirope de sabia", 
                        "Ondulaci\u00f3n y permanente de pesta\u00f1as", 
                        "Cirug\u00edas dentales", 
                        "Ouijas", 
                        "Compromisos de compraventa", 
                        "Gift card", 
                        "Cuentas online", 
                        "Ropa y accesorios de militares", 
                        "Cuentas Steam", 
                        "Servicio de importaci\u00f3n/exportaci\u00f3n", 
                        "Te de kombucha / manchuria", 
                        "Skimmer", 
                        "Extintores / Recarga extintores", 
                        "Fono copete", 
                        "Preservativos", 
                        "Armas (habilitadas y que no indiquen ser de colecci\u00f3n), fuegos artificiales, explosivos, municiones."
                    ], 
                    "description": "Los productos y servicios no permitidos incluyen, pero no se limitan, a los elementos especificados a continuaci\u00f3n. Los avisos de productos, bienes o servicios que violen la legislaci\u00f3n chilena ser\u00e1n rechazados.", 
                    "title": "Productos y servicios no permitidos"
                }, 
                "description": "Existen restricciones para ciertos productos y servicios. Estos no pueden ser objeto de publicidad. Para ver una lista de ejemplos,", 
                "title": "Productos y servicios prohibidos"
            }, 
            {
                "description": "El T\u00edtulo del aviso debe describir s\u00f3lo el art\u00edculo o servicio anunciado. No se permiten nombres de empresas o URLs (direcciones web). Ninguna persona puede ir en el t\u00edtulo. El art\u00edculo o servicio debe ser descrito en el t\u00edtulo del aviso. No se pueden copiar los t\u00edtulos de otros anunciantes. No se pueden usar palabras inconexas en el t\u00edtulo, que s\u00f3lo tengan el prop\u00f3sito de influir en los resultados de b\u00fasqueda ('tags'). No se pueden utilizar palabras descritas por la categor\u00eda en la que se encuentra, tales como 'Vendo', 'Ofrezco', 'Arriendo'. No se puede indicar el precio del producto o servicio publicado.", 
                "title": "T\u00edtulo del aviso"
            }, 
            {
                "description": "El producto o servicio debe ser descrito de la forma m\u00e1s clara posible, dejando claro de qu\u00e9 servicio se trata o qu\u00e9 es lo que se vende. No se pueden usar palabras inconexas en la descripci\u00f3n, ya que s\u00f3lo tiene el prop\u00f3sito de influir en los resultados de b\u00fasqueda ('tags'). As\u00ed mismo, tampoco est\u00e1n permitidas direcciones de email ni enlaces a otras p\u00e1ginas web.", 
                "title": "Descripci\u00f3n del aviso"
            }, 
            {
                "description": "Se permiten, en concreto, las ventas, arriendos, servicios y ofertas de trabajo. No se puede usar la publicidad s\u00f3lo para hacer propaganda, sin ofrecer productos, servicios o trabajos concretos.", 
                "title": "Publicidad"
            }, 
            {
                "description": "No est\u00e1 permitido subir m\u00e1s de un producto o servicio en el mismo aviso, a menos que sean para el intercambio (por ejemplo: 2 por 1) o venta por lote sin precio individual.", 
                "title": "Un solo producto o servicio por aviso"
            }, 
            {
                "description": "Las im\u00e1genes del aviso deben ser relevantes para el art\u00edculo o servicio anunciado. No se pueden utilizar los logotipos e im\u00e1genes de una empresa, a excepci\u00f3n de las categor\u00edas de Empleos y servicios. No se pueden utilizar im\u00e1genes de otros anunciantes sin permiso de los mismos. Marcas de agua y logos de empresas que ofrecen servicios similares a Yapo.cl, tampoco son permitidas. Yapo.cl se reserva el derecho de eliminar aquellas im\u00e1genes que no cumplan con estas reglas.", 
                "title": "Im\u00e1genes"
            }, 
            {
                "description": "El aviso se debe introducir en la categor\u00eda que mejor describa el art\u00edculo o servicio (en caso contrario, el aviso puede ser rechazado o trasladado a la categor\u00eda correspondiente). Productos y servicios que no caben en la misma categor\u00eda se deben ingresar como avisos independientes.", 
                "title": "Categor\u00edas"
            }, 
            {
                "description": "No se permite hacer publicidad de productos falsificados o productos piratas, tales como CDs, DVDs, programas inform\u00e1ticos o videojuegos. Todos los productos deben ser certificados espec\u00edficamente como originales por el anunciante en la descripci\u00f3n del aviso.", 
                "title": "Productos pirateados o falsificados"
            }, 
            {
                "description": "Son permitidos s\u00f3lo productos o servicios publicados y ofrecidos en Chile.", 
                "title": "Localizaci\u00f3n"
            }, 
            {
                "content": {
                    "items": [
                        "Drogas de cualquier tipo. Equipamientos y objetos destinados a consumo o fabricaci\u00f3n de drogas.", 
                        "\u00d3rganos humanos , cad\u00e1veres, fluidos corporales.", 
                        "Productos robados, falsificados, pirateados, contrabando y todo lo que viole patentes, marcas , modelos y propiedad intelectual en general.", 
                        "Empleos a menores de 18, para edades entre 15 y 17 a\u00f1os se solicitar\u00e1 permiso notarial."
                    ], 
                    "description": "Los productos considerados ilegales incluyen, pero no se limitan, a los elementos especificados a continuaci\u00f3n. Los avisos de productos, bienes o servicios, que violen la legislaci\u00f3n chilena, ser\u00e1n rechazados.", 
                    "title": "Productos ilegales"
                }, 
                "description": "No se permite vender o suministrar los productos, bienes o servicios que est\u00e1n prohibidos por la legislaci\u00f3n chilena. Para ver la lista de productos restringidos,", 
                "title": "Productos ilegales"
            }, 
            {
                "description": "Son permitidos s\u00f3lo avisos en espa\u00f1ol.", 
                "title": "Idioma"
            }, 
            {
                "description": "No se permiten avisos que puedan ser percibidos como ofensivos para las personas, figuras \u00e9tnicas, religiosas o p\u00fablicas.", 
                "title": "Contenido ofensivo"
            }, 
            {
                "description": "El aviso debe contener solamente informaci\u00f3n relacionada al producto o servicio ofrecido.", 
                "title": "Informaci\u00f3n privada"
            }, 
            {
                "description": "Los servicios ofrecidos deben cumplir las leyes y regulaciones aplicables a cada profesi\u00f3n.", 
                "title": "Servicios"
            }, 
            {
                "description": "Los animales anunciados deben estar sujetos a las leyes chilenas y a las normas de las autoridades del pa\u00eds.", 
                "title": "Mascotas y animales en general"
            }
        ], 
        "header0": "Si un aviso es rechazado porque no cumple el reglamento, el anunciante podr\u00e1 cambiarlo, siempre y cuando se adapte a las reglas. Nos reservamos el derecho de decidir qu\u00e9 avisos no est\u00e1n de acuerdo con las reglas e incluso modificarlos para adaptarlos a ellas. Estas normas de uso est\u00e1n en constante revisi\u00f3n y pueden cambiar con el tiempo.", 
        "header1": "Yapo.cl se reserva el derecho a modificar o borrar avisos o partes de estos cuando se consideren incoherentes, incompletos o que no se ajusten a las reglas.", 
        "remember": [
            "S\u00f3lo se puede crear un aviso por cada elemento.", 
            "No puedes publicar el mismo aviso en varias regiones o categor\u00edas.", 
            "No se publican avisos que ofrecen productos y servicios espec\u00edficos. No aceptamos publicidad.", 
            "No se publican avisos que no cumplan nuestras Reglas.", 
            "Si no est\u00e1s seguro si tu aviso cumple con nuestras Reglas, por favor, contacta con Atenci\u00f3n al Cliente."
        ]
    }
}
