220 Welcome.
ad_id:7
list_id:
list_time:{{.*}}
subject:Damcykel
category:4060
price:667
ad_status:reviewing
ad_media_id:
image_count:0
daily_bump:
weekly_bump:
label:
gallery_date:
ad_pack_status:
autobump:
paid:t
views:0
mails:0
region:0
on_asearch:0
ad_id:5
list_id:
list_time:{{.*}}
subject:Damcykel
category:4060
price:667
ad_status:reviewing
ad_media_id:
image_count:0
daily_bump:
weekly_bump:
label:
gallery_date:
ad_pack_status:
autobump:
paid:t
views:0
mails:0
region:0
on_asearch:0
ad_id:4
list_id:
list_time:{{.*}}
subject:Hustomte
category:4060
price:667
ad_status:reviewing
ad_media_id:
image_count:0
daily_bump:
weekly_bump:
label:
gallery_date:
ad_pack_status:
autobump:
paid:t
views:0
mails:0
region:0
on_asearch:0
ad_id:3
list_id:
list_time:{{.*}}
subject:Damcykel
category:4060
price:667
ad_status:unpaid
ad_media_id:
image_count:0
daily_bump:
weekly_bump:
label:
gallery_date:
ad_pack_status:
autobump:
paid:f
views:0
mails:0
region:0
on_asearch:0
page_ads:4
n_ads:10
status:TRANS_OK
end
