220 Welcome.
accounts:ERROR_ACCOUNTS_MISSING
pro_types:ERROR_PRO_TYPES_MISSING
pro_actions:ERROR_PRO_ACTIONS_MISSING
token:ERROR_TOKEN_MISSING
remote_addr:ERROR_REMOTE_ADDR_MISSING
remote_browser:ERROR_REMOTE_BROWSER_MISSING
status:TRANS_ERROR
end
