220 Welcome.
flush_autobump.0.autobump_id:6
flush_autobump.0.ad_id:4
flush_autobump.0.status:cancel
flush_autobump.1.autobump_id:5
flush_autobump.1.ad_id:4
flush_autobump.1.status:skipped
status:TRANS_OK
end
