220 Welcome.
conf:*.*.prio=1
conf:*.*.uncommon.named_path.1.name=some
conf:*.*.uncommon.named_path.2.name=named
conf:*.*.uncommon.named_path.3.name=path
conf:host.*.prio=3
conf:host.*.uncommon.named_path.1.name=host_some
conf:host.*.uncommon.named_path.2.name=host_named
conf:host.*.uncommon.named_path.3.name=host_path
X-Scm-Bconf-Checksum:{{.+}}
status:TRANS_OK
end
