info:filtered:2
info:to_id:4711
info:lines:2
id	order	suborder	attronly	attrind	body	status
4	5	3	in	and	the betch yalwas i don into therso bet	active
5	1	4	a	quick	fox bumps onto the crazy dog	active
