{{.*}}
{{.*}}

{{.*}}

{
    "ads": [
        {
            "category": "6140", 
            "price_uf": "",
            "currency": "peso",
            "type_name": "sell", 
            "list_id": "8348545", 
            "region_name": "IX Araucan\u00eda", 
            "parameters": {}, 
            "url": "https://{{.*}}/vi/8348545.htm", 
            "zipcode": "", 
            "price": "8500", 
            "old_currency": "",
            "oldprice": "",
            "address": "", 
            "thumb": "https://{{.*}}/thumbs/95/9592907066.jpg", 
            "extra_images": "", 
            "list_time": "2006-05-27 19:46:01", 
            "company_ad": "0", 
            "external_ad_id": "", 
            "date": "27 May 19:46", 
            "region": "10", 
            "subject": "Orginal Mauser Oberndorf 9,3x62", 
            "type": "s", 
            "user_id": "13", 
            "geoposition": "", 
            "category_name": "Animales y sus accesorios"
        }
    ], 
    "search_total": "1", 
    "private_ads": "1", 
    "total": "1", 
    "numperpage": "50", 
    "company_ads": ""
}
