220 Welcome.
conf:*.*.prio=1
conf:*.*.uncommon.named_path.1.name=some
conf:*.*.uncommon.named_path.2.name=named
conf:*.*.uncommon.named_path.3.name=path
conf:*.appl.prio=2
conf:*.appl.uncommon.named_path.1.name=appl_some
conf:*.appl.uncommon.named_path.2.name=appl_named
conf:*.appl.uncommon.named_path.3.name=appl_path
conf:host.*.prio=3
conf:host.*.uncommon.named_path.1.name=host_some
conf:host.*.uncommon.named_path.2.name=host_named
conf:host.*.uncommon.named_path.3.name=host_path
conf:host.appl.prio=4
conf:host.appl.uncommon.named_path.1.name=host_appl_some
conf:host.appl.uncommon.named_path.2.name=host_appl_named
conf:host.appl.uncommon.named_path.3.name=host_appl_path
X-Scm-Bconf-Checksum:{{.+}}
status:TRANS_OK
end
