-t -i -r yapo.cl <noreply@yapo.cl>
From: =?ISO-8859-1?Q?Yapo.cl?= <noreply@yapo.cl>
To: "PendingAccount" <acc_pending@yapo.cl>
Subject: =?ISO-8859-1?Q?Recuerda_activar_tu_cuenta_Yapo.cl?=
Content-Type: multipart/alternative; boundary="=_c13d1ca3e53fa7599447d19231f3e959"




--=_c13d1ca3e53fa7599447d19231f3e959
Content-Type: text/plain; charset="iso-8859-1"
Content-Transfer-Encoding: quoted-printable

Hola PendingAccount
=A1activa tu cuenta!

Hace unos d=EDas creaste tu cuenta de usuario en yapo.cl, ahora s=F3lo fa=
lta que la actives
para comenzar a usarla y as=ED vender m=E1s f=E1cil y r=E1pido. Te record=
amos que con tu cuenta podr=E1s:

- Administrar todos tus avisos activos 
- Ver los avisos que est=E1n en revisi=F3n 
- Revisar la cantidad de visitas que han tenido tus avisos 
- Revisar la cantidad de personas que te han contactado 

Aprovecha los beneficios de tu cuenta yapo.cl 

=A1Activar mi cuenta!  https://{{.*}}/cuenta/confirm?h=
=3D{{.*}}&e=3Dacc_pending@yapo.cl

Saludos,

El equipo de Yapo.cl
http://{{.*}}


-------------------------------------------------------------------------=
--------------------
Este mensaje se envi=F3 desde una direcci=F3n de correo electr=F3nico que=
 solo env=EDa notificaciones
y no acepta mensajes de correo electr=F3nico entrantes. Por favor, no res=
pondas a este mensaje.
-------------------------------------------------------------------------=
--------------------



--=_c13d1ca3e53fa7599447d19231f3e959
Content-Type: multipart/related;
	boundary="e1fd2200a802d36161eedc696cf4d68f";
	type="text/html"

--e1fd2200a802d36161eedc696cf4d68f
Content-Type: text/html; charset="iso-8859-1"
Content-Transfer-Encoding: quoted-printable


<!DOCTYPE html PUBLIC "-//W3C//DTD HTML 4.01 Transitional//EN">
<html>
	<head>
	</head>
	<body style=3D"color:#474747;font-family:helvetica, arial, sans;font-siz=
e:12px;">
		<table style=3D"width:700px;color:#474747;font-family:helvetica, arial,=
 sans;font-size:12px;">
            <tr>
		<td id=3D"title" style=3D"font-size:16px;height:64px;vertical-align:mid=
dle;width:400px;font-weight:bold">=A1Recuerda activar tu cuenta!</td>
		<td align=3D"right" style=3D"white-space: nowrap;"><img src=3D"http://{{.*}}=
{{.*}}/img/logo_internal_pages.gif" />
                </td>
            </tr>
		</table>
		<div style=3D"width:700px;">
			<hr style=3D"border:none;height:1px;width:100%;background-color:#ecece=
c;" />
		</div>

<table width=3D"700px" style=3D"margin-top:24px;padding:20px;margin-botto=
m:45px;">
<tbody>
	<tr>
		<td style=3D"color:#5e5e5e;font-weight:bold;height:58px;line-height:58p=
x;">
			<span style=3D"font-size:34px;">Hola PendingAccount</span> 
			<span style=3D"font-size:18px;">=A1activa tu cuenta!</span>
		</td>
	</tr>
	<tr>
		<td style=3D"color:#5e5e5e;font-size:14px;vertical-align:top;height:55p=
x;line-height:20px;">
			Hace unos d=EDas creaste tu cuenta de usuario en yapo.cl, ahora s=F3lo=
 falta que la actives <br> para comenzar a usarla y as=ED vender m=E1s f=
=E1cil y r=E1pido. Te recordamos que con tu cuenta podr=E1s:
		</td>
	</tr>
	<tr>
		<td>
			<table style=3D"margin:0 auto;font-size:13px;font-weight:bold;color:#f=
ff;text-align:center;" cellspacing=3D"0" cellpadding=3D"0">
				<tr>
					<td style=3D"width:116px;height:136px;vertical-align:bottom;padding:=
10px 10px 25px 10px;background-color:#006cbb;">
						<div style=3D"width:100%;margin-bottom:10px;text-align:center;">
							<img src=3D"http://{{.*}}/img/email-check.gif" =
alt=3D"check">
						</div>
						Administrar todos tus avisos activos 
					</td>
					<td style=3D"width:15px;vertical-align:middle;">
						<img src=3D"http://{{.*}}/img/tip-east-first.gif=
" alt=3D"tip">
					</td>
					<td style=3D"width:120px;height:136px;vertical-align:bottom;padding:=
10px 8px 25px 8px;background-color:#ff9429;">
						<div style=3D"width:100%;margin-bottom:10px;text-align:center;">
							<img src=3D"http://{{.*}}/img/email-clock.gif" =
alt=3D"check">
						</div>
						Ver los avisos que est=E1n en revisi=F3n 
					</td>
					<td style=3D"width:15px;vertical-align:middle;">
						<img src=3D"http://{{.*}}/img/tip-east-second.gi=
f" alt=3D"tip">
					</td>
					<td style=3D"width:120px;height:136px;vertical-align:bottom;padding:=
10px 8px 15px 8px;background-color:#f6f6f6;color:#008bc2;">
						<div style=3D"width:100%;margin-bottom:10px;text-align:center;">
							<img src=3D"http://{{.*}}/img/email-eye.gif" al=
t=3D"check">
						</div>
						Revisar la cantidad de visitas que han tenido tus avisos 
					</td>
					<td style=3D"width:15px;vertical-align:middle;">
						<img src=3D"http://{{.*}}/img/tip-east-third.gif=
" alt=3D"tip">
					</td>
					<td style=3D"width:120px;height:120px;vertical-align:bottom;padding:=
10px 8px 15px 8px;background-color:#4d7fc6;">
						<div style=3D"width:100%;margin-bottom:10px;text-align:center;">
							<img src=3D"http://{{.*}}/img/email-user-icon.g=
if" alt=3D"check">
						</div>
						Revisar la cantidad de personas que te han contactado 
					</td>
					<td style=3D"width:12px">
						&nbsp;
					</td>
				</tr>
			</table>
		</td>
	</tr>
	<tr>
		<td style=3D"color:#5e5e5e;font-size:18px;font-weight:bold;text-align:c=
enter;height:65px;">
			Aprovecha los beneficios de tu cuenta yapo.cl 
		</td>
	</tr>
	<tr>
		<td style=3D"text-align:center;">
			<a href=3D"https://{{.*}}/cuenta/confirm?h=3D{{.*}}=
{{.*}}&e=3Dacc_pending@yapo.cl" style=3D"display:inline-block;=
width:320px;height:50px;line-height:50px;border-radius:3px;-webkit-border=
-radius:3px;-moz-border-radius:3px;font-size:16px;background-color:#008bc=
2;color:#fff;margin:0 auto;text-align:center;font-size:21px;text-decorati=
on:none;">
			=A1Activar mi cuenta! 
			</a>
		</td>
	</tr>
</tbody>
</table>
	<table style=3D"background-color: #ececec;border: 1px solid #DDDDDD;-moz=
-border-radius:5px;-webkit-border-radius:5px;border-radius:5px;font-size:=
12px;" cellspacing=3D"5">
	<tr>
		<td>
			=BFTienes alguna duda? <a style=3D"text-decoration:none; color:#23507D=
; font-weight:bold" href=3D"http://{{.*}}/atencion_al_=
cliente.htm">Cont=E1ctanos</a>
		</td>
	</tr>
	<tr>
		<td>
			Lee nuestras <a style=3D"text-decoration:none; color:#23507D; font-wei=
ght:bold" href=3D"http://{{.*}}/reglas.htm">reglas</a>=

		</td>
	</tr>
  
</table>

		<br/>
		
		<br/>
		(Por favor, no utilices esta direcci&oacute;n para enviarnos respuestas=
)<br/><br/>
		<div style=3D"width:700px;">
			<hr style=3D"border:none;height:1px;width:100%;background-color:#ecece=
c;" />
		</div>
		<p style=3D"font-size:smaller;">Si no puedes ver las im&aacute;genes, v=
erifica que la opci&oacute;n para ver im&aacute;genes se encuentre habili=
tada en tu sistema de correo.</p>
		<p style=3D"font-size:smaller;">Para recibir correctamente los correos =
de Yapo.cl, te recomendamos incluir noreply@yapo.cl a tu lista de contact=
os.</p>
		
	</body>
</html>



