{
  "cat_2080": {
    "type": "s",
    "body": "Body  of boats in Regi\u00f3n Metropolitana (Generated test)",
    "password": "123123123",
    "price": "100",
    "phone": "9876543210",
    "category": "2080",
    "password_verification": "123123123",
    "name": "Selenium Test User",
    "region": "15",
    "communes": 331,
    "subject": "Ad insertion test in category 2080",
    "email": "prepaid5@blocket.se"
  }
}
