Executing: category_params
challenge: {{.*}}

[+] response calculated: {{.*}}

{
    "es": [
        {
            "id": "6000", 
            "categories": [
                {
                    "name": "Animales y sus accesorios", 
                    "parent": "6000", 
                    "price": "0", 
                    "total_images": "6", 
                    "extra_images": {
                        "max": "5", 
                        "price": "0"
                    }, 
                    "show_price_on_newad": "1", 
                    "id": "6140", 
                    "types": [
                        {
                            "default": true, 
                            "id": "s", 
                            "label": "sell"
                        }
                    ]
                }
            ], 
            "name": "Tiempo libre"
        }
    ]
}
