Executing: cars_getversions
challenge: {{.*}}

[+] response calculated: {{.*}}

{
    "es": [
        {
            "newad": [
                {
                    "name": "version", 
                    "label": "Versi\u00f3n", 
                    "source": "cars_getversions", 
                    "depends": "model", 
                    "values": [
                        {
                            "id": "1", 
                            "value": "Sport", 
                            "cartype": "1"
                        }, 
                        {
                            "id": "0", 
                            "value": "- Otra / No lo s\u00e9 -", 
                            "cartype": "1"
                        }
                    ], 
                    "type": "dropdownlist"
                }
            ], 
            "list": [
                {
                    "name": "ve", 
                    "label": "Versi\u00f3n", 
                    "source": "cars_getversions", 
                    "depends": "mo", 
                    "values": [
                        {
                            "id": "1", 
                            "value": "SPORT", 
                            "cartype": "1"
                        }
                    ], 
                    "type": "dropdownlist"
                }
            ]
        }
    ]
}
