 t        \| area          \|                       \| 121
 f        \| category      \| 6064                  \| 6061
 f        \| name          \| Dummy                 \| Refused
 f        \| passwd        \| testc                 \| 
 f        \| phone         \| 08-121314             \| 018-111111
 f        \| phone_hidden  \| false                 \| true
 f        \| price         \| 667                   \| 10
 f        \| salted_passwd \|                       \| \$1024\$.{56}
 f        \| subject       \| Damcykel med blahonga \| Damcykel

