<svg xmlns="http://www.w3.org/2000/svg" width="24" height="24" viewBox="0 0 24 24">
    <g fill="none" fill-rule="evenodd" transform="matrix(1 0 0 -1 1 23)">
        <g fill="#FFF">
            <path d="M10.446 6.15v7.44c0 .504.296.79.73.79s.73-.286.73-.79V6.15c0-.503-.296-.808-.73-.808s-.73.305-.73.809zM11.176 15.693c-.539 0-.99.468-.99 1.024 0 .557.451 1.025.99 1.025.539 0 .99-.468.99-1.025 0-.556-.451-1.024-.99-1.024z"/>
        </g>
        <circle cx="11" cy="11" r="11" stroke="#FFF"/>
    </g>
</svg>
