220 Welcome.
ad_subject:Jobs ad 1
region:11
action_type:inserting_fee
pack_result:-1
ref_auth_code:123456
ref_trans_date:07/11/2014 16:31:13
ref_placements_type:VN
ref_placements_number:1
ref_pay_type:credit
ref_external_response:0
ref_external_id:42887842535162681669
ref_remote_addr:127.0.0.1
pay_log:PAID 00171a (1, prepaid5@blocket.se, 5990 kr) (ad_id: 136)
status:TRANS_OK
end
