{
  "cat_7040": {
    "type": "s",
    "body": "Body  of job in Regi\u00f3n Metropolitana (Generated test)",
    "password": "123123123",
    "phone": "9876543210",
    "category": "7040",
    "password_verification": "123123123",
    "name": "Selenium Test User",
    "region": "15",
    "communes": 331,
    "subject": "Ad insertion test in category 7040",
    "email": "prepaid5@blocket.se",
    "jc": ["20"]
  }
}
