220 Welcome.
flush_autobump.0.autobump_id:11
flush_autobump.0.ad_id:127
flush_autobump.0.status:error
flush_autobump.1.autobump_id:12
flush_autobump.1.ad_id:300
flush_autobump.1.status:error
flush_autobump.2.autobump_id:13
flush_autobump.2.ad_id:98
flush_autobump.2.status:success
flush_autobump.3.autobump_id:14
flush_autobump.3.ad_id:99
flush_autobump.3.status:success
flush_autobump.4.autobump_id:15
flush_autobump.4.ad_id:100
flush_autobump.4.status:success
status:TRANS_OK
end
