Executing: deletead
challenge: {{.*}}

[+] response calculated: {{.*}}

{
    "status": "TRANS_ERROR", 
    "salted_passwd": "Tu contrase\u00f1a contiene caracteres inv\u00e1lidos", 
    "deletion_reason": "Por favor, selecciona una raz\u00f3n de borrado", 
    "error": "Tu contrase\u00f1a contiene caracteres inv\u00e1lidos"
}
