
Now you can use template code as arguments to filters and functions
foo test
bar test bar test bar test

You can put any code in there, for example filters.
barbar

Outer variables work as well.
one a  b two a  b three a  b 
Multiple outer levels test
one a  b  c two a  b  c three a  b  c 

If test
works

Arithmetics
3
