Executing: view
challenge: {{.*}}

[+] response calculated: {{.*}}

{
    "category_code": "9020", 
    "communes_name": "Macul", 
    "currency": "peso", 
    "param_groups": [], 
    "type_code": "k", 
    "geoposition": "", 
    "subject": "Busco: Busco articulos para bebe", 
    "category": "Vestuario futura mam\u00e1 y ni\u00f1os", 
    "user_id": "50", 
    "parameters": [
        {
            "id": "condition", 
            "value": "Nuevo", 
            "label": "Nuevo/Usado"
        }
    ], 
    "communes": "319", 
    "zipcode": "", 
    "company_ad": "0", 
    "type": "Busco", 
    "body": "Busco articulos para bebe\nBusco articulos para bebe\nBusco articulos para bebe\nBusco articulos para bebe", 
    "ad_id": "8000011", 
    "region_name": "Regi\u00f3n Metropolitana", 
    "price": "23.000", 
    "can_email": "1", 
    "phonegifs": "<img src=\"https://{{.*}}/pg/{{.*}}.gif\" />", 
    "phone": "1234567890", 
    "date": "7 Nov 18:45", 
    "name": "Boris Cruchet", 
    "region": "15", 
    "extra_parameters": [], 
    "list_time": "2012-11-07 18:45:29"
}
