220 Welcome.
token:{{.*}}
result.0.day:{{....-..-.. ..:..:..}}
result.0.new:12
result.0.prolong:0
result.0.sum:12
result.1.day:{{....-..-.. ..:..:..}}
result.1.new:12
result.1.prolong:0
result.1.sum:12
result.2.day:{{....-..-.. ..:..:..}}
result.2.new:12
result.2.prolong:0
result.2.sum:12
result.3.day:{{....-..-.. ..:..:..}}
result.3.new:12
result.3.prolong:0
result.3.sum:12
result.4.day:{{....-..-.. ..:..:..}}
result.4.new:12
result.4.prolong:0
result.4.sum:12
result.5.day:{{....-..-.. ..:..:..}}
result.5.new:12
result.5.prolong:0
result.5.sum:12
result.6.day:{{....-..-.. ..:..:..}}
result.6.new:12
result.6.prolong:0
result.6.sum:12
result.7.day:{{....-..-.. ..:..:..}}
result.7.new:12
result.7.prolong:0
result.7.sum:12
result.8.day:{{....-..-.. ..:..:..}}
result.8.new:12
result.8.prolong:0
result.8.sum:12
result.9.day:{{....-..-.. ..:..:..}}
result.9.new:12
result.9.prolong:0
result.9.sum:12
result.10.day:{{....-..-.. ..:..:..}}
result.10.new:12
result.10.prolong:0
result.10.sum:12
result.11.day:{{....-..-.. ..:..:..}}
result.11.new:12
result.11.prolong:0
result.11.sum:12
result.12.day:{{....-..-.. ..:..:..}}
result.12.new:12
result.12.prolong:0
result.12.sum:12
result.13.day:{{....-..-.. ..:..:..}}
result.13.new:12
result.13.prolong:0
result.13.sum:12
result.14.day:{{....-..-.. ..:..:..}}
result.14.new:12
result.14.prolong:0
result.14.sum:12
result.15.day:{{....-..-.. ..:..:..}}
result.15.new:12
result.15.prolong:0
result.15.sum:12
result.16.day:{{....-..-.. ..:..:..}}
result.16.new:12
result.16.prolong:0
result.16.sum:12
result.17.day:{{....-..-.. ..:..:..}}
result.17.new:12
result.17.prolong:0
result.17.sum:12
result.18.day:{{....-..-.. ..:..:..}}
result.18.new:12
result.18.prolong:0
result.18.sum:12
result.19.day:{{....-..-.. ..:..:..}}
result.19.new:12
result.19.prolong:0
result.19.sum:12
result.20.day:{{....-..-.. ..:..:..}}
result.20.new:12
result.20.prolong:0
result.20.sum:12
result.21.day:{{....-..-.. ..:..:..}}
result.21.new:12
result.21.prolong:0
result.21.sum:12
result.22.day:{{....-..-.. ..:..:..}}
result.22.new:12
result.22.prolong:0
result.22.sum:12
result.23.day:{{....-..-.. ..:..:..}}
result.23.new:12
result.23.prolong:0
result.23.sum:12
result.24.day:{{....-..-.. ..:..:..}}
result.24.new:12
result.24.prolong:0
result.24.sum:12
result.25.day:{{....-..-.. ..:..:..}}
result.25.new:12
result.25.prolong:0
result.25.sum:12
result.26.day:{{....-..-.. ..:..:..}}
result.26.new:12
result.26.prolong:0
result.26.sum:12
result.27.day:{{....-..-.. ..:..:..}}
result.27.new:12
result.27.prolong:0
result.27.sum:12
result.28.day:{{....-..-.. ..:..:..}}
result.28.new:12
result.28.prolong:0
result.28.sum:12
result.29.day:{{....-..-.. ..:..:..}}
result.29.new:12
result.29.prolong:0
result.29.sum:12
result.30.day:{{....-..-.. ..:..:..}}
result.30.new:12
result.30.prolong:0
result.30.sum:12
result.31.day:{{....-..-.. ..:..:..}}
result.31.new:12
result.31.prolong:0
result.31.sum:12
result.32.day:{{....-..-.. ..:..:..}}
result.32.new:12
result.32.prolong:0
result.32.sum:12
status:TRANS_OK
end
