220 Welcome.
email:user.01@schibsted.cl
ad_id:122
list_id:8000082
action_id:3
ad_status:active
subject:Test 07
region:15
category:8020
communes:331
ad_salted_passwd:$1024$2y1bQ}VYRD}zF4QCbf07a971b784888658a20e62156de64dfde5ffb6
status:TRANS_OK
end
