Executing: view
challenge: {{.*}}

[+] response calculated: {{.*}}

{
    "body": "Arriendo mi casa", 
    "category": "1240", 
    "ad_id": "8000003", 
    "name": "dany", 
    "images": [], 
    "area": "", 
    "parameters": [
        {
            "id": "communes", 
            "value": "242"
        }, 
        {
            "id": "condominio", 
            "value": "10000"
        }, 
        {
            "id": "estate_type", 
            "value": "2"
        }, 
        {
            "id": "garage_spaces", 
            "value": "4"
        }, 
        {
            "id": "prev_currency", 
            "value": "peso"
        }, 
        {
            "id": "rooms", 
            "value": "4"
        }, 
        {
            "id": "size", 
            "value": "120"
        }
    ], 
    "price": "140000", 
    "subject": "Linda Casa de gran tama\u00f1o", 
    "phone": "123123123", 
    "not_editable": [
        "ad_id", 
        "area", 
        "category", 
        "company_ad", 
        "email", 
        "list_time", 
        "name", 
        "region", 
        "type"
    ], 
    "phone_hidden": "0", 
    "company_ad": "0", 
    "region": "11", 
    "ad_status": "active", 
    "no_salesmen": "", 
    "type": "u", 
    "email": "dany@schibsted.cl", 
    "list_time": "2012-11-07 18:44:45"
}
