220 Welcome.
flush_autobump.0.autobump_id:10
flush_autobump.0.ad_id:5
flush_autobump.0.status:cancel
flush_autobump.1.autobump_id:9
flush_autobump.1.ad_id:5
flush_autobump.1.status:skipped
status:TRANS_OK
end
