info:filtered:5
info:to_id:4711
info:lines:5
id	order	suborder	attronly	attrind	body	status
4	5	3	in	and	the betch yalwas i don into therso bet	active
3	2	0	i	mad	a mer himp he se into inutels shere	active
5	1	4	a	quick	fox bumps onto the crazy dog	active
2	1	0	now	is	time for all good men	active
1	1	0	the	quick	fox jumps over the lazy dog	active
