220 Welcome.
token:.+
list_type:general
blocked_item.0.item_id:100
blocked_item.0.value:svara.inte@blocket.se
blocked_item.0.list_id:10
blocked_item.0.notice:En fin liten notis 
blocked_item.0.username:blocket1
blocked_item.1.item_id:5
blocked_item.1.value:fisk.se
blocked_item.1.list_id:10
blocked_item.2.item_id:101
blocked_item.2.value:08-121212
blocked_item.2.list_id:10
blocked_item.2.username:blocket1
status:TRANS_OK
end
