HTTP/1.1 200 Success
Content-Length: 140
Content-Type: application/json
X-Scm-Bconf-Checksum: 85903d105f613208

{"prio": "4","uncommon": {"named_path": {"1": {"name": "host_appl_some"},"2": {"name": "host_appl_named"},"3": {"name": "host_appl_path"}}}}
