220 Welcome.
token:X496de67d45faedaf0000000034d7e18d00000000
get_sms_user_info.0.sms_user_id:1
get_sms_user_info.0.phone:46701020304
get_sms_user_info.0.sms_central:se.telia
get_sms_user_info.0.credit:0.00
get_sms_user_info.0.credit_total:0.00
get_sms_user_info.0.sms_user_status:active
get_sms_user_info.0.free_sms:2
get_sms_user_info.0.num_sms:0
get_sms_user_info.0.total_cost:0
status:TRANS_OK
end
