info:filtered:6
info:after_docs:4
info:to_id:4711
info:idrange:before:1
info:idrange:after:2
info:lines:4
id	order	suborder	attronly	attrind	body	status
3	2	0	i	mad	a mer himp he se into inutels shere	active
6	1	6	พูด	ภาษา	ได้ ไหม	inactive
5	1	4	a	quick	fox bumps onto the crazy dog	active
4	5	3	in	and	the betch yalwas i don into therso bet	active
