Executing: category_params
challenge: {{.*}}

[+] response calculated: {{.*}}

{
    "es": [
        {
            "id": "4000", 
            "categories": [
                {
                    "name": "Moda y vestuario", 
                    "parent": "4000", 
                    "price": "0", 
                    "total_images": "6", 
                    "extra_images": {
                        "max": "5", 
                        "price": "0"
                    }, 
                    "show_price_on_newad": "1", 
                    "id": "4020", 
                    "types": [
                        {
                            "default": true, 
                            "newad": [
                                {
                                    "name": "condition", 
                                    "type": "dropdownlist", 
                                    "validations": {
                                        "required": true
                                    }, 
                                    "values": [
                                        {
                                            "id": "1", 
                                            "value": "Nuevo"
                                        }, 
                                        {
                                            "id": "2", 
                                            "value": "Usado"
                                        }
                                    ], 
                                    "translate": "Nuevo/Usado", 
                                    "optional": "0"
                                }, 
                                {
                                    "name": "gender", 
                                    "type": "dropdownlist", 
                                    "validations": {
                                        "required": false
                                    }, 
                                    "values": [
                                        {
                                            "id": "1", 
                                            "value": "Femenino"
                                        }, 
                                        {
                                            "id": "2", 
                                            "value": "Masculino"
                                        }, 
                                        {
                                            "id": "3", 
                                            "value": "Unisex"
                                        }
                                    ], 
                                    "translate": "G\u00e9nero", 
                                    "optional": "1"
                                }, 
                                {
                                    "name": "clothing_size", 
                                    "type": "dropdownlist", 
                                    "validations": {
                                        "required": false
                                    }, 
                                    "extended_type": "number", 
                                    "values": [
                                        {
                                            "id": "1", 
                                            "value": "XS o menos"
                                        }, 
                                        {
                                            "id": "2", 
                                            "value": "S"
                                        }, 
                                        {
                                            "id": "3", 
                                            "value": "M"
                                        }, 
                                        {
                                            "id": "4", 
                                            "value": "L"
                                        }, 
                                        {
                                            "id": "5", 
                                            "value": "XL"
                                        }, 
                                        {
                                            "id": "6", 
                                            "value": "XXL o m\u00e1s"
                                        }
                                    ], 
                                    "translate": "Talla", 
                                    "optional": "1"
                                }
                            ], 
                            "id": "s", 
                            "label": "sell"
                        }
                    ]
                }
            ], 
            "name": "Moda, calzado, belleza y salud"
        }
    ]
}
