
<svg width="15px" height="10px" viewBox="0 0 15 10" version="1.1" xmlns="http://www.w3.org/2000/svg" xmlns:xlink="http://www.w3.org/1999/xlink">
    <g stroke="none" stroke-width="1" fill="none" fill-rule="evenodd">
        <g transform="translate(-282.000000, -191.000000)" stroke-width="2" stroke="#999999">
            <polyline transform="translate(289.500000, 195.611111) rotate(90.000000) translate(-289.500000, -195.611111) " points="286 189 293 195.63048 286 202.222222"></polyline>
        </g>
    </g>
</svg>

