Executing: list
challenge: {{.*}}

[+] response calculated: {{.*}}

{
    "ads": [], 
    "search_total": "0", 
    "private_ads": "0", 
    "total": "0", 
    "numperpage": "50", 
    "company_ads": ""
}
