220 Welcome.
doc_type:ERROR_DOC_TYPE_MISSING
product_params:ERROR_PRODUCT_PARAMS_MISSING
payment_method:ERROR_PAYMENT_METHOD_MISSING
payment_platform:ERROR_PAYMENT_PLATFORM_MISSING
remote_addr:ERROR_REMOTE_ADDR_MISSING
status:TRANS_ERROR
end
