{
    "status": "OK",
    "actionToken": "6c9294f47efdf7b3f5a7a97567613b05",
    "ads": [
        {
            "id": "4951992",
            "subject": "Test 02",
            "image": "http://img.poya4.cl/images/57/5726878347.jpg",
            "url":
"http://www.poya4.cl/region_metropolitana/otros_productos/test_02_4951992.htm",
            "price": "123123",
            "userId": "12378"
        },
        {
            "id": "4951990",
            "subject": "Test 01",
            "image":
"http://img.poya4.cl/images/49/4981981924.jpg",
            "url":
"http://www.poya4.cl/region_metropolitana/otros_productos/test_01_4951990.htm",
            "price": "123123",
            "userId": "231"
        }
    ]
}
