220 Welcome.
flush_autobump.0.autobump_id:8
flush_autobump.0.ad_id:4
flush_autobump.0.status:success
flush_autobump.1.autobump_id:7
flush_autobump.1.ad_id:4
flush_autobump.1.status:skipped
status:TRANS_OK
end
