<svg xmlns="http://www.w3.org/2000/svg" width="85" height="74" viewBox="0 0 85 74">
    <g fill="#4376B0" fill-rule="evenodd">
        <path d="M67.052 55.549c0 .344-.2 1.186-.405 1.45a2938.645 2938.645 0 0 1-9.32 12.02c-.079.1-.17.187-.392.423v-1c0-12.959.005-25.418-.012-38.376-.002-.59.175-.99.576-1.399 2.792-2.83 6.07-6.182 8.847-9.028.181-.186.372-.366.653-.64.028.326.064.546.064.765.002 12.26.005 23.524-.011 35.785zm-11.797-26.88c-.178.16-.47.266-.708.266-6.06.015-13.65.01-19.71.008l-.235-.065.447-.433C39.671 24 43.234 21 46.196 18.317c.222-.201.563-.348.846-.35 5.476-.02 12.988-.014 18.465-.01l.343.084c-3.594 3.27-7.088 7.457-10.595 10.629zm-43.51 42.984H54.94v-41.18H11.745v41.18zm1.927-43.208c3.882-3.048 8.781-7.095 12.674-10.128.236-.185.563-.348.846-.35 5.476-.02 10.952-.014 16.429-.01l.343.084c-3.594 3.27-8.106 7.457-11.614 10.629-.177.16-.469.265-.707.265-6.06.015-12.123.01-18.183.008l-.236-.065.448-.433zm54.912-9.405c0-2.309-.284-2.599-2.555-2.599-12.868 0-25.738.002-38.605-.009-.825 0-1.51.224-2.175.748-4.842 3.82-9.702 7.615-14.562 11.41-.556.434-.83.972-.83 1.688.007 13.706.01 27.413.011 41.119 0 1.726.48 2.215 2.186 2.215h21.273v.012c7.258 0 14.516 0 21.774.003.664 0 1.18-.258 1.597-.798 3.717-4.785 7.44-9.564 11.174-14.336.485-.622.724-1.271.722-2.08-.015-12.457-.01-24.914-.01-37.373z"/>
        <path d="M41.196 40.63H26.379c-.715 0-1.293-.492-1.293-1.1 0-.608.578-1.1 1.293-1.1h14.817c.712 0 1.293.492 1.293 1.1 0 .608-.58 1.1-1.293 1.1M3.523 44.331l-2.177 1.125.416-2.383L0 41.386l2.434-.348 1.089-2.168 1.088 2.168 2.434.348-1.761 1.687.416 2.383zM4.449 12.019l-1.633.843.312-1.787L1.807 9.81l1.825-.261.817-1.626.816 1.626 1.826.26-1.321 1.266.312 1.787zM56.305 4.096l-1.633.844.311-1.787-1.32-1.266 1.825-.26L56.305 0l.816 1.626 1.826.261-1.321 1.266.312 1.787zM73.925 71.623l-2.177 1.125.416-2.383-1.761-1.688 2.433-.348 1.09-2.168 1.088 2.168 2.434.348-1.762 1.688.416 2.383zM81.307 37.05l-2.178 1.125.417-2.383-1.762-1.688 2.434-.347 1.089-2.169 1.088 2.169 2.434.347-1.761 1.688.416 2.383z"/>
    </g>
</svg>
