com/baeldung/thrift/impl/InvalidOperationException.class
com/baeldung/thrift/impl/InvalidOperationException$InvalidOperationExceptionTupleScheme.class
com/baeldung/thrift/impl/CrossPlatformResource$CrossPlatformResourceStandardSchemeFactory.class
com/baeldung/thrift/impl/CrossPlatformResource$CrossPlatformResourceStandardScheme.class
com/baeldung/thrift/impl/CrossPlatformResource$CrossPlatformResourceTupleSchemeFactory.class
com/baeldung/thrift/impl/CrossPlatformResource$_Fields.class
com/baeldung/thrift/impl/InvalidOperationException$_Fields.class
com/baeldung/thrift/impl/CrossPlatformResource$1.class
com/baeldung/thrift/impl/InvalidOperationException$1.class
com/baeldung/thrift/impl/CrossPlatformResource$CrossPlatformResourceTupleScheme.class
com/baeldung/thrift/impl/InvalidOperationException$InvalidOperationExceptionStandardSchemeFactory.class
com/baeldung/thrift/impl/InvalidOperationException$InvalidOperationExceptionTupleSchemeFactory.class
com/baeldung/thrift/impl/CrossPlatformResource.class
com/baeldung/thrift/impl/InvalidOperationException$InvalidOperationExceptionStandardScheme.class
