{
    "labelTitleLogin": "//h1[contains(text(),'Iniciar sesi\u00F3n')]",
    "inputUsername":"//input[@placeholder='Usuario ']",
    "inputPass":"//input[@placeholder='Contraseña ']",
    "buttonSubmit":"//button[normalize-space()='Enviar']"
}