{
    "labelTitleAssert": "//h2[normalize-space()='Complete el siguiente formulario']",
    "labelNumeroCiclo":"//p[contains(text(),'Ciclos :')]/following-sibling::p",
    "labelOperation":"//p[contains(text(),'Complete la siguiente operación matemática :')]/following-sibling::p",
    "selectResponseOperation": "//select[@name='select']",
    "labelRepeatLetter":"//p[contains(text(),'veces la letra')]",
    "inputRepeatLetter":"//p[contains(text(),'veces la letra')]/following-sibling::textarea",
    "btnSubmit":"//button[normalize-space()='Enviar']"
}

