{
  "projectType": "application",
  "sourceRoot": "apps/kernel/src",
  "prefix": "qx-test",
  "targets": {
    "build": {
      "executor": "@nrwl/angular:webpack-browser",
      "outputs": ["{options.outputPath}"],
      "options": {
        "outputPath": "dist/apps/kernel",
        "index": "apps/kernel/src/index.html",
        "main": "apps/kernel/src/main.ts",
        "polyfills": "apps/kernel/src/polyfills.ts",
        "tsConfig": "apps/kernel/tsconfig.app.json",
        "inlineStyleLanguage": "less",
        "assets": ["apps/kernel/src/favicon.ico", "apps/kernel/src/assets"],
        "styles": ["apps/kernel/src/styles.less"],
        "scripts": [],
        "customWebpackConfig": {
          "path": "apps/kernel/webpack.config.js"
        }
      },
      "configurations": {
        "production": {
          "budgets": [
            {
              "type": "initial",
              "maximumWarning": "500kb",
              "maximumError": "1mb"
            },
            {
              "type": "anyComponentStyle",
              "maximumWarning": "2kb",
              "maximumError": "4kb"
            }
          ],
          "fileReplacements": [
            {
              "replace": "apps/kernel/src/environments/environment.ts",
              "with": "apps/kernel/src/environments/environment.prod.ts"
            }
          ],
          "outputHashing": "all",
          "customWebpackConfig": {
            "path": "apps/kernel/webpack.prod.config.js"
          }
        },
        "development": {
          "buildOptimizer": false,
          "optimization": false,
          "vendorChunk": true,
          "extractLicenses": false,
          "sourceMap": true,
          "namedChunks": true
        }
      },
      "defaultConfiguration": "production"
    },
    "serve": {
      "executor": "@nrwl/angular:module-federation-dev-server",
      "configurations": {
        "production": {
          "browserTarget": "kernel:build:production"
        },
        "development": {
          "browserTarget": "kernel:build:development"
        }
      },
      "defaultConfiguration": "development",
      "options": {
        "port": 4200,
        "publicHost": "http://localhost:4200"
      }
    },
    "extract-i18n": {
      "executor": "@angular-devkit/build-angular:extract-i18n",
      "options": {
        "browserTarget": "kernel:build"
      }
    },
    "lint": {
      "executor": "@nrwl/linter:eslint",
      "options": {
        "lintFilePatterns": ["apps/kernel/**/*.ts", "apps/kernel/**/*.html"]
      }
    },
    "test": {
      "executor": "@nrwl/jest:jest",
      "outputs": ["coverage/apps/kernel"],
      "options": {
        "jestConfig": "apps/kernel/jest.config.ts",
        "passWithNoTests": true
      }
    }
  },
  "tags": []
}
