panel,temperatura
1,44.22
2,44.08
3,43.98
4,43.88
5,43.63
6,43.49
7,43.29
8,43.12
9,43.21
10,43.37
11,43.51
12,43.63
13,43.59
14,43.61
15,43.73
16,43.73
17,43.41
18,42.48
19,42.6
20,42.82
21,42.96
22,44.66
23,44.84
24,44.76
25,44.53
26,43.0
27,42.44
28,42.6
29,44.02
30,43.94
31,43.86
32,43.75
33,43.51
34,43.19
35,43.12
36,43.1
37,43.19
38,43.21
39,43.37
40,43.67
41,43.73
42,43.57
43,43.65
44,43.61
45,43.39
46,42.42
47,42.62
48,42.7
49,42.76
50,44.1
51,44.63
52,44.04
53,42.76
54,42.26
55,42.46
56,42.5
57,43.86
58,43.88
59,43.71
60,43.59
61,43.21
62,43.02
63,42.94
64,42.78
65,43.1
66,43.04
67,43.13
68,43.29
69,43.43
70,43.25
71,43.35
72,43.23
73,43.02
74,42.34
75,42.52
76,42.86
77,43.96
78,44.37
79,43.82
80,42.34
81,42.4
82,42.48
83,42.58
84,43.17
85,43.19
86,43.08
87,42.88
88,42.58
89,42.34
90,42.3
91,42.64
92,42.48
93,42.92
94,42.98
95,42.78
96,42.92
97,42.92
98,42.36
99,42.72
100,43.39
101,44.0
102,44.74
103,44.82
104,44.76
105,44.22
106,43.92
107,43.88
108,44.49
109,44.68
110,44.82
111,44.88
112,43.55
113,42.7
114,42.96
115,43.19
116,43.59
117,43.29
118,43.51
119,43.67
120,43.47
121,43.06
122,42.86
123,42.66
124,42.42
125,42.26
126,42.48
127,42.64
128,42.86
129,42.92
130,43.21
131,43.67
132,43.92
133,43.65
134,43.9
135,43.78
136,43.76
137,43.65
138,43.59
139,43.43
140,43.63
141,43.65
142,43.25
143,43.57
144,43.73
145,43.59
146,43.53
147,43.65
148,43.76
149,43.67
150,43.55
151,43.45
152,43.43
153,43.59
154,43.76
155,43.8
156,43.73
157,43.8
158,43.73
159,43.82
160,43.88
161,43.76
162,44.0
163,44.43
164,44.94
165,44.65
166,44.43
167,44.22
168,44.16
169,44.02
170,44.08
171,43.69
172,43.65
173,43.19
174,43.8
175,43.49
176,43.71
177,43.8
178,43.65
179,43.41
180,43.35
181,43.17
182,43.08
183,43.06
184,42.88
185,42.58
186,42.7
187,42.5
188,43.65
189,43.73
190,44.14
191,44.06
192,43.92
193,44.16
194,44.51
195,44.49
196,44.12
197,42.66
198,42.38
199,42.52
200,42.5
201,42.76
202,42.3
203,42.32
204,42.26
205,42.34
206,42.7
207,42.38
208,42.42
209,42.52
210,42.46
211,42.66
212,42.58
213,42.54
214,42.4
215,42.54
216,42.6
217,42.66
218,42.7
219,42.76
220,42.64
221,42.58
222,42.64
223,42.76
224,42.72
225,42.78
226,42.58
227,42.58
228,42.72
229,42.72
230,42.86
231,42.94
232,42.92
233,42.94
234,42.98
235,43.17
236,43.17
237,43.43
238,43.63
239,43.57
240,43.82
241,43.75
242,43.98
243,43.98
244,44.02
245,44.02
246,43.94
247,44.14
248,44.37
249,44.22
250,44.53
251,44.33
252,44.41
253,44.65
254,44.68
255,44.49
256,44.41
257,44.39
258,44.37
259,44.18
260,43.96
261,43.96
262,43.51
263,43.23
264,43.19
265,43.17
266,43.08
267,43.08
268,42.96
269,43.08
270,42.8
271,42.76
272,42.7
273,42.88
274,42.64
275,42.7
276,42.82
277,42.36
278,42.46
279,42.46
280,42.36
281,42.4
282,42.28
283,42.6
284,42.58
285,42.8
286,42.84
287,42.6
288,42.44
289,42.3
290,42.88
291,42.94
292,43.0
293,42.7
294,42.28
295,42.44
296,42.4
297,42.64
298,42.8
299,42.78
300,42.64
301,42.8
302,42.54
303,42.46
304,42.78
305,43.02
306,43.17
307,43.27
308,43.21
309,43.23
310,43.06
311,43.04
312,42.94
313,42.58
314,42.32
315,42.46
316,42.5
317,42.48
318,42.62
319,42.48
320,42.44
321,42.86
322,42.7
323,42.54
324,42.66
325,42.9
326,42.88
327,42.58
328,42.64
329,42.46
330,42.58
331,42.72
332,42.74
333,42.68
334,42.74
335,42.78
336,42.8
337,42.76
338,42.76
339,42.72
340,42.9
341,42.54
342,42.56
343,42.5
344,42.64
345,42.66
346,43.04
347,42.88
348,42.42
349,42.48
350,42.78
351,42.88
352,42.76
353,43.17
354,42.9
355,43.06
356,43.04
357,43.49
358,43.43
359,43.21
360,42.9
361,43.29
362,43.13
363,43.15
364,43.29
365,43.0
366,43.08
367,43.13
368,43.29
369,43.31
370,43.31
371,43.29
372,43.33
373,43.15
374,43.27
375,43.15
376,43.06
377,42.76
378,42.82
379,42.9
380,42.86
381,42.82
382,42.94
383,42.94
384,42.94
385,42.84
386,42.64
387,42.7
388,42.82
389,42.5
390,42.6
391,43.15
392,43.19
393,42.84
394,42.72
395,42.4
396,42.5
397,42.44
398,42.4
399,42.32
400,42.84
401,43.33
402,43.43
403,44.04
404,43.65
405,43.76
406,44.12
407,44.27
408,44.45
409,43.76
410,42.88
411,42.44
412,43.45
413,43.41
414,43.31
415,43.13
416,43.12
417,43.33
418,42.78
419,42.76
420,43.04
421,43.0
422,43.02
423,43.23
424,43.31
425,43.12
426,43.19
427,42.92
428,42.34
429,42.64
430,43.51
431,43.51
432,43.8
433,43.9
434,43.78
435,43.69
436,43.71
437,43.67
438,43.55
439,43.23
440,42.92
441,42.78
442,42.64
443,42.38
444,42.38
445,42.46
446,42.74
447,42.82
448,42.76
449,43.04
450,43.12
451,43.02
452,43.06
453,43.17
454,43.31
455,43.37
456,43.17
457,43.06
458,43.21
459,43.23
460,43.08
461,42.96
462,43.04
463,43.04
464,43.0
465,43.17
466,43.12
467,42.92
468,43.04
469,43.08
470,43.08
471,43.21
472,43.1
473,42.82
474,43.02
475,43.23
476,43.1
477,42.94
478,43.0
479,43.15
480,43.57
481,43.41
482,43.15
483,43.04
484,43.15
485,43.13
486,43.21
487,43.19
488,43.17
489,43.27
490,43.21
491,43.63
492,43.55
493,43.41
494,43.33
495,43.25
496,43.31
497,43.29
498,43.23
499,43.25
500,43.37
501,43.51
502,43.67
503,43.47
504,43.65
505,43.45
506,43.71
507,43.55
508,43.55
509,43.49
510,43.17
511,43.1
512,43.23
513,43.15
514,43.08
515,43.31
516,43.23
517,43.17
518,43.17
519,43.25
520,43.15
521,43.02
522,42.96
523,43.08
524,43.25
525,43.45
526,43.45
527,43.35
528,43.0
529,43.21
530,43.31
531,43.29
532,43.39
533,43.61
534,44.1
535,44.45
536,44.82
537,44.61
538,43.02
539,42.5
540,42.54
541,42.56
542,43.57
543,43.57
544,43.47
545,43.25
546,43.19
547,43.13
548,43.04
549,42.94
550,43.08
551,43.29
552,43.19
553,43.35
554,43.33
555,43.27
556,43.25
557,42.94
558,42.3
559,42.3
560,42.26
561,42.34
562,43.1
563,43.47
564,43.59
565,43.75
566,44.04
567,44.02
568,43.88
569,43.84
570,43.71
571,43.43
572,43.31
573,43.08
574,42.98
575,42.74
576,42.72
577,42.64
578,42.74
579,42.74
580,42.88
581,42.86
582,43.08
583,43.08
584,43.12
585,43.04
586,43.1
587,43.17
588,43.23
589,43.21
590,43.1
591,43.1
592,43.21
593,43.13
594,43.12
595,43.1
596,43.12
597,43.04
598,43.08
599,43.04
600,42.96
601,43.12
602,43.12
603,43.12
604,43.21
605,43.08
606,42.98
607,43.1
608,43.12
609,42.98
610,42.94
611,42.94
612,43.17
613,43.19
614,43.33
615,43.08
616,43.12
617,43.02
618,43.02
619,43.23
620,43.1
621,43.15
622,43.12
623,43.17
624,43.23
625,43.39
626,43.13
627,43.19
628,43.21
629,43.27
630,43.23
631,43.23
632,43.15
633,43.35
634,43.35
635,43.63
636,43.47
637,43.31
638,43.41
639,43.29
640,43.39
641,43.37
642,43.35
643,43.15
644,42.96
645,43.1
646,43.04
647,43.04
648,43.13
649,43.25
650,43.15
651,43.27
652,43.17
653,43.21
654,43.08
655,43.12
656,43.13
657,43.31
658,43.31
659,43.37
660,43.35
661,43.29
662,43.29
663,43.33
664,43.39
665,43.55
666,43.67
667,44.9
668,43.39
669,42.52
670,42.28
671,42.64
672,42.94
673,43.78
674,43.63
675,43.65
676,43.27
677,43.25
678,43.08
679,43.0
680,43.17
681,43.21
682,43.39
683,43.53
684,43.57
685,43.55
686,43.41
687,43.29
688,43.02
689,42.44
690,42.48
691,42.3
692,42.5
693,43.23
694,43.71
695,43.69
696,43.9
697,44.14
698,44.02
699,43.86
700,43.84
701,43.71
702,43.55
703,43.25
704,43.15
705,43.0
706,42.92
707,42.88
708,42.88
709,42.94
710,43.04
711,42.96
712,42.94
713,43.12
714,43.21
715,43.13
716,43.06
717,42.98
718,43.12
719,43.19
720,43.1
721,43.06
722,43.1
723,43.04
724,43.1
725,43.15
726,43.04
727,43.08
728,43.06
729,43.02
730,43.02
731,43.04
732,43.1
733,43.0
734,42.98
735,43.12
736,43.08
737,42.96
738,43.02
739,42.9
740,42.9
741,42.84
742,42.9
743,43.0
744,43.0
745,42.98
746,42.98
747,42.98
748,42.96
749,42.94
750,43.15
751,42.96
752,43.06
753,43.12
754,43.08
755,43.13
756,43.12
757,43.21
758,43.1
759,43.23
760,43.23
761,43.13
762,43.1
763,43.0
764,43.04
765,43.23
766,43.39
767,43.25
768,43.21
769,43.23
770,43.27
771,43.06
772,43.23
773,43.13
774,43.08
775,42.98
776,43.04
777,42.98
778,42.94
779,43.13
780,43.13
781,43.12
782,43.21
783,43.21
784,43.21
785,43.17
786,43.13
787,43.21
788,43.33
789,43.41
790,43.37
791,43.39
792,43.31
793,43.35
794,43.41
795,43.45
796,43.47
797,43.73
798,44.37
799,44.8
800,43.31
801,42.56
802,42.48
803,42.76
804,42.86
805,43.63
806,43.69
807,43.65
808,43.39
809,43.19
810,43.13
811,43.19
812,43.12
813,43.21
814,43.49
815,43.43
816,43.73
817,43.69
818,43.51
819,43.53
820,42.94
821,42.38
822,42.3
823,42.5
824,43.17
825,43.65
826,43.76
827,43.76
828,43.94
829,43.94
830,43.88
831,43.82
832,43.71
833,43.63
834,43.47
835,43.12
836,43.15
837,42.94
838,42.76
839,42.84
840,43.04
841,42.9
842,43.06
843,43.02
844,43.17
845,43.19
846,43.12
847,43.06
848,43.13
849,43.15
850,43.17
851,43.08
852,43.1
853,43.08
854,42.96
855,42.88
856,43.04
857,43.04
858,43.15
859,42.94
860,42.92
861,42.92
862,42.92
863,42.86
864,42.9
865,42.82
866,43.06
867,43.06
868,42.88
869,42.92
870,42.84
871,42.68
872,42.78
873,42.84
874,42.94
875,42.98
876,42.98
877,42.92
878,42.9
879,42.74
880,42.98
881,43.0
882,42.98
883,42.92
884,43.06
885,43.06
886,43.06
887,43.12
888,43.08
889,43.12
890,43.17
891,43.17
892,43.1
893,42.96
894,42.98
895,43.12
896,43.23
897,43.17
898,43.17
899,43.13
900,43.19
901,43.13
902,43.25
903,43.25
904,43.0
905,43.04
906,42.96
907,43.02
908,42.9
909,42.96
910,43.12
911,43.12
912,43.13
913,43.25
914,43.13
915,43.13
916,43.13
917,43.15
918,43.25
919,43.39
920,43.53
921,43.43
922,43.33
923,43.45
924,43.43
925,43.51
926,43.37
927,43.41
928,43.57
929,44.24
930,44.8
931,43.53
932,42.26
933,42.44
934,42.8
935,42.88
936,43.67
937,43.67
938,43.65
939,43.61
940,43.35
941,43.17
942,43.29
943,43.31
944,43.39
945,43.57
946,43.65
947,43.96
948,43.86
949,43.75
950,43.39
951,42.88
952,42.52
953,42.36
954,42.3
955,42.66
956,43.29
957,43.71
958,43.8
959,43.8
960,43.86
961,43.92
962,43.84
963,43.84
964,43.73
965,43.61
966,43.37
967,43.25
968,43.29
969,43.04
970,42.98
971,43.1
972,43.17
973,43.12
974,43.21
975,43.25
976,43.29
977,43.27
978,43.15
979,43.12
980,43.17
981,43.17
982,43.15
983,43.15
984,43.08
985,43.0
986,42.94
987,42.92
988,42.92
989,42.98
990,43.02
991,42.88
992,42.84
993,42.8
994,42.86
995,42.86
996,42.86
997,42.84
998,43.02
999,42.92
1000,42.84
1001,42.84
1002,42.52
1003,42.68
1004,42.84
1005,42.82
1006,42.88
1007,42.9
1008,42.9
1009,42.92
1010,42.92
1011,42.9
1012,43.06
1013,43.04
1014,43.02
1015,42.92
1016,42.98
1017,42.92
1018,42.96
1019,42.96
1020,43.08
1021,43.04
1022,43.33
1023,43.12
1024,43.0
1025,42.9
1026,42.9
1027,42.96
1028,43.08
1029,43.13
1030,43.13
1031,43.1
1032,43.13
1033,43.17
1034,43.23
1035,43.33
1036,43.1
1037,42.9
1038,42.94
1039,42.96
1040,43.02
1041,43.02
1042,43.06
1043,43.02
1044,43.08
1045,43.27
1046,43.1
1047,43.13
1048,43.13
1049,43.17
1050,43.23
1051,43.49
1052,43.47
1053,43.45
1054,43.37
1055,43.41
1056,43.45
1057,43.45
1058,43.41
1059,43.47
1060,43.51
1061,44.0
1062,44.59
1063,44.86
1064,43.65
1065,42.5
1066,42.84
1067,42.78
1068,42.78
1069,43.67
1070,43.59
1071,43.45
1072,43.45
1073,43.23
1074,43.17
1075,43.29
1076,43.41
1077,43.57
1078,43.8
1079,43.84
1080,44.04
1081,43.9
1082,43.69
1083,43.43
1084,42.74
1085,42.64
1086,42.36
1087,42.38
1088,42.92
1089,43.53
1090,43.65
1091,43.71
1092,43.86
1093,43.9
1094,43.84
1095,43.78
1096,43.82
1097,43.8
1098,43.61
1099,43.37
1100,43.35
1101,43.33
1102,43.17
1103,43.23
1104,43.19
1105,43.27
1106,43.19
1107,43.37
1108,43.29
1109,43.31
1110,43.25
1111,43.25
1112,43.17
1113,43.15
1114,43.1
1115,43.15
1116,43.13
1117,43.1
1118,43.02
1119,42.76
1120,42.94
1121,42.92
1122,42.94
1123,42.88
1124,42.88
1125,42.88
1126,42.94
1127,42.86
1128,42.78
1129,42.82
1130,42.86
1131,42.94
1132,42.94
1133,42.82
1134,42.82
1135,42.72
1136,42.72
1137,42.76
1138,42.84
1139,42.88
1140,43.0
1141,43.04
1142,42.94
1143,42.94
1144,42.92
1145,43.08
1146,43.02
1147,43.0
1148,42.9
1149,42.92
1150,42.86
1151,43.0
1152,43.04
1153,43.06
1154,43.12
1155,43.15
1156,43.17
1157,43.06
1158,42.94
1159,42.98
1160,42.9
1161,43.12
1162,43.15
1163,43.21
1164,43.13
1165,43.12
1166,43.13
1167,43.23
1168,43.17
1169,43.06
1170,42.98
1171,42.92
1172,42.96
1173,43.02
1174,42.96
1175,43.17
1176,43.17
1177,43.25
1178,43.29
1179,43.17
1180,43.29
1181,43.13
1182,43.25
1183,43.1
1184,43.43
1185,43.49
1186,43.39
1187,43.53
1188,43.35
1189,43.47
1190,43.47
1191,43.45
1192,43.31
1193,43.63
1194,44.37
1195,44.72
1196,43.78
1197,42.54
1198,42.6
1199,42.86
1200,42.92
1201,43.65
1202,43.57
1203,43.37
1204,43.31
1205,43.17
1206,43.23
1207,43.17
1208,43.43
1209,43.57
1210,43.69
1211,43.88
1212,44.06
1213,43.96
1214,43.84
1215,43.27
1216,42.68
1217,42.56
1218,42.42
1219,42.28
1220,43.06
1221,43.49
1222,43.61
1223,43.69
1224,43.78
1225,43.92
1226,43.84
1227,43.8
1228,43.8
1229,43.69
1230,43.61
1231,43.49
1232,43.35
1233,43.29
1234,43.25
1235,43.21
1236,43.29
1237,43.35
1238,43.33
1239,43.53
1240,43.33
1241,43.37
1242,43.25
1243,43.29
1244,43.13
1245,43.13
1246,43.13
1247,43.13
1248,43.15
1249,43.04
1250,43.04
1251,43.08
1252,42.96
1253,42.94
1254,42.94
1255,42.7
1256,42.78
1257,43.0
1258,42.8
1259,42.84
1260,42.84
1261,42.82
1262,42.86
1263,42.98
1264,42.88
1265,42.9
1266,43.13
1267,42.92
1268,42.7
1269,42.84
1270,42.84
1271,43.06
1272,43.02
1273,43.08
1274,42.86
1275,42.9
1276,42.92
1277,43.08
1278,43.04
1279,42.88
1280,42.76
1281,42.86
1282,42.86
1283,43.02
1284,43.0
1285,43.27
1286,43.15
1287,43.1
1288,43.19
1289,43.02
1290,42.98
1291,42.94
1292,42.94
1293,43.12
1294,43.12
1295,43.17
1296,43.13
1297,43.12
1298,43.12
1299,43.08
1300,43.1
1301,42.96
1302,42.98
1303,42.94
1304,42.84
1305,43.02
1306,43.15
1307,43.23
1308,43.29
1309,43.31
1310,43.55
1311,43.71
1312,43.43
1313,43.33
1314,43.33
1315,43.47
1316,43.8
1317,43.67
1318,43.55
1319,43.53
1320,43.59
1321,43.73
1322,43.57
1323,43.65
1324,43.45
1325,43.61
1326,44.72
1327,44.74
1328,44.9
1329,44.86
1330,44.04
1331,42.4
1332,42.42
1333,42.84
1334,42.86
1335,43.59
1336,43.43
1337,43.39
1338,43.31
1339,43.33
1340,43.29
1341,43.43
1342,43.47
1343,43.69
1344,43.98
1345,43.73
1346,43.98
1347,43.92
1348,43.75
1349,43.45
1350,42.72
1351,42.6
1352,42.56
1353,43.21
1354,43.55
1355,43.73
1356,43.78
1357,43.82
1358,43.86
1359,43.8
1360,43.82
1361,43.9
1362,43.75
1363,43.55
1364,43.53
1365,43.33
1366,43.45
1367,43.33
1368,43.31
1369,43.29
1370,43.43
1371,43.39
1372,43.55
1373,43.35
1374,43.31
1375,43.37
1376,43.15
1377,43.13
1378,43.17
1379,43.13
1380,43.21
1381,43.13
1382,43.0
1383,42.98
1384,43.02
1385,42.94
1386,42.76
1387,42.88
1388,42.8
1389,42.82
1390,42.82
1391,42.88
1392,42.8
1393,42.86
1394,42.86
1395,42.86
1396,42.88
1397,42.98
1398,42.94
1399,42.9
1400,42.74
1401,42.78
1402,42.92
1403,42.82
1404,43.0
1405,43.19
1406,43.1
1407,43.02
1408,42.86
1409,42.94
1410,43.02
1411,42.92
1412,42.88
1413,42.74
1414,42.84
1415,42.9
1416,42.9
1417,43.02
1418,43.1
1419,43.1
1420,43.12
1421,43.02
1422,42.96
1423,42.94
1424,43.0
1425,42.96
1426,43.06
1427,43.15
1428,43.17
1429,43.15
1430,43.0
1431,43.1
1432,43.08
1433,43.0
1434,42.98
1435,42.96
1436,42.98
1437,42.98
1438,43.04
1439,43.0
1440,43.12
1441,43.17
1442,43.29
1443,43.35
1444,43.31
1445,43.35
1446,43.04
1447,43.43
1448,43.67
1449,44.24
1450,43.55
1451,43.55
1452,43.71
1453,43.49
1454,43.76
1455,43.88
1456,43.67
1457,43.29
1458,43.45
1459,44.02
1460,44.0
1461,43.67
1462,43.49
1463,43.86
1464,43.84
1465,43.78
1466,44.0
1467,43.88
1468,44.33
1469,44.57
1470,44.61
1471,44.78
1472,44.0
1473,42.34
1474,42.72
1475,42.86
1476,42.84
1477,43.59
1478,43.57
1479,43.43
1480,43.41
1481,43.33
1482,43.43
1483,43.37
1484,43.55
1485,43.71
1486,43.82
1487,43.96
1488,44.0
1489,44.02
1490,43.75
1491,43.45
1492,42.78
1493,42.6
1494,42.62
1495,43.47
1496,43.57
1497,43.71
1498,43.8
1499,43.84
1500,43.94
1501,43.9
1502,43.9
1503,43.9
1504,43.82
1505,43.76
1506,43.49
1507,43.53
1508,43.49
1509,43.41
1510,43.49
1511,43.51
1512,43.51
1513,43.55
1514,43.43
1515,43.45
1516,43.43
1517,43.39
1518,43.15
1519,43.27
1520,43.13
1521,43.12
1522,43.19
1523,43.15
1524,43.04
1525,43.02
1526,43.0
1527,42.92
1528,42.9
1529,42.78
1530,42.82
1531,42.92
1532,42.94
1533,42.96
1534,42.88
1535,42.82
1536,42.82
1537,42.86
1538,42.9
1539,42.98
1540,42.94
1541,42.88
1542,42.78
1543,42.94
1544,42.96
1545,42.94
1546,43.0
1547,43.12
1548,43.17
1549,43.0
1550,42.92
1551,42.92
1552,42.94
1553,42.94
1554,42.88
1555,42.92
1556,42.88
1557,43.02
1558,43.04
1559,43.12
1560,43.21
1561,43.06
1562,43.1
1563,43.08
1564,43.08
1565,43.1
1566,43.1
1567,43.0
1568,43.06
1569,43.15
1570,43.13
1571,43.06
1572,43.1
1573,43.06
1574,42.98
1575,43.02
1576,42.96
1577,43.0
1578,43.06
1579,43.04
1580,43.06
1581,43.06
1582,43.13
1583,43.17
1584,43.13
1585,43.25
1586,43.15
1587,43.19
1588,43.1
1589,43.43
1590,43.65
1591,43.55
1592,43.49
1593,43.49
1594,43.39
1595,43.37
1596,43.63
1597,43.65
1598,43.71
1599,43.49
1600,43.04
1601,43.63
1602,43.33
1603,43.29
1604,43.12
1605,43.15
1606,43.53
1607,43.47
1608,43.49
1609,43.61
1610,43.8
1611,43.96
1612,44.12
1613,44.2
1614,43.47
1615,42.34
1616,42.58
1617,42.74
1618,42.9
1619,43.53
1620,43.53
1621,43.39
1622,43.31
1623,43.33
1624,43.43
1625,43.41
1626,43.59
1627,43.75
1628,43.9
1629,43.98
1630,44.0
1631,43.98
1632,43.63
1633,43.17
1634,42.84
1635,42.48
1636,42.78
1637,43.49
1638,43.63
1639,43.75
1640,43.82
1641,43.88
1642,43.94
1643,43.92
1644,43.94
1645,43.9
1646,43.8
1647,43.73
1648,43.59
1649,43.55
1650,43.51
1651,43.57
1652,43.61
1653,43.57
1654,43.69
1655,43.67
1656,43.55
1657,43.55
1658,43.53
1659,43.45
1660,43.25
1661,43.25
1662,43.29
1663,43.27
1664,43.21
1665,43.15
1666,43.06
1667,43.08
1668,43.0
1669,42.98
1670,42.94
1671,42.94
1672,42.88
1673,42.98
1674,43.02
1675,42.98
1676,42.94
1677,42.92
1678,42.92
1679,42.94
1680,43.13
1681,43.06
1682,43.02
1683,42.84
1684,42.86
1685,42.96
1686,42.96
1687,42.94
1688,43.02
1689,43.0
1690,43.21
1691,43.17
1692,43.1
1693,43.04
1694,42.98
1695,42.9
1696,42.92
1697,42.98
1698,42.98
1699,43.13
1700,43.12
1701,43.15
1702,43.17
1703,43.29
1704,43.15
1705,43.13
1706,43.08
1707,42.96
1708,42.98
1709,43.06
1710,43.23
1711,43.21
1712,43.13
1713,43.13
1714,43.13
1715,43.1
1716,43.1
1717,43.1
1718,43.06
1719,42.96
1720,42.96
1721,43.02
1722,42.96
1723,43.08
1724,43.08
1725,43.08
1726,43.17
1727,43.21
1728,43.12
1729,43.1
1730,43.1
1731,43.39
1732,43.53
1733,43.49
1734,43.39
1735,43.35
1736,43.51
1737,43.51
1738,43.55
1739,43.65
1740,43.59
1741,43.49
1742,43.12
1743,43.27
1744,43.06
1745,43.02
1746,43.15
1747,43.02
1748,43.33
1749,43.39
1750,43.45
1751,43.53
1752,43.75
1753,43.84
1754,43.98
1755,43.71
1756,43.04
1757,42.26
1758,42.74
1759,42.82
1760,43.0
1761,43.41
1762,43.37
1763,43.29
1764,43.31
1765,43.31
1766,43.31
1767,43.41
1768,43.49
1769,43.76
1770,43.96
1771,43.84
1772,44.02
1773,44.1
1774,43.51
1775,42.9
1776,42.72
1777,42.48
1778,42.38
1779,43.1
1780,43.45
1781,43.67
1782,43.84
1783,43.82
1784,43.9
1785,43.9
1786,43.98
1787,43.88
1788,43.84
1789,43.76
1790,43.8
1791,43.65
1792,43.59
1793,43.63
1794,43.39
1795,43.57
1796,43.65
1797,43.63
1798,43.73
1799,43.59
1800,43.55
1801,43.59
1802,43.45
1803,43.33
1804,43.29
1805,43.27
1806,43.27
1807,43.23
1808,43.12
1809,43.1
1810,43.1
1811,43.04
1812,43.0
1813,42.98
1814,42.96
1815,42.92
1816,42.98
1817,42.98
1818,42.88
1819,42.92
1820,42.96
1821,42.92
1822,42.94
1823,43.08
1824,43.1
1825,42.82
1826,42.9
1827,42.84
1828,42.92
1829,42.96
1830,43.06
1831,43.04
1832,43.19
1833,43.17
1834,43.19
1835,43.27
1836,43.06
1837,43.02
1838,42.92
1839,42.96
1840,42.98
1841,43.04
1842,43.12
1843,43.13
1844,43.12
1845,43.19
1846,43.17
1847,43.19
1848,43.19
1849,43.04
1850,42.98
1851,43.1
1852,43.27
1853,43.29
1854,43.37
1855,43.21
1856,43.12
1857,43.12
1858,43.06
1859,43.06
1860,42.92
1861,43.04
1862,43.02
1863,43.02
1864,43.06
1865,43.02
1866,43.06
1867,43.12
1868,43.1
1869,43.1
1870,43.08
1871,43.08
1872,43.13
1873,43.13
1874,43.25
1875,43.33
1876,43.41
1877,43.39
1878,43.37
1879,43.47
1880,43.57
1881,43.86
1882,43.67
1883,43.47
1884,43.27
1885,43.23
1886,43.45
1887,43.21
1888,43.06
1889,43.08
1890,43.19
1891,43.51
1892,43.43
1893,43.61
1894,43.73
1895,43.73
1896,43.67
1897,43.82
1898,43.57
1899,43.23
1900,42.28
1901,42.76
1902,42.94
1903,43.04
1904,43.35
1905,43.27
1906,43.12
1907,43.13
1908,43.17
1909,43.29
1910,43.29
1911,43.53
1912,43.76
1913,43.9
1914,43.82
1915,43.92
1916,43.98
1917,43.41
1918,42.86
1919,42.74
1920,42.3
1921,42.38
1922,43.13
1923,43.51
1924,43.53
1925,43.73
1926,43.84
1927,43.9
1928,43.9
1929,43.92
1930,43.9
1931,43.92
1932,43.76
1933,43.61
1934,43.53
1935,43.59
1936,43.61
1937,43.57
1938,43.41
1939,43.61
1940,43.67
1941,43.67
1942,43.67
1943,43.57
1944,43.57
1945,43.37
1946,43.33
1947,43.31
1948,43.29
1949,43.23
1950,43.15
1951,43.17
1952,43.1
1953,43.13
1954,43.1
1955,43.0
1956,43.0
1957,42.96
1958,42.94
1959,43.1
1960,43.0
1961,42.96
1962,42.98
1963,42.94
1964,42.92
1965,43.04
1966,43.12
1967,43.04
1968,42.92
1969,42.9
1970,42.96
1971,42.94
1972,43.0
1973,43.06
1974,43.08
1975,43.15
1976,43.37
1977,43.19
1978,43.13
1979,43.13
1980,43.08
1981,42.98
1982,43.12
1983,42.96
1984,43.08
1985,43.04
1986,43.1
1987,43.12
1988,43.21
1989,43.27
1990,43.19
1991,43.17
1992,43.06
1993,42.86
1994,43.13
1995,43.41
1996,43.31
1997,43.25
1998,43.19
1999,43.08
2000,43.15
2001,43.02
2002,43.04
2003,42.98
2004,42.98
2005,43.02
2006,42.98
2007,43.02
2008,43.06
2009,43.04
2010,43.08
2011,43.13
2012,43.08
2013,43.1
2014,43.08
2015,43.12
2016,43.13
2017,43.13
2018,43.33
2019,43.39
2020,43.49
2021,43.37
2022,43.43
2023,43.41
2024,43.45
2025,43.49
2026,43.29
2027,43.23
2028,43.06
2029,43.39
2030,43.0
2031,43.04
2032,43.04
2033,43.47
2034,43.78
2035,44.04
2036,43.86
2037,43.61
2038,43.61
2039,43.8
2040,43.76
2041,43.71
2042,43.25
2043,43.02
2044,42.96
2045,43.1
2046,43.33
2047,43.08
2048,43.13
2049,43.13
2050,43.17
2051,43.29
2052,43.33
2053,43.57
2054,43.59
2055,43.92
2056,43.82
2057,44.04
2058,43.75
2059,43.19
2060,42.68
2061,42.74
2062,42.36
2063,42.64
2064,43.19
2065,43.41
2066,43.55
2067,43.65
2068,43.8
2069,43.84
2070,43.88
2071,43.92
2072,43.92
2073,43.82
2074,43.73
2075,43.59
2076,43.59
2077,43.59
2078,43.55
2079,43.55
2080,43.61
2081,43.73
2082,43.67
2083,43.69
2084,43.65
2085,43.57
2086,43.63
2087,43.47
2088,43.41
2089,43.29
2090,43.27
2091,43.25
2092,43.19
2093,43.17
2094,43.13
2095,43.17
2096,43.25
2097,43.1
2098,43.02
2099,42.94
2100,42.96
2101,42.94
2102,43.02
2103,43.0
2104,42.98
2105,43.0
2106,42.96
2107,43.04
2108,43.13
2109,43.12
2110,43.04
2111,43.0
2112,43.02
2113,43.12
2114,43.1
2115,43.12
2116,43.15
2117,43.13
2118,43.25
2119,43.17
2120,43.21
2121,43.15
2122,43.08
2123,43.06
2124,43.04
2125,42.98
2126,43.08
2127,43.08
2128,43.12
2129,43.13
2130,43.23
2131,43.19
2132,43.21
2133,43.19
2134,43.13
2135,43.1
2136,43.17
2137,43.21
2138,43.23
2139,43.17
2140,43.23
2141,43.04
2142,43.12
2143,43.0
2144,43.0
2145,43.0
2146,42.98
2147,42.96
2148,42.9
2149,42.92
2150,42.96
2151,43.04
2152,43.13
2153,43.13
2154,43.13
2155,43.13
2156,43.1
2157,43.13
2158,43.04
2159,43.13
2160,43.08
2161,43.33
2162,43.37
2163,43.37
2164,43.35
2165,43.41
2166,43.39
2167,43.21
2168,43.21
2169,43.19
2170,43.21
2171,43.45
2172,43.0
2173,42.88
2174,42.96
2175,43.13
2176,43.49
2177,43.55
2178,43.61
2179,43.49
2180,43.57
2181,43.75
2182,43.92
2183,43.51
2184,42.86
2185,43.04
2186,43.15
2187,43.04
2188,43.25
2189,42.9
2190,42.98
2191,43.13
2192,43.08
2193,43.19
2194,43.39
2195,43.55
2196,43.67
2197,43.73
2198,43.73
2199,43.78
2200,43.51
2201,42.7
2202,42.66
2203,42.56
2204,42.46
2205,43.27
2206,43.47
2207,43.57
2208,43.76
2209,43.65
2210,43.84
2211,43.86
2212,43.92
2213,43.9
2214,43.76
2215,43.67
2216,43.59
2217,43.43
2218,43.57
2219,43.47
2220,43.47
2221,43.61
2222,43.67
2223,43.8
2224,43.67
2225,43.67
2226,43.57
2227,43.51
2228,43.49
2229,43.25
2230,43.29
2231,43.27
2232,43.15
2233,43.15
2234,43.15
2235,43.12
2236,43.1
2237,43.12
2238,43.04
2239,42.98
2240,42.92
2241,42.84
2242,42.92
2243,42.94
2244,43.02
2245,43.04
2246,43.04
2247,43.02
2248,43.0
2249,43.12
2250,42.98
2251,42.88
2252,42.94
2253,43.06
2254,43.15
2255,43.12
2256,43.12
2257,43.12
2258,43.17
2259,43.17
2260,43.17
2261,43.1
2262,43.06
2263,43.02
2264,42.9
2265,43.12
2266,43.04
2267,43.04
2268,43.08
2269,43.12
2270,43.27
2271,43.17
2272,43.19
2273,43.12
2274,43.21
2275,43.17
2276,43.25
2277,43.27
2278,43.21
2279,43.06
2280,43.17
2281,43.27
2282,43.1
2283,43.12
2284,42.98
2285,42.96
2286,43.0
2287,42.98
2288,42.84
2289,42.9
2290,43.23
2291,43.02
2292,42.98
2293,43.12
2294,43.23
2295,43.17
2296,43.15
2297,43.12
2298,43.13
2299,43.12
2300,43.1
2301,43.23
2302,43.29
2303,43.29
2304,43.29
2305,43.33
2306,43.29
2307,43.27
2308,43.23
2309,43.27
2310,43.15
2311,43.23
2312,43.55
2313,43.0
2314,43.0
2315,43.02
2316,43.06
2317,43.37
2318,43.29
2319,43.45
2320,43.37
2321,43.51
2322,43.61
2323,43.65
2324,43.02
2325,42.72
2326,42.54
2327,43.08
2328,43.17
2329,43.17
2330,43.23
2331,42.98
2332,42.86
2333,43.1
2334,43.1
2335,43.12
2336,43.21
2337,43.49
2338,43.57
2339,43.88
2340,43.78
2341,43.94
2342,43.51
2343,42.54
2344,42.6
2345,42.36
2346,42.32
2347,42.72
2348,43.29
2349,43.57
2350,43.43
2351,43.57
2352,43.67
2353,43.86
2354,43.92
2355,43.96
2356,43.86
2357,43.78
2358,43.63
2359,43.57
2360,43.53
2361,43.43
2362,43.47
2363,43.43
2364,43.61
2365,43.71
2366,43.71
2367,43.67
2368,43.65
2369,43.57
2370,43.53
2371,43.41
2372,43.41
2373,43.45
2374,43.35
2375,43.15
2376,43.17
2377,43.15
2378,43.02
2379,43.02
2380,43.0
2381,42.86
2382,42.78
2383,42.84
2384,42.92
2385,42.84
2386,42.94
2387,43.02
2388,43.02
2389,43.06
2390,43.06
2391,43.04
2392,43.02
2393,43.02
2394,42.94
2395,42.84
2396,43.06
2397,43.19
2398,43.15
2399,43.12
2400,43.13
2401,43.12
2402,43.17
2403,43.04
2404,43.04
2405,43.06
2406,43.0
2407,42.88
2408,43.06
2409,42.98
2410,43.0
2411,43.0
2412,42.92
2413,42.92
2414,43.21
2415,43.19
2416,43.1
2417,43.19
2418,42.98
2419,43.23
2420,43.19
2421,43.21
2422,43.25
2423,43.39
2424,43.29
2425,43.08
2426,43.12
2427,43.04
2428,42.92
2429,42.94
2430,42.92
2431,42.9
2432,42.78
2433,42.94
2434,42.96
2435,43.0
2436,43.08
2437,43.12
2438,43.06
2439,43.08
2440,43.15
2441,43.1
2442,42.88
2443,43.08
2444,43.06
2445,43.27
2446,43.29
2447,43.23
2448,43.29
2449,43.27
2450,43.25
2451,43.27
2452,43.19
2453,43.19
2454,43.29
2455,43.37
2456,43.25
2457,43.02
2458,43.25
2459,43.33
2460,43.55
2461,43.49
2462,43.61
2463,43.35
2464,43.43
2465,43.57
2466,43.57
2467,43.25
2468,42.82
2469,42.68
2470,43.27
2471,43.27
2472,43.17
2473,43.27
2474,42.86
2475,43.04
2476,43.06
2477,43.12
2478,43.06
2479,43.27
2480,43.61
2481,43.69
2482,43.8
2483,43.8
2484,44.27
2485,43.84
2486,42.64
2487,42.72
2488,42.34
2489,42.3
2490,42.84
2491,43.29
2492,43.49
2493,43.57
2494,43.49
2495,43.78
2496,43.98
2497,44.06
2498,43.92
2499,43.84
2500,43.76
2501,43.67
2502,43.59
2503,43.47
2504,43.43
2505,43.45
2506,43.53
2507,43.53
2508,43.63
2509,43.73
2510,43.69
2511,43.69
2512,43.71
2513,43.45
2514,43.35
2515,43.43
2516,43.39
2517,43.29
2518,43.12
2519,43.13
2520,43.12
2521,43.06
2522,43.02
2523,43.08
2524,42.86
2525,42.9
2526,42.9
2527,42.86
2528,42.96
2529,42.96
2530,43.0
2531,43.02
2532,43.06
2533,42.98
2534,42.96
2535,43.04
2536,43.02
2537,42.96
2538,42.94
2539,43.1
2540,43.08
2541,43.06
2542,43.06
2543,43.12
2544,43.13
2545,43.04
2546,42.98
2547,43.1
2548,43.08
2549,43.02
2550,42.96
2551,42.98
2552,42.86
2553,42.96
2554,42.98
2555,43.04
2556,43.17
2557,43.12
2558,43.02
2559,43.15
2560,43.13
2561,43.1
2562,43.13
2563,43.19
2564,43.21
2565,43.23
2566,43.21
2567,43.27
2568,43.12
2569,43.13
2570,43.08
2571,43.08
2572,43.0
2573,42.88
2574,42.92
2575,42.94
2576,43.12
2577,43.04
2578,43.13
2579,43.04
2580,43.21
2581,43.17
2582,43.25
2583,43.08
2584,43.08
2585,43.08
2586,43.08
2587,43.06
2588,43.23
2589,43.21
2590,43.25
2591,43.23
2592,43.31
2593,43.23
2594,43.21
2595,43.13
2596,43.1
2597,43.17
2598,43.08
2599,42.92
2600,42.9
2601,43.04
2602,42.94
2603,43.29
2604,43.17
2605,43.39
2606,43.21
2607,43.31
2608,43.61
2609,43.63
2610,43.31
2611,42.78
2612,42.9
2613,43.41
2614,43.19
2615,43.19
2616,43.27
2617,43.17
2618,43.06
2619,43.06
2620,43.1
2621,43.39
2622,43.47
2623,43.61
2624,43.76
2625,43.98
2626,44.0
2627,43.92
2628,43.57
2629,42.84
2630,42.62
2631,42.4
2632,42.26
2633,42.96
2634,43.33
2635,43.53
2636,43.59
2637,43.78
2638,43.8
2639,43.94
2640,44.04
2641,44.0
2642,43.92
2643,43.88
2644,43.69
2645,43.41
2646,43.55
2647,43.49
2648,43.47
2649,43.49
2650,43.69
2651,43.65
2652,43.84
2653,43.8
2654,43.69
2655,43.55
2656,43.51
2657,43.45
2658,43.43
2659,43.37
2660,43.45
2661,43.15
2662,43.19
2663,43.13
2664,43.13
2665,43.04
2666,43.13
2667,43.08
2668,42.92
2669,42.96
2670,42.96
2671,43.04
2672,42.88
2673,43.02
2674,43.02
2675,43.04
2676,43.08
2677,43.13
2678,43.13
2679,43.06
2680,42.86
2681,43.0
2682,43.02
2683,43.08
2684,43.08
2685,43.0
2686,43.23
2687,43.13
2688,43.13
2689,43.13
2690,43.08
2691,42.92
2692,42.94
2693,43.12
2694,42.9
2695,42.6
2696,43.04
2697,43.08
2698,43.08
2699,43.06
2700,43.15
2701,43.15
2702,43.23
2703,43.19
2704,43.12
2705,43.17
2706,43.15
2707,43.17
2708,43.23
2709,43.21
2710,43.19
2711,43.21
2712,43.12
2713,43.12
2714,43.13
2715,43.1
2716,42.94
2717,42.96
2718,43.06
2719,43.19
2720,43.17
2721,43.08
2722,43.17
2723,43.15
2724,43.12
2725,43.21
2726,43.13
2727,43.13
2728,43.13
2729,43.13
2730,43.25
2731,43.21
2732,43.35
2733,43.27
2734,43.39
2735,43.31
2736,43.37
2737,43.12
2738,43.12
2739,43.1
2740,43.1
2741,43.19
2742,42.92
2743,42.8
2744,42.74
2745,42.94
2746,43.1
2747,43.12
2748,43.17
2749,43.21
2750,43.51
2751,43.69
2752,43.9
2753,43.57
2754,42.88
2755,42.34
2756,43.21
2757,43.43
2758,43.31
2759,43.13
2760,43.35
2761,43.02
2762,42.94
2763,43.02
2764,43.1
2765,43.23
2766,43.47
2767,43.55
2768,43.45
2769,43.86
2770,43.9
2771,44.12
2772,43.21
2773,42.4
2774,42.6
2775,42.34
2776,42.52
2777,43.08
2778,43.45
2779,43.49
2780,43.43
2781,43.78
2782,44.02
2783,43.98
2784,44.0
2785,44.1
2786,43.9
2787,43.94
2788,43.65
2789,43.55
2790,43.51
2791,43.55
2792,43.65
2793,43.59
2794,43.71
2795,43.86
2796,43.8
2797,43.75
2798,43.71
2799,43.63
2800,43.57
2801,43.45
2802,43.43
2803,43.33
2804,43.23
2805,43.27
2806,43.17
2807,43.04
2808,43.19
2809,43.19
2810,43.15
2811,43.13
2812,42.98
2813,42.92
2814,43.0
2815,42.98
2816,43.0
2817,43.0
2818,42.96
2819,43.08
2820,43.31
2821,43.27
2822,43.12
2823,43.1
2824,43.06
2825,43.02
2826,43.04
2827,43.02
2828,43.06
2829,43.02
2830,43.15
2831,43.17
2832,43.13
2833,43.13
2834,43.08
2835,42.9
2836,43.02
2837,43.13
2838,43.02
2839,42.94
2840,43.0
2841,43.08
2842,43.08
2843,43.08
2844,43.12
2845,43.12
2846,43.12
2847,43.13
2848,43.13
2849,43.17
2850,43.17
2851,43.12
2852,43.19
2853,43.21
2854,43.21
2855,43.12
2856,43.02
2857,43.08
2858,43.1
2859,43.02
2860,42.88
2861,43.0
2862,42.94
2863,43.1
2864,43.15
2865,43.08
2866,43.1
2867,43.15
2868,43.13
2869,43.21
2870,43.15
2871,43.17
2872,43.15
2873,43.15
2874,43.15
2875,43.29
2876,43.35
2877,43.49
2878,43.27
2879,43.27
2880,43.35
2881,43.23
2882,43.12
2883,43.0
2884,43.08
2885,42.96
2886,42.84
2887,42.8
2888,42.92
2889,42.8
2890,43.1
2891,43.12
2892,43.17
2893,43.15
2894,43.47
2895,43.8
2896,43.78
2897,43.47
2898,42.94
2899,42.86
2900,43.13
2901,43.15
2902,43.13
2903,43.43
2904,42.86
2905,43.0
2906,43.02
2907,43.12
2908,43.31
2909,43.47
2910,43.57
2911,43.69
2912,43.88
2913,43.94
2914,43.96
2915,43.17
2916,42.5
2917,42.68
2918,42.44
2919,42.82
2920,43.0
2921,43.31
2922,43.47
2923,43.67
2924,43.82
2925,43.92
2926,44.02
2927,44.08
2928,43.98
2929,43.86
2930,43.84
2931,43.61
2932,43.57
2933,43.49
2934,43.37
2935,43.49
2936,43.67
2937,43.8
2938,43.96
2939,43.84
2940,43.71
2941,43.65
2942,43.69
2943,43.57
2944,43.41
2945,43.39
2946,43.31
2947,43.27
2948,43.17
2949,43.25
2950,43.33
2951,43.35
2952,43.33
2953,43.15
2954,42.96
2955,42.92
2956,42.98
2957,43.04
2958,43.04
2959,43.04
2960,43.04
2961,43.04
2962,43.15
2963,43.23
2964,43.13
2965,43.12
2966,43.08
2967,42.98
2968,43.12
2969,43.02
2970,43.02
2971,43.04
2972,43.13
2973,43.17
2974,43.12
2975,43.12
2976,43.12
2977,43.02
2978,43.04
2979,43.06
2980,43.1
2981,43.1
2982,43.02
2983,43.06
2984,43.1
2985,43.12
2986,43.15
2987,43.23
2988,43.19
2989,43.13
2990,43.1
2991,43.08
2992,43.04
2993,43.04
2994,43.13
2995,43.19
2996,43.37
2997,43.21
2998,43.0
2999,43.08
3000,43.06
3001,42.96
3002,43.02
3003,42.98
3004,43.0
3005,43.04
3006,43.12
3007,43.19
3008,43.13
3009,43.12
3010,43.19
3011,43.17
3012,43.19
3013,43.17
3014,43.17
3015,43.15
3016,43.17
3017,43.25
3018,43.29
3019,43.35
3020,43.35
3021,43.37
3022,43.41
3023,43.29
3024,43.25
3025,43.13
3026,43.02
3027,43.0
3028,42.8
3029,42.78
3030,42.76
3031,42.92
3032,42.98
3033,43.1
3034,43.08
3035,43.19
3036,43.17
3037,43.49
3038,43.53
3039,43.8
3040,43.61
3041,43.0
3042,42.9
3043,43.15
3044,43.27
3045,43.37
3046,43.08
3047,43.0
3048,43.13
3049,43.25
3050,43.27
3051,43.49
3052,43.63
3053,43.73
3054,43.9
3055,43.94
3056,43.71
3057,42.9
3058,42.72
3059,42.54
3060,42.5
3061,42.92
3062,43.15
3063,43.29
3064,43.51
3065,43.63
3066,43.71
3067,43.9
3068,44.0
3069,44.02
3070,43.94
3071,43.76
3072,43.73
3073,43.63
3074,43.59
3075,43.49
3076,43.47
3077,43.47
3078,43.67
3079,43.78
3080,43.9
3081,43.9
3082,43.76
3083,43.76
3084,43.69
3085,43.51
3086,43.53
3087,43.39
3088,43.29
3089,43.21
3090,43.23
3091,43.27
3092,43.21
3093,43.17
3094,43.15
3095,43.12
3096,42.94
3097,42.94
3098,42.94
3099,43.06
3100,43.04
3101,43.04
3102,42.98
3103,43.1
3104,43.12
3105,43.15
3106,43.08
3107,43.1
3108,42.92
3109,42.98
3110,43.06
3111,43.04
3112,43.0
3113,43.08
3114,43.04
3115,43.12
3116,43.17
3117,43.1
3118,43.06
3119,43.04
3120,43.1
3121,43.12
3122,43.17
3123,43.06
3124,42.94
3125,43.02
3126,43.1
3127,43.15
3128,43.13
3129,43.17
3130,43.13
3131,43.15
3132,43.1
3133,43.0
3134,42.94
3135,43.02
3136,43.04
3137,43.15
3138,43.23
3139,43.13
3140,43.12
3141,43.13
3142,43.23
3143,43.19
3144,43.04
3145,43.04
3146,43.04
3147,43.08
3148,43.17
3149,43.17
3150,43.19
3151,43.12
3152,43.19
3153,43.19
3154,43.21
3155,43.19
3156,43.15
3157,43.13
3158,43.15
3159,43.27
3160,43.35
3161,43.37
3162,43.35
3163,43.37
3164,43.41
3165,43.23
3166,43.19
3167,43.08
3168,43.02
3169,42.76
3170,42.82
3171,42.74
3172,42.78
3173,42.88
3174,42.88
3175,43.02
3176,43.08
3177,43.12
3178,43.17
3179,43.47
3180,43.57
3181,43.76
3182,44.02
3183,43.15
3184,42.3
3185,43.33
3186,43.19
3187,43.21
3188,43.17
3189,42.94
3190,43.12
3191,43.0
3192,43.31
3193,43.31
3194,43.41
3195,43.59
3196,43.82
3197,43.86
3198,43.75
3199,43.61
3200,42.82
3201,42.7
3202,42.62
3203,42.44
3204,42.84
3205,43.13
3206,43.45
3207,43.53
3208,43.71
3209,43.78
3210,43.94
3211,43.92
3212,44.06
3213,43.94
3214,43.76
3215,43.69
3216,43.61
3217,43.59
3218,43.69
3219,43.57
3220,43.61
3221,43.55
3222,43.8
3223,43.78
3224,43.86
3225,43.86
3226,43.73
3227,43.57
3228,43.67
3229,43.61
3230,43.51
3231,43.39
3232,43.27
3233,43.23
3234,43.25
3235,43.35
3236,43.21
3237,43.08
3238,43.06
3239,42.9
3240,42.92
3241,43.0
3242,43.0
3243,43.02
3244,43.04
3245,43.04
3246,43.08
3247,43.12
3248,43.13
3249,43.08
3250,43.04
3251,42.92
3252,42.92
3253,42.98
3254,42.96
3255,43.02
3256,43.06
3257,43.06
3258,43.12
3259,43.1
3260,43.17
3261,43.1
3262,43.08
3263,43.04
3264,43.12
3265,43.29
3266,43.12
3267,43.04
3268,43.1
3269,43.02
3270,43.13
3271,43.17
3272,43.17
3273,43.13
3274,42.96
3275,43.06
3276,42.92
3277,42.94
3278,43.0
3279,43.0
3280,43.17
3281,43.17
3282,43.21
3283,43.12
3284,43.06
3285,43.19
3286,43.19
3287,43.08
3288,43.06
3289,43.0
3290,43.08
3291,43.19
3292,43.21
3293,43.08
3294,43.31
3295,43.19
3296,43.19
3297,43.19
3298,43.15
3299,43.0
3300,43.13
3301,43.17
3302,43.33
3303,43.47
3304,43.37
3305,43.31
3306,43.29
3307,43.29
3308,43.21
3309,43.15
3310,43.0
3311,42.88
3312,42.76
3313,42.76
3314,42.72
3315,42.74
3316,42.88
3317,42.86
3318,43.15
3319,43.08
3320,43.15
3321,43.23
3322,43.43
3323,43.55
3324,43.69
3325,44.06
3326,43.15
3327,42.46
3328,43.49
3329,43.15
3330,43.12
3331,42.9
3332,42.92
3333,43.12
3334,43.17
3335,43.27
3336,43.39
3337,43.49
3338,43.61
3339,43.76
3340,43.9
3341,43.75
3342,43.47
3343,42.58
3344,42.62
3345,42.4
3346,42.76
3347,43.08
3348,43.35
3349,43.51
3350,43.67
3351,43.76
3352,43.88
3353,44.02
3354,44.14
3355,43.88
3356,43.84
3357,43.86
3358,43.53
3359,43.45
3360,43.51
3361,43.47
3362,43.59
3363,43.59
3364,43.71
3365,43.73
3366,43.86
3367,43.76
3368,43.75
3369,43.61
3370,43.59
3371,43.47
3372,43.37
3373,43.31
3374,43.29
3375,43.25
3376,43.27
3377,43.19
3378,43.17
3379,43.06
3380,42.98
3381,42.96
3382,42.84
3383,42.94
3384,42.94
3385,43.0
3386,43.04
3387,43.12
3388,43.1
3389,43.15
3390,43.12
3391,43.02
3392,43.02
3393,42.84
3394,42.94
3395,42.9
3396,43.02
3397,43.02
3398,43.06
3399,43.04
3400,43.12
3401,43.04
3402,43.1
3403,43.12
3404,42.98
3405,42.98
3406,42.88
3407,43.02
3408,43.0
3409,42.94
3410,43.02
3411,43.1
3412,43.13
3413,43.02
3414,43.13
3415,43.06
3416,43.06
3417,43.02
3418,42.96
3419,42.96
3420,42.98
3421,43.04
3422,43.06
3423,43.1
3424,43.08
3425,43.06
3426,43.06
3427,43.1
3428,43.1
3429,43.19
3430,43.08
3431,43.02
3432,43.04
3433,43.06
3434,43.25
3435,43.17
3436,43.06
3437,43.23
3438,43.21
3439,43.21
3440,43.19
3441,43.02
3442,43.1
3443,43.21
3444,43.29
3445,43.31
3446,43.27
3447,43.25
3448,43.21
3449,43.23
3450,43.15
3451,43.06
3452,42.92
3453,42.84
3454,42.76
3455,42.68
3456,42.58
3457,42.72
3458,42.78
3459,42.96
3460,43.08
3461,43.21
3462,43.25
3463,43.19
3464,43.37
3465,43.53
3466,43.86
3467,43.84
3468,43.19
3469,43.06
3470,43.15
3471,43.06
3472,42.96
3473,42.92
3474,43.08
3475,43.12
3476,43.13
3477,43.37
3478,43.45
3479,43.51
3480,43.69
3481,43.88
3482,43.73
3483,43.53
3484,42.56
3485,42.52
3486,42.38
3487,42.84
3488,43.06
3489,43.27
3490,43.43
3491,43.63
3492,43.71
3493,43.8
3494,43.96
3495,44.0
3496,43.9
3497,43.76
3498,43.75
3499,43.43
3500,43.47
3501,43.31
3502,43.51
3503,43.57
3504,43.53
3505,43.63
3506,43.69
3507,43.84
3508,43.75
3509,43.67
3510,43.59
3511,43.59
3512,43.55
3513,43.33
3514,43.29
3515,43.21
3516,43.19
3517,43.25
3518,43.23
3519,43.1
3520,43.12
3521,42.98
3522,42.92
3523,42.86
3524,42.92
3525,43.0
3526,43.0
3527,43.02
3528,43.12
3529,43.06
3530,43.06
3531,43.0
3532,42.98
3533,42.86
3534,42.88
3535,42.78
3536,42.94
3537,42.86
3538,42.9
3539,42.94
3540,43.08
3541,43.04
3542,43.0
3543,43.04
3544,43.04
3545,42.98
3546,43.02
3547,42.88
3548,42.9
3549,43.0
3550,43.0
3551,42.96
3552,43.1
3553,43.12
3554,43.12
3555,43.13
3556,43.1
3557,43.12
3558,42.9
3559,42.92
3560,42.92
3561,43.04
3562,43.1
3563,43.1
3564,43.1
3565,43.08
3566,43.04
3567,43.04
3568,43.08
3569,43.06
3570,43.04
3571,42.94
3572,42.88
3573,42.94
3574,43.02
3575,43.08
3576,43.12
3577,43.17
3578,43.23
3579,43.17
3580,43.15
3581,43.13
3582,43.23
3583,43.12
3584,43.19
3585,43.37
3586,43.27
3587,43.27
3588,43.21
3589,43.23
3590,43.19
3591,43.04
3592,43.08
3593,43.02
3594,42.92
3595,42.8
3596,42.68
3597,42.68
3598,42.68
3599,42.72
3600,42.82
3601,43.17
3602,43.1
3603,43.31
3604,43.19
3605,43.25
3606,43.53
3607,44.08
3608,43.61
3609,42.74
3610,42.66
3611,43.0
3612,43.13
3613,42.86
3614,42.9
3615,42.96
3616,43.1
3617,43.21
3618,43.29
3619,43.43
3620,43.47
3621,43.69
3622,43.78
3623,43.63
3624,43.13
3625,42.64
3626,42.44
3627,42.36
3628,42.8
3629,42.92
3630,43.25
3631,43.49
3632,43.53
3633,43.67
3634,43.73
3635,43.84
3636,43.92
3637,43.86
3638,43.78
3639,43.76
3640,43.63
3641,43.49
3642,43.47
3643,43.51
3644,43.59
3645,43.57
3646,43.78
3647,43.76
3648,43.84
3649,43.9
3650,43.69
3651,43.67
3652,43.59
3653,43.55
3654,43.45
3655,43.37
3656,43.15
3657,43.23
3658,43.19
3659,43.35
3660,43.12
3661,43.06
3662,43.1
3663,42.74
3664,42.9
3665,42.8
3666,43.0
3667,43.0
3668,43.02
3669,43.1
3670,43.13
3671,43.08
3672,43.04
3673,42.98
3674,42.92
3675,42.76
3676,42.84
3677,42.96
3678,42.94
3679,42.9
3680,43.02
3681,43.08
3682,43.1
3683,43.06
3684,43.02
3685,43.12
3686,43.04
3687,43.19
3688,42.94
3689,43.0
3690,43.04
3691,42.94
3692,43.15
3693,43.06
3694,43.15
3695,43.17
3696,43.15
3697,43.15
3698,43.15
3699,43.13
3700,43.0
3701,43.0
3702,43.08
3703,43.02
3704,43.1
3705,43.04
3706,43.08
3707,43.0
3708,43.08
3709,43.08
3710,43.02
3711,43.0
3712,42.98
3713,43.04
3714,42.94
3715,42.98
3716,43.08
3717,43.02
3718,43.12
3719,43.21
3720,43.25
3721,43.23
3722,43.21
3723,43.17
3724,43.13
3725,43.19
3726,43.29
3727,43.39
3728,43.31
3729,43.21
3730,43.17
3731,43.19
3732,43.12
3733,43.02
3734,42.96
3735,42.82
3736,42.74
3737,42.64
3738,42.46
3739,42.68
3740,42.78
3741,42.86
3742,43.1
3743,43.06
3744,43.13
3745,43.13
3746,43.19
3747,43.53
3748,43.59
3749,43.06
3750,42.6
3751,42.88
3752,42.86
3753,43.04
3754,42.9
3755,42.92
3756,43.02
3757,43.0
3758,43.21
3759,43.27
3760,43.35
3761,43.45
3762,43.69
3763,43.8
3764,43.43
3765,43.02
3766,42.72
3767,42.48
3768,42.42
3769,42.88
3770,43.12
3771,43.31
3772,43.51
3773,43.57
3774,43.75
3775,43.73
3776,43.76
3777,43.9
3778,43.82
3779,43.82
3780,43.71
3781,43.49
3782,43.45
3783,43.47
3784,43.47
3785,43.61
3786,43.73
3787,43.73
3788,43.75
3789,43.82
3790,43.76
3791,43.71
3792,43.63
3793,43.59
3794,43.57
3795,43.31
3796,43.31
3797,43.23
3798,43.21
3799,43.25
3800,43.29
3801,43.12
3802,43.06
3803,43.06
3804,42.9
3805,42.86
3806,42.86
3807,43.0
3808,43.0
3809,43.1
3810,43.12
3811,43.12
3812,43.06
3813,43.04
3814,43.0
3815,42.9
3816,42.9
3817,42.84
3818,43.06
3819,42.96
3820,42.96
3821,43.08
3822,43.1
3823,43.12
3824,43.1
3825,43.17
3826,43.15
3827,43.06
3828,43.17
3829,42.96
3830,43.06
3831,43.12
3832,42.9
3833,43.12
3834,43.12
3835,43.17
3836,43.17
3837,43.21
3838,43.19
3839,43.15
3840,43.13
3841,42.98
3842,43.08
3843,43.06
3844,43.04
3845,43.04
3846,43.1
3847,43.12
3848,43.13
3849,43.08
3850,43.1
3851,43.06
3852,42.92
3853,43.02
3854,43.02
3855,43.0
3856,43.08
3857,43.0
3858,43.15
3859,43.15
3860,43.17
3861,43.25
3862,43.29
3863,43.25
3864,43.25
3865,43.21
3866,43.21
3867,43.27
3868,43.39
3869,43.39
3870,43.25
3871,43.25
3872,43.21
3873,43.13
3874,43.13
3875,42.96
3876,42.76
3877,42.76
3878,42.66
3879,42.56
3880,42.6
3881,42.74
3882,42.86
3883,42.88
3884,43.04
3885,42.96
3886,43.17
3887,43.27
3888,43.49
3889,43.69
3890,43.53
3891,42.54
3892,42.82
3893,42.98
3894,43.06
3895,42.86
3896,42.8
3897,43.0
3898,43.17
3899,43.15
3900,43.19
3901,43.12
3902,43.37
3903,43.61
3904,43.78
3905,43.13
3906,42.72
3907,42.58
3908,42.34
3909,42.56
3910,43.0
3911,43.23
3912,43.49
3913,43.61
3914,43.59
3915,43.65
3916,43.73
3917,43.71
3918,43.78
3919,43.69
3920,43.65
3921,43.55
3922,43.47
3923,43.45
3924,43.41
3925,43.49
3926,43.57
3927,43.73
3928,43.75
3929,43.76
3930,43.84
3931,43.78
3932,43.78
3933,43.76
3934,43.73
3935,43.61
3936,43.37
3937,43.29
3938,43.19
3939,43.17
3940,43.17
3941,43.13
3942,43.12
3943,43.02
3944,43.0
3945,43.02
3946,42.8
3947,42.86
3948,42.86
3949,43.04
3950,42.94
3951,43.06
3952,43.04
3953,43.02
3954,42.94
3955,42.9
3956,42.86
3957,42.96
3958,42.8
3959,42.96
3960,42.86
3961,42.92
3962,43.06
3963,43.06
3964,43.17
3965,43.13
3966,43.17
3967,43.13
3968,43.1
3969,43.12
3970,43.06
3971,43.15
3972,43.06
3973,42.94
3974,42.88
3975,43.17
3976,43.19
3977,43.29
3978,43.19
3979,43.17
3980,43.17
3981,43.1
3982,43.06
3983,43.1
3984,43.08
3985,43.06
3986,43.12
3987,43.21
3988,43.15
3989,43.15
3990,43.12
3991,43.08
3992,43.02
3993,42.9
3994,43.02
3995,43.0
3996,42.98
3997,43.13
3998,43.17
3999,43.19
4000,43.19
4001,43.25
4002,43.23
4003,43.31
4004,43.27
4005,43.25
4006,43.21
4007,43.27
4008,43.33
4009,43.41
4010,43.37
4011,43.37
4012,43.41
4013,43.21
4014,43.23
4015,43.0
4016,42.88
4017,42.88
4018,42.88
4019,42.76
4020,42.5
4021,42.56
4022,42.72
4023,42.74
4024,42.96
4025,43.08
4026,43.13
4027,43.21
4028,43.37
4029,43.73
4030,43.86
4031,43.98
4032,42.72
4033,42.92
4034,43.0
4035,43.17
4036,42.9
4037,42.92
4038,42.98
4039,43.13
4040,43.23
4041,43.39
4042,43.31
4043,43.41
4044,43.55
4045,43.59
4046,43.21
4047,42.72
4048,42.54
4049,42.28
4050,42.56
4051,43.08
4052,43.12
4053,43.47
4054,43.65
4055,43.63
4056,43.75
4057,43.63
4058,43.86
4059,43.71
4060,43.69
4061,43.63
4062,43.55
4063,43.45
4064,43.45
4065,43.45
4066,43.45
4067,43.51
4068,43.73
4069,43.75
4070,43.84
4071,43.84
4072,43.8
4073,43.78
4074,43.71
4075,43.71
4076,43.63
4077,43.41
4078,43.27
4079,43.21
4080,43.21
4081,43.27
4082,43.15
4083,43.08
4084,43.0
4085,42.98
4086,42.98
4087,42.94
4088,42.94
4089,43.0
4090,43.08
4091,43.1
4092,43.25
4093,43.06
4094,43.06
4095,42.98
4096,43.06
4097,42.96
4098,42.98
4099,42.98
4100,43.0
4101,43.04
4102,43.02
4103,43.06
4104,43.15
4105,43.15
4106,43.19
4107,43.21
4108,43.17
4109,43.12
4110,43.1
4111,43.1
4112,43.13
4113,43.08
4114,43.12
4115,43.17
4116,43.21
4117,43.19
4118,43.19
4119,43.23
4120,43.23
4121,43.43
4122,43.15
4123,42.94
4124,43.06
4125,43.1
4126,43.1
4127,43.19
4128,43.27
4129,43.25
4130,43.12
4131,43.12
4132,43.12
4133,43.04
4134,43.08
4135,43.15
4136,43.02
4137,43.06
4138,43.13
4139,43.23
4140,43.15
4141,43.29
4142,43.19
4143,43.19
4144,43.31
4145,43.43
4146,43.31
4147,43.23
4148,43.27
4149,43.29
4150,43.49
4151,43.47
4152,43.31
4153,43.27
4154,43.25
4155,43.15
4156,43.12
4157,43.12
4158,43.0
4159,42.84
4160,42.68
4161,42.66
4162,42.76
4163,42.72
4164,42.78
4165,43.04
4166,43.12
4167,43.27
4168,43.23
4169,43.37
4170,43.76
4171,43.86
4172,43.35
4173,42.42
4174,42.82
4175,43.13
4176,43.49
4177,42.82
4178,42.88
4179,43.04
4180,43.08
4181,43.21
4182,43.45
4183,43.37
4184,43.47
4185,43.51
4186,43.53
4187,43.12
4188,42.62
4189,42.56
4190,42.38
4191,42.28
4192,42.78
4193,42.96
4194,43.13
4195,43.37
4196,43.65
4197,43.69
4198,43.67
4199,43.67
4200,43.63
4201,43.65
4202,43.51
4203,43.39
4204,43.51
4205,43.37
4206,43.41
4207,43.37
4208,43.45
4209,43.63
4210,43.67
4211,43.71
4212,43.84
4213,43.88
4214,43.73
4215,43.69
4216,43.73
4217,43.59
4218,43.65
4219,43.41
4220,43.27
4221,43.13
4222,43.17
4223,43.23
4224,43.17
4225,43.1
4226,42.88
4227,42.96
4228,42.94
4229,42.9
4230,42.96
4231,42.86
4232,43.06
4233,43.13
4234,43.1
4235,43.08
4236,43.06
4237,42.98
4238,43.0
4239,42.96
4240,42.98
4241,42.96
4242,43.02
4243,42.96
4244,43.04
4245,42.9
4246,43.02
4247,43.13
4248,43.02
4249,43.19
4250,43.21
4251,43.12
4252,43.13
4253,43.02
4254,43.08
4255,43.15
4256,43.15
4257,43.1
4258,43.13
4259,43.13
4260,43.13
4261,43.21
4262,43.21
4263,43.25
4264,43.12
4265,43.13
4266,43.19
4267,43.1
4268,43.13
4269,43.13
4270,43.27
4271,43.15
4272,43.13
4273,43.06
4274,43.12
4275,43.08
4276,43.0
4277,43.0
4278,43.04
4279,42.86
4280,43.04
4281,43.19
4282,43.15
4283,43.21
4284,43.25
4285,43.27
4286,43.41
4287,43.49
4288,43.33
4289,43.23
4290,43.25
4291,43.37
4292,43.39
4293,43.33
4294,43.29
4295,43.27
4296,43.19
4297,43.17
4298,43.15
4299,43.04
4300,42.94
4301,42.84
4302,42.66
4303,42.74
4304,42.78
4305,42.76
4306,42.7
4307,43.08
4308,43.31
4309,43.29
4310,43.17
4311,43.35
4312,43.59
4313,43.43
4314,43.13
4315,42.52
4316,42.76
4317,43.13
4318,43.23
4319,42.86
4320,42.96
4321,43.1
4322,43.08
4323,43.15
4324,43.25
4325,43.35
4326,43.43
4327,43.35
4328,43.39
4329,42.86
4330,42.56
4331,42.5
4332,42.36
4333,42.8
4334,43.06
4335,43.39
4336,43.45
4337,43.63
4338,43.63
4339,43.69
4340,43.65
4341,43.63
4342,43.61
4343,43.47
4344,43.37
4345,43.31
4346,43.25
4347,43.17
4348,43.17
4349,43.29
4350,43.43
4351,43.55
4352,43.67
4353,43.73
4354,43.86
4355,43.84
4356,43.82
4357,43.71
4358,43.53
4359,43.59
4360,43.35
4361,43.29
4362,43.13
4363,43.17
4364,43.19
4365,43.17
4366,43.17
4367,43.08
4368,43.08
4369,42.94
4370,43.02
4371,43.02
4372,43.12
4373,43.04
4374,43.13
4375,43.17
4376,43.13
4377,43.27
4378,42.94
4379,42.92
4380,42.92
4381,42.96
4382,42.98
4383,42.96
4384,42.94
4385,42.92
4386,42.96
4387,42.98
4388,43.06
4389,43.08
4390,43.19
4391,43.31
4392,43.15
4393,43.19
4394,43.06
4395,43.12
4396,43.17
4397,43.17
4398,43.15
4399,43.13
4400,43.15
4401,43.17
4402,43.19
4403,43.17
4404,43.25
4405,43.23
4406,43.1
4407,43.06
4408,43.1
4409,43.1
4410,43.15
4411,43.17
4412,43.15
4413,43.02
4414,43.06
4415,43.08
4416,43.06
4417,42.98
4418,42.96
4419,42.92
4420,43.0
4421,43.08
4422,43.12
4423,43.1
4424,43.23
4425,43.31
4426,43.33
4427,43.29
4428,43.29
4429,43.25
4430,43.19
4431,43.25
4432,43.31
4433,43.33
4434,43.37
4435,43.33
4436,43.27
4437,43.19
4438,43.15
4439,43.13
4440,43.1
4441,42.98
4442,43.04
4443,42.84
4444,42.64
4445,43.0
4446,43.08
4447,43.02
4448,43.25
4449,43.33
4450,43.35
4451,43.35
4452,43.51
4453,43.45
4454,43.35
4455,42.9
4456,42.32
4457,42.7
4458,42.88
4459,43.04
4460,42.8
4461,42.82
4462,42.94
4463,43.06
4464,43.06
4465,43.17
4466,43.21
4467,43.21
4468,43.27
4469,43.23
4470,42.28
4471,42.54
4472,42.42
4473,42.3
4474,42.74
4475,43.08
4476,43.29
4477,43.53
4478,43.71
4479,43.65
4480,43.84
4481,43.67
4482,43.69
4483,43.49
4484,43.45
4485,43.08
4486,43.12
4487,43.15
4488,43.15
4489,43.23
4490,43.15
4491,43.51
4492,43.63
4493,43.65
4494,43.65
4495,43.75
4496,43.82
4497,43.69
4498,43.67
4499,43.59
4500,43.51
4501,43.29
4502,43.23
4503,43.21
4504,43.13
4505,43.25
4506,43.17
4507,43.1
4508,43.12
4509,43.06
4510,43.08
4511,42.9
4512,42.98
4513,43.1
4514,43.1
4515,43.19
4516,43.27
4517,43.15
4518,43.1
4519,43.12
4520,42.8
4521,42.94
4522,42.82
4523,42.86
4524,42.98
4525,42.98
4526,42.94
4527,42.88
4528,43.02
4529,43.12
4530,43.06
4531,43.13
4532,43.12
4533,43.0
4534,43.02
4535,43.12
4536,43.17
4537,43.23
4538,43.15
4539,43.15
4540,43.15
4541,43.17
4542,42.96
4543,43.19
4544,43.15
4545,43.17
4546,43.12
4547,43.04
4548,43.04
4549,43.1
4550,43.1
4551,43.17
4552,43.1
4553,43.1
4554,43.04
4555,43.02
4556,43.04
4557,43.04
4558,42.92
4559,42.8
4560,42.94
4561,42.92
4562,43.0
4563,43.15
4564,43.19
4565,43.17
4566,43.33
4567,43.31
4568,43.33
4569,43.33
4570,43.17
4571,43.15
4572,43.25
4573,43.31
4574,43.31
4575,43.41
4576,43.33
4577,43.27
4578,43.27
4579,43.13
4580,43.13
4581,43.04
4582,42.84
4583,42.8
4584,42.8
4585,42.78
4586,43.1
4587,43.25
4588,43.35
4589,43.37
4590,43.39
4591,43.45
4592,43.45
4593,43.59
4594,43.53
4595,43.31
4596,42.78
4597,42.26
4598,42.44
4599,42.92
4600,42.88
4601,42.74
4602,42.76
4603,42.96
4604,42.94
4605,43.04
4606,43.17
4607,43.1
4608,43.25
4609,43.17
4610,42.92
4611,42.62
4612,42.28
4613,42.38
4614,42.72
4615,43.04
4616,43.06
4617,43.39
4618,43.59
4619,43.59
4620,43.75
4621,43.73
4622,43.59
4623,43.39
4624,43.17
4625,43.15
4626,43.13
4627,43.1
4628,43.15
4629,43.19
4630,43.25
4631,43.53
4632,43.59
4633,43.61
4634,43.65
4635,43.65
4636,43.63
4637,43.63
4638,43.59
4639,43.61
4640,43.47
4641,43.31
4642,43.29
4643,43.13
4644,43.21
4645,43.23
4646,43.17
4647,42.92
4648,43.08
4649,43.1
4650,43.04
4651,42.98
4652,43.04
4653,43.02
4654,43.08
4655,43.15
4656,43.13
4657,43.19
4658,43.08
4659,43.19
4660,42.98
4661,43.02
4662,42.8
4663,42.84
4664,43.02
4665,42.98
4666,42.86
4667,42.9
4668,42.88
4669,42.98
4670,43.02
4671,43.1
4672,43.1
4673,43.08
4674,42.96
4675,42.92
4676,43.1
4677,43.27
4678,43.19
4679,43.15
4680,43.17
4681,43.17
4682,43.19
4683,43.19
4684,43.1
4685,43.1
4686,43.04
4687,43.0
4688,43.02
4689,43.04
4690,43.12
4691,43.06
4692,43.06
4693,43.12
4694,43.17
4695,43.06
4696,43.04
4697,42.88
4698,42.84
4699,42.94
4700,43.02
4701,43.06
4702,43.12
4703,43.19
4704,43.29
4705,43.25
4706,43.41
4707,43.21
4708,43.27
4709,43.37
4710,43.27
4711,43.25
4712,43.19
4713,43.15
4714,43.27
4715,43.33
4716,43.39
4717,43.29
4718,43.21
4719,43.17
4720,43.1
4721,43.02
4722,42.98
4723,42.8
4724,42.86
4725,42.84
4726,43.08
4727,43.37
4728,43.43
4729,43.39
4730,43.43
4731,43.47
4732,43.53
4733,43.57
4734,43.53
4735,43.25
4736,42.68
4737,42.48
4738,42.88
4739,43.1
4740,42.7
4741,42.82
4742,42.88
4743,42.96
4744,42.94
4745,43.12
4746,43.12
4747,43.21
4748,43.15
4749,42.92
4750,42.54
4751,42.28
4752,42.36
4753,42.68
4754,42.94
4755,43.02
4756,43.21
4757,43.41
4758,43.51
4759,43.51
4760,43.59
4761,43.43
4762,43.31
4763,43.13
4764,43.02
4765,42.98
4766,43.04
4767,43.0
4768,43.12
4769,43.25
4770,43.41
4771,43.59
4772,43.71
4773,43.61
4774,43.61
4775,43.55
4776,43.59
4777,43.37
4778,43.43
4779,43.41
4780,43.13
4781,43.15
4782,43.21
4783,43.21
4784,43.23
4785,43.15
4786,43.1
4787,43.1
4788,43.15
4789,42.98
4790,43.1
4791,43.06
4792,43.02
4793,43.12
4794,43.25
4795,43.17
4796,43.13
4797,43.02
4798,43.06
4799,42.98
4800,42.96
4801,42.92
4802,42.78
4803,42.94
4804,42.84
4805,42.94
4806,42.9
4807,43.0
4808,43.02
4809,43.04
4810,43.06
4811,43.12
4812,43.13
4813,43.04
4814,43.06
4815,43.12
4816,43.13
4817,43.04
4818,43.19
4819,43.21
4820,43.23
4821,43.19
4822,43.15
4823,43.08
4824,43.08
4825,42.98
4826,42.88
4827,43.06
4828,43.12
4829,43.08
4830,43.04
4831,43.1
4832,43.17
4833,43.15
4834,43.15
4835,43.13
4836,43.1
4837,43.02
4838,43.06
4839,43.02
4840,43.15
4841,43.29
4842,43.31
4843,43.39
4844,43.35
4845,43.29
4846,43.17
4847,43.35
4848,43.27
4849,43.21
4850,43.21
4851,43.23
4852,43.15
4853,43.27
4854,43.29
4855,43.29
4856,43.25
4857,43.19
4858,43.25
4859,43.1
4860,42.92
4861,42.84
4862,42.74
4863,42.8
4864,42.82
4865,42.96
4866,43.02
4867,43.08
4868,43.33
4869,43.31
4870,43.39
4871,43.37
4872,43.37
4873,43.31
4874,43.35
4875,42.94
4876,42.46
4877,42.88
4878,42.94
4879,42.8
4880,42.86
4881,43.0
4882,43.08
4883,43.08
4884,43.17
4885,43.23
4886,43.19
4887,43.1
4888,42.78
4889,42.5
4890,42.44
4891,42.76
4892,42.9
4893,43.08
4894,43.17
4895,43.35
4896,43.35
4897,43.37
4898,43.41
4899,43.13
4900,43.23
4901,43.1
4902,43.02
4903,42.98
4904,43.12
4905,43.13
4906,43.13
4907,43.21
4908,43.41
4909,43.45
4910,43.59
4911,43.47
4912,43.51
4913,43.53
4914,43.57
4915,43.43
4916,43.41
4917,43.31
4918,43.15
4919,43.06
4920,43.27
4921,43.25
4922,43.27
4923,43.23
4924,43.19
4925,43.1
4926,43.25
4927,43.15
4928,43.17
4929,43.12
4930,43.06
4931,43.13
4932,43.21
4933,43.23
4934,43.1
4935,43.12
4936,43.0
4937,43.02
4938,42.94
4939,42.86
4940,42.82
4941,42.9
4942,42.92
4943,42.96
4944,43.0
4945,43.0
4946,43.04
4947,43.04
4948,43.1
4949,43.08
4950,43.08
4951,43.13
4952,43.1
4953,43.27
4954,43.23
4955,43.23
4956,43.17
4957,43.21
4958,43.21
4959,43.27
4960,43.21
4961,43.1
4962,43.08
4963,42.96
4964,42.96
4965,43.04
4966,43.08
4967,43.04
4968,43.08
4969,43.13
4970,43.19
4971,43.23
4972,43.17
4973,43.23
4974,43.12
4975,43.13
4976,43.12
4977,43.17
4978,43.15
4979,43.31
4980,43.35
4981,43.35
4982,43.41
4983,43.45
4984,43.33
4985,43.35
4986,43.31
4987,43.31
4988,43.17
4989,43.21
4990,43.29
4991,43.33
4992,43.33
4993,43.27
4994,43.33
4995,43.29
4996,43.25
4997,43.17
4998,43.02
4999,42.9
5000,42.88
5001,42.82
5002,42.88
5003,43.08
5004,43.25
5005,43.21
5006,43.27
5007,43.29
5008,43.29
5009,43.33
5010,43.41
5011,43.47
5012,43.35
5013,42.96
5014,42.34
5015,42.88
5016,42.94
5017,42.8
5018,42.86
5019,43.02
5020,43.17
5021,43.12
5022,43.23
5023,43.04
5024,43.29
5025,42.9
5026,42.48
5027,42.32
5028,42.66
5029,42.42
5030,42.78
5031,42.92
5032,43.0
5033,43.08
5034,43.23
5035,43.17
5036,43.15
5037,43.13
5038,43.04
5039,43.12
5040,43.23
5041,43.23
5042,43.1
5043,43.12
5044,43.15
5045,43.0
5046,43.23
5047,43.33
5048,43.51
5049,43.55
5050,43.51
5051,43.51
5052,43.43
5053,43.43
5054,43.35
5055,43.29
5056,43.19
5057,43.31
5058,43.19
5059,43.27
5060,43.37
5061,43.27
5062,43.25
5063,43.19
5064,43.21
5065,43.29
5066,43.41
5067,43.29
5068,43.15
5069,43.08
5070,43.1
5071,43.13
5072,43.23
5073,43.12
5074,43.1
5075,43.06
5076,43.04
5077,42.84
5078,42.82
5079,42.9
5080,42.9
5081,42.96
5082,43.0
5083,43.08
5084,43.08
5085,43.06
5086,43.15
5087,43.13
5088,43.13
5089,43.1
5090,43.12
5091,43.15
5092,43.17
5093,43.25
5094,43.21
5095,43.21
5096,43.21
5097,43.21
5098,43.08
5099,43.21
5100,43.1
5101,43.0
5102,43.04
5103,42.94
5104,43.06
5105,43.08
5106,43.15
5107,43.06
5108,43.15
5109,43.19
5110,43.13
5111,43.33
5112,43.37
5113,43.23
5114,43.17
5115,43.23
5116,43.17
5117,43.21
5118,43.27
5119,43.31
5120,43.29
5121,43.39
5122,43.37
5123,43.29
5124,43.39
5125,43.35
5126,43.35
5127,43.27
5128,43.25
5129,43.21
5130,43.35
5131,43.35
5132,43.33
5133,43.31
5134,43.35
5135,43.33
5136,43.23
5137,43.19
5138,42.94
5139,42.96
5140,42.86
5141,42.88
5142,43.0
5143,43.06
5144,43.15
5145,43.29
5146,43.33
5147,43.33
5148,43.33
5149,43.33
5150,43.43
5151,43.23
5152,42.82
5153,42.28
5154,42.38
5155,42.84
5156,42.94
5157,42.84
5158,42.84
5159,42.98
5160,42.98
5161,43.04
5162,43.17
5163,43.12
5164,43.04
5165,42.88
5166,42.28
5167,42.34
5168,42.5
5169,42.52
5170,42.88
5171,42.88
5172,42.96
5173,43.04
5174,43.13
5175,43.12
5176,43.04
5177,43.08
5178,43.19
5179,43.13
5180,43.15
5181,43.25
5182,43.33
5183,43.15
5184,43.15
5185,43.17
5186,43.19
5187,43.45
5188,43.45
5189,43.55
5190,43.49
5191,43.51
5192,43.43
5193,43.59
5194,43.35
5195,43.31
5196,43.33
5197,43.29
5198,43.37
5199,43.33
5200,43.39
5201,43.41
5202,43.31
5203,43.27
5204,43.31
5205,43.33
5206,43.41
5207,43.29
5208,43.21
5209,43.13
5210,43.13
5211,43.15
5212,43.13
5213,43.12
5214,43.06
5215,42.98
5216,42.92
5217,42.88
5218,42.78
5219,42.82
5220,42.94
5221,42.94
5222,42.96
5223,43.12
5224,43.12
5225,43.23
5226,43.13
5227,43.15
5228,43.13
5229,43.13
5230,43.06
5231,43.12
5232,43.21
5233,43.37
5234,43.31
5235,43.27
5236,43.21
5237,43.17
5238,43.15
5239,43.19
5240,43.06
5241,43.04
5242,43.08
5243,43.12
5244,43.15
5245,43.15
5246,43.19
5247,43.17
5248,43.23
5249,43.47
5250,43.31
5251,43.37
5252,43.39
5253,43.27
5254,43.29
5255,43.21
5256,43.19
5257,43.23
5258,43.27
5259,43.25
5260,43.31
5261,43.35
5262,43.37
5263,43.31
5264,43.33
5265,43.35
5266,43.35
5267,43.29
5268,43.31
5269,43.33
5270,43.35
5271,43.37
5272,43.51
5273,43.45
5274,43.39
5275,43.21
5276,43.12
5277,43.06
5278,43.04
5279,42.96
5280,42.98
5281,42.86
5282,42.92
5283,43.02
5284,43.13
5285,43.33
5286,43.35
5287,43.31
5288,43.37
5289,43.43
5290,43.51
5291,43.37
5292,42.84
5293,42.28
5294,42.62
5295,42.76
5296,43.12
5297,42.78
5298,42.88
5299,42.96
5300,43.02
5301,43.06
5302,43.02
5303,43.06
5304,43.1
5305,42.7
5306,42.36
5307,42.34
5308,42.64
5309,42.82
5310,42.8
5311,42.92
5312,42.98
5313,43.04
5314,43.02
5315,43.08
5316,43.1
5317,43.06
5318,43.25
5319,43.1
5320,43.06
5321,43.0
5322,43.06
5323,43.15
5324,43.17
5325,43.17
5326,43.35
5327,43.41
5328,43.47
5329,43.49
5330,43.49
5331,43.41
5332,43.53
5333,43.35
5334,43.27
5335,43.25
5336,43.29
5337,43.35
5338,43.35
5339,43.31
5340,43.49
5341,43.33
5342,43.33
5343,43.27
5344,43.25
5345,43.29
5346,43.19
5347,43.15
5348,43.06
5349,43.02
5350,43.13
5351,43.23
5352,43.02
5353,43.02
5354,42.94
5355,42.94
5356,42.88
5357,42.84
5358,42.86
5359,42.84
5360,42.98
5361,42.98
5362,43.12
5363,43.13
5364,43.12
5365,43.21
5366,43.12
5367,43.06
5368,43.04
5369,42.9
5370,43.1
5371,43.19
5372,43.33
5373,43.17
5374,43.23
5375,43.13
5376,43.06
5377,43.12
5378,43.13
5379,43.06
5380,43.08
5381,43.06
5382,43.1
5383,43.15
5384,43.17
5385,43.13
5386,43.21
5387,43.45
5388,43.39
5389,43.33
5390,43.29
5391,43.35
5392,43.35
5393,43.23
5394,43.17
5395,43.19
5396,43.12
5397,43.19
5398,43.25
5399,43.29
5400,43.39
5401,43.37
5402,43.33
5403,43.31
5404,43.37
5405,43.33
5406,43.31
5407,43.33
5408,43.35
5409,43.37
5410,43.33
5411,43.41
5412,43.37
5413,43.25
5414,43.21
5415,43.02
5416,42.94
5417,43.02
5418,42.82
5419,42.86
5420,42.62
5421,42.74
5422,42.98
5423,43.0
5424,43.17
5425,43.27
5426,43.35
5427,43.27
5428,43.37
5429,43.47
5430,43.39
5431,42.88
5432,42.48
5433,42.42
5434,42.82
5435,42.94
5436,43.06
5437,42.68
5438,42.8
5439,43.04
5440,43.12
5441,43.1
5442,43.08
5443,42.92
5444,42.88
5445,42.58
5446,42.46
5447,42.78
5448,42.78
5449,42.96
5450,42.98
5451,43.02
5452,43.06
5453,43.02
5454,42.98
5455,43.02
5456,43.15
5457,43.21
5458,43.12
5459,43.04
5460,42.92
5461,43.02
5462,43.13
5463,43.13
5464,43.29
5465,43.31
5466,43.37
5467,43.45
5468,43.53
5469,43.51
5470,43.37
5471,43.69
5472,43.35
5473,43.31
5474,43.31
5475,43.39
5476,43.43
5477,43.47
5478,43.41
5479,43.45
5480,43.43
5481,43.27
5482,43.33
5483,43.17
5484,43.19
5485,43.19
5486,43.27
5487,43.06
5488,43.08
5489,43.12
5490,43.21
5491,43.12
5492,43.08
5493,42.94
5494,42.9
5495,42.82
5496,42.86
5497,42.86
5498,42.88
5499,43.04
5500,43.02
5501,43.08
5502,43.15
5503,43.17
5504,43.13
5505,43.37
5506,43.12
5507,43.08
5508,43.04
5509,43.1
5510,43.23
5511,43.27
5512,43.17
5513,43.15
5514,43.12
5515,43.1
5516,43.1
5517,43.17
5518,43.13
5519,43.06
5520,43.06
5521,43.13
5522,43.23
5523,43.19
5524,43.19
5525,43.23
5526,43.33
5527,43.37
5528,43.37
5529,43.29
5530,43.31
5531,43.21
5532,43.17
5533,43.15
5534,43.19
5535,43.19
5536,43.15
5537,43.25
5538,43.29
5539,43.43
5540,43.35
5541,43.35
5542,43.35
5543,43.37
5544,43.37
5545,43.25
5546,43.27
5547,43.29
5548,43.37
5549,43.37
5550,43.33
5551,43.45
5552,43.31
5553,43.19
5554,43.13
5555,42.94
5556,42.82
5557,42.76
5558,42.7
5559,42.7
5560,42.78
5561,42.94
5562,43.06
5563,43.23
5564,43.29
5565,43.39
5566,43.29
5567,43.35
5568,43.45
5569,43.35
5570,42.96
5571,42.78
5572,42.7
5573,43.02
5574,42.64
5575,42.82
5576,42.92
5577,43.04
5578,43.08
5579,42.96
5580,42.88
5581,42.74
5582,42.48
5583,42.34
5584,42.56
5585,42.64
5586,42.8
5587,42.82
5588,42.96
5589,42.96
5590,43.0
5591,43.0
5592,42.86
5593,43.06
5594,42.9
5595,42.96
5596,42.9
5597,42.88
5598,42.96
5599,42.98
5600,43.08
5601,43.17
5602,43.33
5603,43.33
5604,43.37
5605,43.43
5606,43.39
5607,43.27
5608,43.33
5609,43.25
5610,43.27
5611,43.27
5612,43.33
5613,43.35
5614,43.39
5615,43.45
5616,43.47
5617,43.31
5618,43.19
5619,43.15
5620,43.06
5621,43.0
5622,43.15
5623,43.12
5624,43.04
5625,43.06
5626,43.08
5627,43.08
5628,42.98
5629,43.02
5630,42.9
5631,42.84
5632,42.7
5633,42.82
5634,42.8
5635,42.94
5636,42.92
5637,42.98
5638,42.96
5639,43.02
5640,43.1
5641,43.12
5642,43.1
5643,43.06
5644,43.12
5645,43.08
5646,43.08
5647,43.17
5648,43.23
5649,43.15
5650,43.17
5651,43.15
5652,43.08
5653,43.1
5654,43.15
5655,43.13
5656,43.06
5657,42.92
5658,43.08
5659,43.08
5660,43.15
5661,43.15
5662,43.25
5663,43.23
5664,43.29
5665,43.12
5666,43.25
5667,43.25
5668,43.13
5669,43.12
5670,43.08
5671,43.13
5672,43.15
5673,43.27
5674,43.33
5675,43.17
5676,43.35
5677,43.35
5678,43.33
5679,43.29
5680,43.37
5681,43.37
5682,43.21
5683,43.27
5684,43.29
5685,43.37
5686,43.51
5687,43.33
5688,43.33
5689,43.23
5690,43.08
5691,43.02
5692,42.94
5693,42.76
5694,42.72
5695,42.6
5696,42.74
5697,42.78
5698,42.96
5699,42.96
5700,43.15
5701,43.15
5702,43.31
5703,43.29
5704,43.35
5705,43.45
5706,43.19
5707,42.72
5708,42.28
5709,42.6
5710,42.82
5711,42.98
5712,42.62
5713,42.74
5714,42.82
5715,43.0
5716,43.02
5717,42.98
5718,42.84
5719,42.5
5720,42.56
5721,42.54
5722,42.74
5723,42.68
5724,42.94
5725,43.0
5726,42.9
5727,43.02
5728,43.0
5729,42.98
5730,42.9
5731,42.86
5732,42.78
5733,42.88
5734,42.88
5735,42.78
5736,43.04
5737,43.19
5738,43.27
5739,43.43
5740,43.25
5741,43.33
5742,43.37
5743,43.21
5744,43.12
5745,43.23
5746,43.27
5747,43.41
5748,43.21
5749,43.31
5750,43.33
5751,43.39
5752,43.33
5753,43.23
5754,43.12
5755,43.0
5756,43.0
5757,42.96
5758,42.98
5759,43.0
5760,43.04
5761,43.0
5762,43.0
5763,43.02
5764,43.02
5765,43.02
5766,42.9
5767,42.72
5768,42.7
5769,42.72
5770,42.76
5771,43.0
5772,42.88
5773,43.0
5774,43.0
5775,42.96
5776,43.1
5777,43.13
5778,43.19
5779,43.12
5780,42.98
5781,43.0
5782,43.08
5783,43.17
5784,43.27
5785,43.23
5786,43.19
5787,43.12
5788,43.13
5789,43.1
5790,43.1
5791,43.02
5792,43.02
5793,42.84
5794,42.92
5795,43.08
5796,43.06
5797,43.13
5798,43.15
5799,43.15
5800,43.21
5801,43.08
5802,43.23
5803,43.19
5804,43.15
5805,43.0
5806,43.02
5807,43.19
5808,43.12
5809,43.31
5810,43.17
5811,43.25
5812,43.45
5813,43.37
5814,43.29
5815,43.33
5816,43.43
5817,43.23
5818,43.15
5819,43.25
5820,43.37
5821,43.39
5822,43.39
5823,43.33
5824,43.23
5825,43.21
5826,43.0
5827,42.98
5828,42.96
5829,42.74
5830,42.64
5831,42.46
5832,42.4
5833,42.62
5834,42.9
5835,42.88
5836,43.02
5837,43.1
5838,43.15
5839,43.23
5840,43.25
5841,43.29
5842,43.15
5843,42.62
5844,42.62
5845,43.06
5846,42.64
5847,42.78
5848,42.82
5849,43.0
5850,42.98
5851,42.96
5852,42.68
5853,42.52
5854,42.3
5855,42.26
5856,42.48
5857,42.62
5858,42.74
5859,42.76
5860,42.92
5861,43.0
5862,42.94
5863,42.92
5864,42.94
5865,42.94
5866,42.84
5867,42.9
5868,42.88
5869,42.84
5870,42.88
5871,43.0
5872,43.02
5873,43.12
5874,43.21
5875,43.17
5876,43.27
5877,43.35
5878,43.35
5879,43.17
5880,43.17
5881,43.15
5882,43.23
5883,43.25
5884,43.19
5885,43.25
5886,43.43
5887,43.29
5888,43.25
5889,43.13
5890,43.02
5891,42.96
5892,43.0
5893,42.98
5894,42.9
5895,43.04
5896,42.94
5897,42.9
5898,43.06
5899,43.15
5900,43.06
5901,43.02
5902,42.82
5903,42.8
5904,42.72
5905,42.78
5906,42.82
5907,42.98
5908,43.0
5909,42.94
5910,43.02
5911,43.06
5912,43.1
5913,43.1
5914,43.13
5915,43.08
5916,42.88
5917,43.04
5918,43.02
5919,43.06
5920,43.06
5921,43.08
5922,43.12
5923,43.17
5924,43.1
5925,43.13
5926,43.15
5927,43.12
5928,43.0
5929,43.15
5930,43.04
5931,43.06
5932,43.02
5933,43.08
5934,43.15
5935,43.17
5936,43.27
5937,43.23
5938,43.27
5939,43.17
5940,43.15
5941,43.15
5942,43.12
5943,43.25
5944,43.27
5945,43.15
5946,43.33
5947,43.31
5948,43.35
5949,43.35
5950,43.29
5951,43.37
5952,43.41
5953,43.31
5954,43.21
5955,43.31
5956,43.33
5957,43.35
5958,43.37
5959,43.39
5960,43.39
5961,43.17
5962,43.12
5963,43.02
5964,42.84
5965,42.74
5966,42.58
5967,42.52
5968,42.46
5969,42.76
5970,42.86
5971,42.78
5972,43.0
5973,43.04
5974,43.17
5975,43.1
5976,43.27
5977,43.23
5978,43.15
5979,42.72
5980,42.3
5981,42.6
5982,42.76
5983,42.68
5984,42.82
5985,42.96
5986,42.94
5987,42.98
5988,42.82
5989,42.84
5990,42.44
5991,42.38
5992,42.4
5993,42.74
5994,42.78
5995,42.78
5996,42.92
5997,42.92
5998,42.98
5999,42.92
6000,42.9
6001,42.9
6002,42.8
6003,42.74
6004,42.84
6005,42.82
6006,42.76
6007,43.12
6008,43.21
6009,43.23
6010,43.23
6011,43.25
6012,43.29
6013,43.27
6014,43.29
6015,43.21
6016,43.19
6017,43.19
6018,43.25
6019,43.25
6020,43.29
6021,43.25
6022,43.29
6023,43.31
6024,43.29
6025,43.12
6026,43.04
6027,42.96
6028,42.98
6029,43.12
6030,42.96
6031,42.98
6032,42.92
6033,43.13
6034,43.13
6035,43.25
6036,42.98
6037,42.96
6038,42.92
6039,42.86
6040,42.76
6041,42.84
6042,42.82
6043,42.88
6044,42.9
6045,42.98
6046,43.04
6047,43.02
6048,43.15
6049,43.1
6050,43.1
6051,43.06
6052,42.98
6053,43.0
6054,43.0
6055,43.06
6056,43.0
6057,43.06
6058,43.08
6059,43.17
6060,43.21
6061,43.27
6062,43.15
6063,43.15
6064,43.13
6065,43.13
6066,43.1
6067,43.08
6068,43.1
6069,43.21
6070,43.17
6071,43.25
6072,43.35
6073,43.25
6074,43.15
6075,43.19
6076,43.17
6077,43.17
6078,43.17
6079,43.23
6080,43.25
6081,43.41
6082,43.39
6083,43.29
6084,43.39
6085,43.37
6086,43.41
6087,43.33
6088,43.39
6089,43.41
6090,43.29
6091,43.33
6092,43.35
6093,43.41
6094,43.45
6095,43.41
6096,43.39
6097,43.31
6098,43.23
6099,43.02
6100,42.76
6101,42.76
6102,42.62
6103,42.56
6104,42.44
6105,42.84
6106,42.94
6107,42.82
6108,43.06
6109,43.13
6110,43.15
6111,43.33
6112,43.33
6113,43.27
6114,43.0
6115,42.66
6116,42.56
6117,42.6
6118,42.44
6119,42.78
6120,42.9
6121,42.92
6122,43.0
6123,42.86
6124,42.7
6125,42.38
6126,42.28
6127,42.46
6128,42.72
6129,42.8
6130,42.78
6131,42.88
6132,42.9
6133,42.92
6134,42.9
6135,42.92
6136,42.82
6137,42.7
6138,42.76
6139,42.76
6140,42.8
6141,42.84
6142,43.04
6143,43.13
6144,43.15
6145,43.29
6146,43.21
6147,43.15
6148,43.23
6149,43.25
6150,43.19
6151,43.21
6152,43.19
6153,43.21
6154,43.25
6155,43.13
6156,43.23
6157,43.27
6158,43.19
6159,43.13
6160,42.92
6161,42.98
6162,42.96
6163,42.88
6164,42.98
6165,43.0
6166,43.04
6167,43.15
6168,43.12
6169,43.1
6170,43.06
6171,43.0
6172,42.88
6173,42.82
6174,42.76
6175,42.88
6176,42.9
6177,42.88
6178,43.06
6179,42.9
6180,43.0
6181,43.08
6182,43.04
6183,43.15
6184,43.0
6185,43.08
6186,43.08
6187,42.98
6188,42.96
6189,43.02
6190,43.08
6191,43.08
6192,43.06
6193,43.12
6194,43.21
6195,43.23
6196,43.23
6197,43.19
6198,43.15
6199,43.06
6200,43.1
6201,43.06
6202,43.08
6203,43.12
6204,43.15
6205,43.23
6206,43.29
6207,43.27
6208,43.25
6209,43.15
6210,43.19
6211,43.17
6212,43.15
6213,43.19
6214,43.19
6215,43.23
6216,43.31
6217,43.35
6218,43.31
6219,43.37
6220,43.37
6221,43.37
6222,43.41
6223,43.31
6224,43.35
6225,43.33
6226,43.33
6227,43.33
6228,43.45
6229,43.49
6230,43.41
6231,43.37
6232,43.27
6233,43.19
6234,43.06
6235,42.9
6236,42.76
6237,42.58
6238,42.54
6239,42.5
6240,42.68
6241,42.78
6242,42.92
6243,43.06
6244,43.12
6245,43.23
6246,43.23
6247,43.33
6248,43.23
6249,43.12
6250,42.46
6251,42.42
6252,42.82
6253,42.54
6254,42.7
6255,42.76
6256,42.9
6257,43.08
6258,42.96
6259,42.54
6260,42.52
6261,42.68
6262,42.8
6263,42.82
6264,42.78
6265,42.82
6266,42.78
6267,42.76
6268,42.78
6269,42.68
6270,42.84
6271,42.78
6272,42.76
6273,42.76
6274,42.82
6275,42.98
6276,43.02
6277,43.15
6278,43.1
6279,43.23
6280,43.12
6281,43.13
6282,43.12
6283,43.12
6284,43.12
6285,43.19
6286,43.19
6287,43.13
6288,43.04
6289,43.21
6290,43.17
6291,43.15
6292,43.0
6293,42.92
6294,42.96
6295,42.96
6296,42.98
6297,42.96
6298,43.04
6299,43.12
6300,43.08
6301,43.1
6302,43.08
6303,42.96
6304,42.88
6305,42.94
6306,42.76
6307,42.8
6308,42.8
6309,42.9
6310,42.92
6311,43.08
6312,43.1
6313,42.94
6314,43.06
6315,42.92
6316,43.08
6317,43.02
6318,42.98
6319,42.98
6320,42.94
6321,43.0
6322,43.06
6323,43.08
6324,43.19
6325,43.08
6326,43.13
6327,43.17
6328,43.23
6329,43.15
6330,43.12
6331,43.13
6332,43.13
6333,43.02
6334,43.08
6335,43.08
6336,43.08
6337,43.19
6338,43.19
6339,43.19
6340,43.23
6341,43.21
6342,43.21
6343,43.19
6344,43.15
6345,43.08
6346,43.06
6347,43.19
6348,43.29
6349,43.37
6350,43.29
6351,43.25
6352,43.31
6353,43.27
6354,43.33
6355,43.45
6356,43.43
6357,43.27
6358,43.23
6359,43.29
6360,43.29
6361,43.39
6362,43.41
6363,43.37
6364,43.35
6365,43.23
6366,43.29
6367,43.17
6368,43.02
6369,42.6
6370,42.56
6371,42.46
6372,42.48
6373,42.7
6374,43.04
6375,42.88
6376,43.08
6377,43.04
6378,43.15
6379,43.13
6380,43.21
6381,43.37
6382,43.06
6383,42.62
6384,42.38
6385,42.6
6386,42.56
6387,42.64
6388,42.64
6389,42.84
6390,42.84
6391,42.94
6392,42.4
6393,42.58
6394,42.66
6395,42.68
6396,42.7
6397,42.84
6398,42.78
6399,42.56
6400,42.62
6401,42.72
6402,42.64
6403,42.58
6404,42.58
6405,42.36
6406,42.54
6407,42.66
6408,42.96
6409,42.88
6410,42.96
6411,43.02
6412,42.92
6413,43.04
6414,42.92
6415,43.06
6416,43.21
6417,43.08
6418,43.02
6419,43.06
6420,43.19
6421,43.06
6422,43.06
6423,43.06
6424,43.08
6425,42.98
6426,43.08
6427,42.92
6428,42.92
6429,42.92
6430,42.88
6431,42.86
6432,42.94
6433,43.02
6434,42.9
6435,42.92
6436,42.9
6437,42.84
6438,42.84
6439,42.82
6440,42.74
6441,42.86
6442,42.74
6443,43.0
6444,43.02
6445,42.88
6446,42.84
6447,42.92
6448,42.94
6449,42.96
6450,42.88
6451,42.86
6452,42.82
6453,42.84
6454,42.86
6455,43.0
6456,43.04
6457,43.19
6458,42.92
6459,43.04
6460,43.0
6461,43.1
6462,43.13
6463,43.12
6464,43.0
6465,43.02
6466,43.0
6467,43.04
6468,43.0
6469,42.94
6470,43.08
6471,43.08
6472,43.17
6473,43.23
6474,43.15
6475,43.15
6476,43.15
6477,43.12
6478,42.94
6479,43.04
6480,43.12
6481,43.27
6482,43.23
6483,43.15
6484,43.12
6485,43.23
6486,43.33
6487,43.17
6488,43.39
6489,43.23
6490,43.27
6491,43.21
6492,43.17
6493,43.1
6494,43.31
6495,43.31
6496,43.37
6497,43.19
6498,43.1
6499,43.12
6500,43.02
6501,42.88
6502,42.6
6503,42.58
6504,42.32
6505,42.38
6506,42.48
6507,42.68
6508,42.82
6509,43.0
6510,42.82
6511,43.06
6512,43.0
6513,43.1
6514,43.23
6515,42.94
6516,42.52
6517,42.3
6518,42.62
6519,42.42
6520,42.6
6521,42.56
6522,42.58
6523,42.52
6524,42.48
6525,42.62
6526,42.72
6527,42.64
6528,42.4
6529,42.56
6530,42.56
6531,42.54
6532,42.5
6533,42.52
6534,42.42
6535,42.36
6536,42.4
6537,42.54
6538,42.52
6539,42.72
6540,42.78
6541,42.86
6542,42.88
6543,42.9
6544,42.84
6545,42.92
6546,42.94
6547,42.98
6548,42.9
6549,42.92
6550,43.13
6551,43.1
6552,43.06
6553,42.98
6554,42.86
6555,43.0
6556,42.92
6557,42.76
6558,42.86
6559,42.82
6560,42.8
6561,42.88
6562,42.8
6563,42.94
6564,42.84
6565,42.82
6566,42.9
6567,42.7
6568,42.68
6569,42.54
6570,42.64
6571,42.74
6572,42.7
6573,42.8
6574,42.94
6575,42.86
6576,42.68
6577,42.86
6578,42.76
6579,42.82
6580,42.82
6581,42.82
6582,42.74
6583,42.76
6584,42.92
6585,42.86
6586,42.92
6587,43.02
6588,42.8
6589,42.86
6590,42.88
6591,43.0
6592,42.9
6593,43.08
6594,42.94
6595,42.78
6596,43.0
6597,42.92
6598,42.88
6599,42.84
6600,42.94
6601,42.86
6602,43.04
6603,43.13
6604,43.21
6605,43.06
6606,42.94
6607,42.96
6608,42.9
6609,42.92
6610,43.04
6611,42.92
6612,43.08
6613,43.06
6614,43.15
6615,43.06
6616,43.25
6617,43.1
6618,43.19
6619,43.23
6620,43.15
6621,43.0
6622,43.06
6623,43.06
6624,43.15
6625,43.17
6626,43.17
6627,43.04
6628,42.92
6629,42.88
6630,42.74
6631,42.58
6632,42.44
6633,42.34
6634,42.4
6635,42.54
6636,42.52
6637,42.8
6638,42.72
6639,42.78
6640,42.76
6641,42.84
6642,42.9
6643,42.76
6644,42.42
6645,42.44
6646,42.62
6647,42.42
6648,42.4
6649,42.4
6650,42.4
6651,42.46
6652,42.48
6653,42.66
6654,42.52
6655,42.5
6656,42.7
6657,42.62
6658,42.7
6659,42.7
6660,42.74
6661,42.8
6662,42.7
6663,42.88
6664,42.68
6665,42.66
6666,42.72
6667,42.64
6668,42.4
6669,42.62
6670,42.54
6671,42.78
6672,42.58
6673,42.8
6674,42.7
6675,42.66
6676,42.5
6677,42.64
6678,42.32
6679,42.46
6680,42.46
6681,42.46
6682,42.56
6683,42.52
6684,42.56
6685,42.58
6686,42.6
6687,42.6
6688,42.52
6689,42.5
6690,42.62
6691,42.58
6692,42.56
6693,42.58
6694,42.42
6695,42.7
6696,42.62
6697,42.64
6698,42.72
6699,42.58
6700,42.7
6701,42.84
6702,42.7
6703,42.74
6704,42.78
6705,42.72
6706,42.7
6707,42.7
6708,42.64
6709,42.72
6710,42.72
6711,42.76
6712,42.78
6713,42.84
6714,42.72
6715,42.78
6716,42.88
6717,42.82
6718,42.72
6719,42.64
6720,42.7
6721,42.82
6722,42.7
6723,42.86
6724,42.78
6725,42.78
6726,42.82
6727,43.0
6728,42.78
6729,42.86
6730,42.78
6731,42.74
6732,42.64
6733,42.62
6734,42.64
6735,42.82
6736,42.74
6737,42.72
6738,42.72
6739,42.7
6740,42.5
6741,42.28
6742,42.3
6743,42.5
6744,42.36
6745,42.46
6746,42.56
6747,42.66
6748,42.64
6749,42.52
6750,42.4
6751,42.66
6752,42.36
6753,42.28
6754,42.32
6755,42.32
6756,42.28
6757,42.32
6758,42.32
6759,42.26
6760,42.26
6761,42.44
