panel,temperatura
1,41.51
2,41.63
3,41.43
4,40.66
5,41.45
6,42.22
7,42.44
8,42.46
9,42.3
10,42.16
11,41.96
12,41.94
13,41.88
14,41.77
15,41.73
16,41.75
17,41.27
18,40.42
19,41.16
20,41.63
21,42.08
22,42.4
23,42.24
24,42.26
25,42.38
26,42.46
27,42.48
28,42.52
29,42.6
30,42.46
31,42.46
32,42.42
33,42.6
34,42.88
35,42.62
36,42.42
37,42.34
38,42.3
39,42.18
40,42.26
41,42.26
42,42.18
43,42.3
44,42.24
45,42.58
46,42.4
47,42.18
48,42.16
49,42.18
50,42.02
51,42.04
52,42.12
53,41.92
54,41.94
55,42.18
56,42.02
57,41.94
58,42.08
59,42.02
60,42.0
61,41.92
62,41.85
63,41.88
64,41.94
65,41.77
66,41.85
67,41.79
68,41.67
69,41.77
70,41.92
71,41.79
72,41.83
73,41.81
74,41.86
75,41.9
76,41.77
77,41.81
78,41.92
79,41.69
80,41.88
81,41.83
82,41.77
83,41.81
84,41.86
85,41.81
86,41.71
87,41.71
88,41.61
89,41.63
90,41.53
91,41.39
92,41.39
93,41.45
94,41.39
95,41.37
96,41.31
97,41.43
98,41.49
99,41.39
100,41.35
101,41.27
102,41.16
103,41.45
104,41.2
105,41.16
106,41.14
107,41.16
108,41.04
109,40.96
110,41.0
111,41.0
112,40.78
113,40.76
114,40.76
115,40.46
116,40.04
117,39.77
118,39.89
119,40.32
120,40.26
121,40.34
122,40.38
123,40.32
124,40.46
125,40.12
126,40.26
127,40.4
128,40.22
129,39.97
130,41.85
131,41.57
132,41.43
133,41.47
134,41.59
135,41.83
136,41.88
137,41.94
138,41.88
139,41.63
140,41.59
141,41.53
142,41.41
143,41.31
144,40.96
145,40.36
146,41.08
147,41.33
148,41.33
149,41.24
150,41.43
151,41.65
152,41.73
153,41.69
154,41.67
155,41.73
156,41.61
157,41.77
158,41.94
159,41.94
160,42.04
161,41.75
162,41.67
163,41.73
164,41.65
165,41.61
166,41.65
167,41.59
168,41.71
169,41.75
170,41.9
171,41.61
172,41.85
173,41.55
174,41.59
175,41.49
176,41.41
177,41.47
178,41.37
179,41.33
180,41.35
181,41.33
182,41.33
183,41.37
184,41.33
185,41.43
186,41.45
187,41.35
188,41.27
189,41.29
190,41.29
191,41.39
192,41.33
193,41.22
194,41.31
195,41.33
196,41.37
197,41.39
198,41.47
199,41.41
200,41.31
201,41.43
202,41.39
203,41.22
204,41.39
205,41.2
206,41.24
207,41.37
208,41.14
209,41.18
210,41.0
211,41.12
212,41.12
213,41.1
214,40.96
215,40.9
216,41.02
217,40.84
218,41.02
219,40.7
220,40.5
221,40.68
222,40.68
223,40.82
224,40.58
225,40.54
226,40.56
227,40.6
228,40.86
229,40.5
230,40.28
231,40.36
232,40.2
233,40.32
234,40.04
235,40.06
236,39.93
237,39.93
238,39.83
239,39.85
240,39.53
241,39.75
242,39.57
243,39.51
244,39.61
245,39.97
246,39.67
247,39.65
248,39.61
249,41.71
250,41.65
251,41.71
252,41.81
253,41.81
254,41.79
255,41.86
256,41.9
257,41.88
258,41.71
259,41.65
260,41.57
261,41.57
262,41.43
263,41.24
264,40.3
265,41.0
266,41.29
267,41.27
268,41.39
269,41.43
270,41.57
271,41.55
272,41.61
273,41.75
274,41.77
275,41.92
276,41.75
277,41.96
278,41.9
279,42.02
280,41.75
281,41.81
282,41.75
283,41.83
284,41.83
285,41.92
286,41.81
287,41.75
288,41.73
289,41.88
290,41.69
291,41.81
292,41.71
293,41.83
294,41.73
295,41.77
296,41.77
297,41.69
298,41.53
299,41.61
300,41.61
301,41.51
302,41.61
303,41.59
304,41.67
305,41.53
306,41.61
307,41.53
308,41.49
309,41.45
310,41.49
311,41.41
312,41.39
313,41.51
314,41.45
315,41.37
316,41.39
317,41.47
318,41.51
319,41.43
320,41.39
321,41.47
322,41.39
323,41.35
324,41.29
325,41.37
326,41.29
327,41.14
328,41.2
329,41.16
330,41.14
331,41.2
332,41.08
333,40.98
334,40.98
335,40.9
336,40.92
337,40.86
338,40.8
339,40.68
340,40.66
341,40.72
342,40.8
343,40.78
344,40.66
345,40.74
346,40.62
347,40.64
348,40.54
349,40.48
350,40.56
351,40.42
352,40.4
353,40.36
354,40.2
355,40.1
356,39.95
357,39.75
358,39.65
359,39.57
360,39.69
361,39.75
362,39.89
363,39.71
364,39.67
365,39.91
366,39.61
367,39.69
368,40.8
369,41.61
370,41.55
371,40.68
372,40.9
373,41.67
374,41.94
375,41.98
376,41.96
377,41.65
378,41.69
379,41.69
380,41.65
381,42.16
382,42.08
383,41.35
384,40.52
385,40.3
386,40.66
387,40.92
388,41.45
389,41.73
390,41.65
391,41.59
392,41.53
393,41.88
394,41.96
395,41.63
396,41.83
397,41.83
398,41.75
399,41.92
400,41.96
401,41.94
402,42.12
403,42.06
404,42.08
405,42.04
406,42.02
407,42.06
408,42.4
409,42.2
410,41.96
411,41.86
412,42.0
413,41.83
414,41.9
415,41.85
416,41.9
417,41.96
418,41.9
419,41.94
420,41.85
421,41.73
422,41.69
423,41.67
424,41.71
425,41.92
426,41.83
427,41.94
428,41.77
429,41.65
430,41.71
431,41.71
432,41.47
433,41.43
434,41.45
435,41.45
436,41.53
437,41.59
438,41.51
439,41.2
440,41.65
441,41.51
442,41.47
443,41.45
444,41.41
445,41.61
446,41.37
447,41.51
448,41.29
449,41.45
450,41.43
451,41.59
452,41.43
453,41.27
454,41.39
455,41.27
456,41.37
457,40.98
458,40.9
459,40.86
460,41.02
461,40.7
462,40.8
463,40.66
464,40.94
465,40.98
466,40.88
467,40.68
468,40.92
469,40.84
470,40.84
471,40.76
472,40.66
473,40.7
474,40.74
475,40.5
476,40.58
477,40.44
478,40.46
479,40.5
480,40.22
481,40.22
482,39.95
483,39.59
484,39.95
485,40.04
486,40.0
487,40.1
488,40.12
489,40.26
490,40.22
491,40.2
492,40.0
493,39.71
494,41.29
495,41.53
496,41.37
497,40.76
498,41.22
499,42.12
500,42.3
501,42.4
502,42.4
503,42.38
504,42.38
505,42.14
506,42.32
507,42.36
508,42.24
509,42.18
510,41.61
511,41.73
512,41.96
513,42.04
514,41.94
515,41.96
516,42.08
517,41.94
518,42.1
519,42.24
520,42.34
521,42.24
522,42.46
523,42.36
524,42.48
525,42.54
526,42.62
527,42.56
528,42.62
529,42.6
530,42.58
531,42.6
532,42.6
533,42.58
534,42.6
535,42.48
536,42.64
537,42.54
538,42.6
539,42.44
540,42.44
541,42.46
542,42.38
543,42.44
544,42.36
545,42.46
546,42.38
547,42.22
548,42.3
549,42.28
550,42.3
551,42.42
552,42.38
553,42.54
554,42.36
555,42.1
556,42.14
557,42.1
558,41.94
559,42.1
560,41.88
561,42.04
562,41.94
563,41.92
564,41.92
565,41.92
566,42.02
567,41.88
568,41.98
569,41.86
570,41.92
571,41.96
572,41.9
573,42.0
574,41.86
575,41.77
576,41.86
577,41.92
578,41.73
579,41.71
580,41.75
581,41.59
582,41.47
583,41.59
584,41.43
585,41.37
586,41.37
587,41.04
588,41.33
589,41.2
590,41.18
591,41.41
592,41.39
593,41.33
594,41.24
595,41.41
596,41.31
597,41.22
598,41.24
599,41.31
600,41.29
601,41.31
602,41.14
603,41.29
604,41.27
605,41.1
606,41.02
607,41.06
608,40.62
609,40.48
610,40.26
611,40.22
612,40.0
613,40.0
614,40.24
615,40.14
616,40.46
617,40.34
618,40.32
619,40.48
620,40.58
621,40.6
622,40.88
623,40.6
624,40.36
625,40.32
626,39.55
627,41.45
628,41.49
629,41.49
630,41.35
631,41.88
632,42.28
633,42.44
634,42.52
635,42.5
636,42.56
637,42.58
638,42.58
639,42.6
640,42.46
641,42.24
642,42.3
643,41.9
644,41.81
645,41.83
646,41.92
647,42.02
648,41.98
649,42.02
650,42.14
651,42.26
652,42.3
653,42.44
654,42.4
655,42.52
656,42.54
657,42.6
658,42.6
659,42.6
660,42.64
661,42.64
662,42.64
663,42.6
664,42.74
665,42.66
666,42.56
667,42.52
668,42.56
669,42.46
670,42.46
671,42.46
672,42.5
673,42.56
674,42.46
675,42.38
676,42.4
677,42.44
678,42.52
679,42.38
680,42.4
681,42.44
682,42.4
683,42.38
684,42.4
685,42.46
686,42.36
687,42.3
688,42.12
689,42.12
690,42.18
691,41.96
692,41.98
693,42.02
694,42.0
695,42.06
696,42.04
697,41.98
698,41.92
699,42.16
700,42.02
701,42.0
702,41.92
703,41.96
704,42.02
705,41.96
706,41.9
707,41.88
708,41.85
709,41.86
710,41.75
711,41.81
712,41.75
713,41.57
714,41.57
715,41.75
716,41.35
717,41.37
718,41.31
719,41.2
720,40.92
721,41.22
722,41.12
723,41.14
724,41.2
725,41.27
726,41.27
727,41.37
728,41.35
729,41.41
730,41.29
731,41.33
732,41.31
733,41.33
734,41.39
735,41.39
736,41.45
737,41.37
738,41.31
739,41.16
740,41.1
741,40.86
742,40.7
743,40.52
744,40.3
745,40.24
746,40.16
747,40.12
748,40.26
749,40.34
750,40.36
751,40.48
752,40.58
753,40.54
754,40.68
755,40.6
756,40.5
757,40.52
758,40.5
759,39.75
760,41.71
761,41.53
762,41.53
763,41.37
764,41.85
765,42.36
766,42.62
767,42.68
768,42.64
769,42.68
770,42.74
771,42.68
772,42.64
773,42.46
774,42.24
775,42.14
776,42.1
777,41.94
778,41.94
779,41.96
780,42.08
781,42.12
782,42.3
783,42.18
784,42.36
785,42.48
786,42.58
787,42.54
788,42.86
789,42.6
790,42.54
791,42.58
792,42.7
793,42.72
794,42.64
795,42.56
796,42.56
797,42.62
798,42.6
799,42.66
800,42.5
801,42.46
802,42.5
803,42.4
804,42.56
805,42.5
806,42.52
807,42.6
808,42.44
809,42.42
810,42.42
811,42.44
812,42.4
813,42.32
814,42.34
815,42.38
816,42.44
817,42.4
818,42.28
819,42.34
820,42.22
821,42.36
822,42.32
823,42.1
824,42.08
825,42.0
826,42.0
827,41.96
828,42.0
829,41.98
830,42.06
831,42.02
832,42.1
833,41.98
834,42.02
835,42.0
836,42.02
837,42.16
838,42.02
839,41.98
840,41.88
841,41.77
842,41.79
843,41.73
844,41.67
845,41.73
846,41.59
847,41.55
848,41.51
849,41.41
850,41.29
851,41.14
852,41.24
853,41.18
854,41.18
855,41.18
856,41.1
857,41.22
858,41.22
859,41.18
860,41.24
861,41.27
862,41.35
863,41.35
864,41.22
865,41.31
866,41.45
867,41.35
868,41.37
869,41.35
870,41.35
871,41.35
872,41.33
873,41.04
874,40.82
875,40.74
876,40.48
877,40.44
878,40.42
879,40.16
880,40.16
881,40.28
882,40.44
883,40.46
884,40.42
885,40.52
886,40.42
887,40.6
888,40.6
889,40.52
890,40.5
891,40.46
892,40.04
893,41.71
894,41.53
895,41.57
896,41.31
897,41.79
898,42.34
899,42.72
900,42.76
901,42.64
902,42.66
903,42.68
904,42.76
905,42.52
906,42.48
907,42.28
908,42.14
909,42.04
910,42.04
911,42.04
912,42.02
913,41.96
914,42.26
915,42.24
916,42.36
917,42.36
918,42.5
919,42.58
920,42.64
921,42.6
922,42.64
923,42.62
924,42.58
925,42.7
926,42.72
927,42.56
928,42.52
929,42.48
930,42.54
931,42.54
932,42.52
933,42.4
934,42.4
935,42.42
936,42.34
937,42.48
938,42.44
939,42.46
940,42.48
941,42.54
942,42.42
943,42.42
944,42.4
945,42.46
946,42.3
947,42.3
948,42.24
949,42.32
950,42.32
951,42.16
952,42.2
953,42.24
954,42.2
955,42.2
956,42.1
957,42.14
958,42.0
959,41.98
960,41.9
961,41.9
962,41.9
963,41.96
964,42.06
965,42.04
966,42.12
967,42.0
968,42.02
969,42.04
970,41.98
971,41.88
972,41.88
973,41.86
974,41.63
975,41.71
976,41.67
977,41.49
978,41.59
979,41.59
980,41.65
981,41.43
982,41.2
983,41.2
984,41.2
985,41.22
986,41.16
987,41.16
988,41.04
989,41.16
990,41.14
991,41.04
992,40.98
993,41.16
994,41.27
995,41.29
996,41.27
997,41.31
998,41.37
999,41.37
1000,41.33
1001,41.33
1002,41.29
1003,41.39
1004,41.35
1005,41.22
1006,41.02
1007,40.98
1008,40.74
1009,40.62
1010,40.56
1011,40.48
1012,40.24
1013,40.32
1014,40.36
1015,40.48
1016,40.48
1017,40.52
1018,40.42
1019,40.4
1020,40.6
1021,40.62
1022,40.44
1023,40.42
1024,40.42
1025,40.22
1026,39.61
1027,41.65
1028,41.65
1029,41.59
1030,41.2
1031,41.9
1032,42.36
1033,42.62
1034,42.68
1035,42.68
1036,42.76
1037,42.68
1038,42.62
1039,42.52
1040,42.4
1041,42.42
1042,42.26
1043,42.02
1044,42.04
1045,42.1
1046,42.18
1047,42.2
1048,42.26
1049,42.34
1050,42.32
1051,42.42
1052,42.54
1053,42.64
1054,42.58
1055,42.62
1056,42.6
1057,42.74
1058,42.66
1059,42.66
1060,42.66
1061,42.58
1062,42.46
1063,42.52
1064,42.52
1065,42.52
1066,42.46
1067,42.38
1068,42.38
1069,42.38
1070,42.34
1071,42.32
1072,42.36
1073,42.34
1074,42.38
1075,42.4
1076,42.2
1077,42.34
1078,42.38
1079,42.3
1080,42.32
1081,42.3
1082,42.22
1083,42.1
1084,42.14
1085,42.1
1086,42.2
1087,42.14
1088,42.1
1089,42.16
1090,42.1
1091,42.0
1092,41.96
1093,41.85
1094,41.94
1095,41.86
1096,41.94
1097,41.94
1098,41.96
1099,42.0
1100,41.94
1101,41.98
1102,41.9
1103,41.98
1104,41.92
1105,41.86
1106,41.83
1107,41.79
1108,41.75
1109,41.67
1110,41.61
1111,41.43
1112,41.53
1113,41.59
1114,41.49
1115,41.45
1116,41.39
1117,41.27
1118,41.14
1119,41.29
1120,41.24
1121,41.02
1122,41.12
1123,41.16
1124,41.16
1125,41.0
1126,41.02
1127,41.24
1128,41.27
1129,41.29
1130,41.29
1131,41.27
1132,41.31
1133,41.37
1134,41.31
1135,41.31
1136,41.31
1137,41.27
1138,41.29
1139,41.31
1140,41.27
1141,40.9
1142,40.7
1143,40.64
1144,40.52
1145,40.52
1146,40.44
1147,40.4
1148,40.38
1149,40.46
1150,40.6
1151,40.58
1152,40.58
1153,40.5
1154,40.56
1155,40.62
1156,40.48
1157,40.42
1158,40.38
1159,40.2
1160,39.55
1161,41.79
1162,41.67
1163,41.51
1164,41.33
1165,42.06
1166,42.4
1167,42.62
1168,42.64
1169,42.66
1170,42.68
1171,42.68
1172,42.62
1173,42.62
1174,42.5
1175,42.4
1176,42.24
1177,42.08
1178,42.04
1179,42.14
1180,42.1
1181,42.18
1182,42.26
1183,42.3
1184,42.38
1185,42.54
1186,42.5
1187,42.64
1188,42.64
1189,42.68
1190,42.56
1191,42.54
1192,42.56
1193,42.6
1194,42.62
1195,42.54
1196,42.52
1197,42.5
1198,42.52
1199,42.48
1200,42.44
1201,42.34
1202,42.34
1203,42.28
1204,42.3
1205,42.32
1206,42.16
1207,42.28
1208,42.3
1209,42.36
1210,42.26
1211,42.38
1212,42.36
1213,42.24
1214,42.34
1215,42.26
1216,42.1
1217,42.12
1218,42.1
1219,42.06
1220,42.1
1221,42.1
1222,42.08
1223,42.0
1224,42.06
1225,41.96
1226,41.98
1227,41.88
1228,41.86
1229,41.83
1230,41.92
1231,41.86
1232,41.85
1233,41.96
1234,41.85
1235,41.88
1236,41.9
1237,41.86
1238,41.85
1239,41.77
1240,41.83
1241,41.73
1242,41.73
1243,41.75
1244,41.67
1245,41.59
1246,41.57
1247,41.51
1248,41.49
1249,41.47
1250,41.39
1251,41.39
1252,41.45
1253,41.33
1254,41.12
1255,41.08
1256,41.08
1257,41.16
1258,41.22
1259,41.2
1260,41.08
1261,41.22
1262,41.24
1263,41.33
1264,41.27
1265,41.27
1266,41.35
1267,41.22
1268,41.39
1269,41.35
1270,41.27
1271,41.27
1272,41.29
1273,41.29
1274,41.2
1275,41.02
1276,40.84
1277,40.76
1278,40.62
1279,40.62
1280,40.46
1281,40.4
1282,40.4
1283,40.64
1284,40.66
1285,40.56
1286,40.52
1287,40.44
1288,40.74
1289,40.54
1290,40.48
1291,40.46
1292,40.4
1293,40.24
1294,39.81
1295,41.85
1296,41.65
1297,41.45
1298,41.29
1299,41.96
1300,42.58
1301,42.66
1302,42.72
1303,42.64
1304,42.64
1305,42.58
1306,42.62
1307,42.62
1308,42.46
1309,42.52
1310,42.26
1311,42.16
1312,42.18
1313,42.16
1314,42.14
1315,42.32
1316,42.24
1317,42.4
1318,42.5
1319,42.58
1320,42.6
1321,42.6
1322,42.58
1323,42.52
1324,42.52
1325,42.48
1326,42.56
1327,42.44
1328,42.62
1329,42.58
1330,42.54
1331,42.52
1332,42.54
1333,42.62
1334,42.48
1335,42.48
1336,42.28
1337,42.32
1338,42.24
1339,42.28
1340,42.28
1341,42.28
1342,42.36
1343,42.28
1344,42.36
1345,42.36
1346,42.4
1347,42.28
1348,42.26
1349,42.24
1350,42.24
1351,42.12
1352,42.18
1353,42.04
1354,42.02
1355,42.06
1356,42.1
1357,42.04
1358,42.12
1359,41.96
1360,41.9
1361,41.83
1362,41.88
1363,41.86
1364,41.83
1365,41.83
1366,41.71
1367,41.79
1368,41.9
1369,41.79
1370,41.88
1371,41.85
1372,41.9
1373,41.81
1374,41.71
1375,41.73
1376,41.83
1377,41.73
1378,41.61
1379,41.43
1380,41.59
1381,41.61
1382,41.59
1383,41.35
1384,41.22
1385,41.43
1386,41.33
1387,41.41
1388,41.06
1389,41.2
1390,41.08
1391,41.27
1392,41.22
1393,41.27
1394,41.2
1395,41.39
1396,41.35
1397,41.35
1398,41.31
1399,41.35
1400,41.47
1401,41.35
1402,41.31
1403,41.35
1404,41.33
1405,41.27
1406,41.27
1407,41.24
1408,41.24
1409,41.1
1410,40.98
1411,40.78
1412,40.8
1413,40.62
1414,40.56
1415,40.46
1416,40.5
1417,40.74
1418,40.78
1419,40.64
1420,40.76
1421,40.6
1422,40.58
1423,40.64
1424,40.54
1425,40.48
1426,40.46
1427,40.42
1428,39.95
1429,41.81
1430,41.67
1431,41.37
1432,41.29
1433,41.79
1434,42.36
1435,42.56
1436,42.64
1437,42.64
1438,42.58
1439,42.54
1440,42.62
1441,42.6
1442,42.56
1443,42.42
1444,42.18
1445,42.22
1446,42.16
1447,42.18
1448,42.38
1449,42.28
1450,42.28
1451,42.48
1452,42.68
1453,42.68
1454,42.68
1455,42.7
1456,42.54
1457,42.6
1458,42.56
1459,42.42
1460,42.62
1461,42.52
1462,42.8
1463,42.68
1464,42.62
1465,42.5
1466,42.66
1467,42.64
1468,42.6
1469,42.46
1470,42.4
1471,42.32
1472,42.16
1473,42.3
1474,42.32
1475,42.3
1476,42.42
1477,42.38
1478,42.38
1479,42.36
1480,42.36
1481,42.36
1482,42.3
1483,42.24
1484,42.04
1485,42.06
1486,42.12
1487,42.1
1488,42.08
1489,42.08
1490,42.06
1491,42.12
1492,42.08
1493,41.98
1494,41.92
1495,41.94
1496,41.92
1497,41.69
1498,41.75
1499,41.85
1500,41.75
1501,41.9
1502,41.88
1503,41.88
1504,41.88
1505,42.0
1506,41.96
1507,41.9
1508,41.73
1509,41.77
1510,41.59
1511,41.65
1512,41.71
1513,41.63
1514,41.94
1515,41.53
1516,41.67
1517,41.57
1518,41.45
1519,41.55
1520,41.49
1521,41.39
1522,41.24
1523,41.04
1524,41.2
1525,41.24
1526,41.29
1527,41.31
1528,41.31
1529,41.37
1530,41.49
1531,41.45
1532,41.39
1533,41.35
1534,41.33
1535,41.35
1536,41.2
1537,41.35
1538,41.31
1539,41.29
1540,41.31
1541,41.22
1542,41.29
1543,41.02
1544,40.94
1545,40.92
1546,40.7
1547,40.58
1548,40.56
1549,40.4
1550,40.3
1551,40.56
1552,40.72
1553,40.72
1554,40.72
1555,40.66
1556,40.64
1557,40.58
1558,40.58
1559,40.46
1560,40.48
1561,40.44
1562,40.16
1563,41.83
1564,41.63
1565,41.47
1566,41.14
1567,41.49
1568,42.32
1569,42.6
1570,42.58
1571,42.64
1572,42.54
1573,42.58
1574,42.68
1575,42.6
1576,42.58
1577,42.44
1578,42.22
1579,42.2
1580,42.18
1581,42.2
1582,42.3
1583,42.34
1584,42.4
1585,42.5
1586,42.56
1587,42.7
1588,42.6
1589,42.7
1590,42.66
1591,42.64
1592,42.52
1593,42.64
1594,42.62
1595,42.72
1596,42.78
1597,42.62
1598,42.62
1599,42.62
1600,42.52
1601,42.58
1602,42.62
1603,42.5
1604,42.46
1605,42.34
1606,42.14
1607,42.28
1608,42.32
1609,42.2
1610,42.4
1611,42.42
1612,42.34
1613,42.38
1614,42.36
1615,42.36
1616,42.36
1617,42.22
1618,42.08
1619,42.1
1620,42.12
1621,42.04
1622,42.1
1623,42.08
1624,42.1
1625,42.12
1626,42.18
1627,41.96
1628,41.96
1629,41.94
1630,41.9
1631,41.86
1632,41.71
1633,41.88
1634,41.94
1635,41.98
1636,42.02
1637,41.92
1638,41.94
1639,42.0
1640,41.94
1641,41.86
1642,41.85
1643,41.85
1644,41.71
1645,41.67
1646,41.71
1647,41.73
1648,41.79
1649,41.73
1650,41.69
1651,41.71
1652,41.61
1653,41.55
1654,41.55
1655,41.49
1656,41.29
1657,41.16
1658,41.22
1659,41.27
1660,41.31
1661,41.31
1662,41.39
1663,41.37
1664,41.41
1665,41.45
1666,41.43
1667,41.41
1668,41.37
1669,41.53
1670,41.35
1671,41.33
1672,41.35
1673,41.35
1674,41.37
1675,41.24
1676,41.18
1677,41.12
1678,41.0
1679,40.9
1680,40.78
1681,40.82
1682,40.66
1683,40.58
1684,40.38
1685,40.66
1686,40.68
1687,40.76
1688,40.72
1689,40.72
1690,40.7
1691,40.76
1692,40.64
1693,40.6
1694,40.5
1695,40.4
1696,40.2
1697,39.79
1698,41.94
1699,41.61
1700,41.45
1701,41.35
1702,41.83
1703,42.52
1704,42.72
1705,42.76
1706,42.68
1707,42.72
1708,42.52
1709,42.6
1710,42.62
1711,42.52
1712,42.48
1713,42.44
1714,42.32
1715,42.32
1716,42.3
1717,42.14
1718,42.34
1719,42.48
1720,42.62
1721,42.52
1722,42.62
1723,42.66
1724,42.68
1725,42.54
1726,42.7
1727,42.68
1728,42.58
1729,42.7
1730,42.66
1731,42.72
1732,42.78
1733,42.6
1734,42.64
1735,42.56
1736,42.58
1737,42.58
1738,42.68
1739,42.52
1740,42.44
1741,42.38
1742,42.4
1743,42.34
1744,42.34
1745,42.34
1746,42.38
1747,42.38
1748,42.4
1749,42.46
1750,42.42
1751,42.42
1752,42.24
1753,42.12
1754,42.24
1755,42.24
1756,42.2
1757,42.24
1758,42.24
1759,42.24
1760,42.18
1761,42.22
1762,42.06
1763,42.0
1764,42.0
1765,42.0
1766,41.88
1767,42.02
1768,42.1
1769,41.98
1770,42.08
1771,42.12
1772,42.18
1773,41.94
1774,42.0
1775,42.02
1776,41.85
1777,41.92
1778,42.02
1779,41.86
1780,41.88
1781,41.81
1782,41.79
1783,41.9
1784,41.81
1785,41.79
1786,41.77
1787,41.77
1788,41.59
1789,41.57
1790,41.55
1791,41.39
1792,41.43
1793,41.45
1794,41.61
1795,41.55
1796,41.43
1797,41.47
1798,41.55
1799,41.51
1800,41.51
1801,41.45
1802,41.47
1803,41.53
1804,41.55
1805,41.51
1806,41.55
1807,41.41
1808,41.49
1809,41.49
1810,41.31
1811,41.24
1812,41.22
1813,41.06
1814,40.9
1815,40.88
1816,40.8
1817,40.84
1818,40.7
1819,40.52
1820,40.76
1821,40.74
1822,40.78
1823,40.74
1824,40.78
1825,40.74
1826,40.84
1827,40.7
1828,40.66
1829,40.5
1830,40.5
1831,40.26
1832,40.1
1833,41.98
1834,41.75
1835,41.57
1836,41.39
1837,41.92
1838,42.48
1839,42.8
1840,42.7
1841,42.68
1842,42.68
1843,42.66
1844,42.72
1845,42.66
1846,42.54
1847,42.54
1848,42.54
1849,42.44
1850,42.36
1851,42.38
1852,42.26
1853,42.48
1854,42.36
1855,42.56
1856,42.66
1857,42.74
1858,42.7
1859,42.76
1860,42.76
1861,42.72
1862,42.68
1863,42.68
1864,42.82
1865,42.8
1866,42.76
1867,42.74
1868,42.72
1869,42.62
1870,42.62
1871,42.68
1872,42.66
1873,42.64
1874,42.56
1875,42.52
1876,42.44
1877,42.4
1878,42.38
1879,42.4
1880,42.46
1881,42.42
1882,42.4
1883,42.44
1884,42.44
1885,42.4
1886,42.34
1887,42.48
1888,42.34
1889,42.34
1890,42.24
1891,42.32
1892,42.28
1893,42.32
1894,42.32
1895,42.28
1896,42.3
1897,42.1
1898,42.2
1899,42.12
1900,42.14
1901,42.04
1902,42.32
1903,42.26
1904,41.98
1905,42.0
1906,42.28
1907,42.4
1908,42.16
1909,42.14
1910,42.08
1911,41.96
1912,42.04
1913,42.06
1914,42.02
1915,41.86
1916,41.94
1917,41.92
1918,41.94
1919,41.96
1920,41.86
1921,41.83
1922,41.75
1923,41.73
1924,41.67
1925,41.65
1926,41.47
1927,41.57
1928,41.59
1929,41.71
1930,41.61
1931,41.65
1932,41.65
1933,41.67
1934,41.53
1935,41.55
1936,41.53
1937,41.55
1938,41.65
1939,41.57
1940,41.59
1941,41.53
1942,41.51
1943,41.45
1944,41.29
1945,41.37
1946,41.47
1947,41.35
1948,41.18
1949,41.14
1950,40.92
1951,40.94
1952,40.88
1953,40.72
1954,40.54
1955,40.8
1956,40.88
1957,40.84
1958,40.86
1959,40.78
1960,41.06
1961,40.96
1962,40.78
1963,40.74
1964,40.68
1965,40.52
1966,40.44
1967,40.14
1968,41.98
1969,41.69
1970,41.39
1971,41.33
1972,42.06
1973,42.5
1974,42.76
1975,42.72
1976,42.9
1977,42.76
1978,42.66
1979,42.7
1980,42.68
1981,42.56
1982,42.56
1983,42.5
1984,42.46
1985,42.42
1986,42.34
1987,42.44
1988,42.52
1989,42.5
1990,42.62
1991,42.66
1992,42.78
1993,42.72
1994,42.8
1995,42.76
1996,42.84
1997,42.74
1998,42.74
1999,42.68
2000,42.78
2001,42.78
2002,42.82
2003,42.76
2004,42.72
2005,42.72
2006,42.72
2007,42.72
2008,42.68
2009,42.64
2010,42.62
2011,42.36
2012,42.46
2013,42.46
2014,42.46
2015,42.52
2016,42.44
2017,42.48
2018,42.5
2019,42.62
2020,42.46
2021,42.32
2022,42.38
2023,42.42
2024,42.42
2025,42.34
2026,42.42
2027,42.28
2028,42.32
2029,42.34
2030,42.32
2031,42.36
2032,42.36
2033,42.32
2034,42.2
2035,42.32
2036,42.3
2037,42.24
2038,42.08
2039,42.1
2040,42.16
2041,42.26
2042,42.32
2043,42.18
2044,42.24
2045,42.16
2046,42.06
2047,42.12
2048,42.14
2049,42.0
2050,42.1
2051,41.96
2052,42.0
2053,42.06
2054,41.94
2055,42.0
2056,41.88
2057,41.86
2058,41.71
2059,41.67
2060,41.63
2061,41.51
2062,41.57
2063,41.55
2064,41.67
2065,41.88
2066,41.65
2067,41.65
2068,41.65
2069,41.63
2070,41.65
2071,41.57
2072,41.63
2073,41.67
2074,41.67
2075,41.65
2076,41.69
2077,41.69
2078,41.59
2079,41.49
2080,41.49
2081,41.37
2082,41.37
2083,41.22
2084,41.06
2085,41.0
2086,41.0
2087,40.84
2088,40.7
2089,40.74
2090,40.8
2091,40.92
2092,40.9
2093,41.12
2094,40.94
2095,40.88
2096,40.88
2097,40.86
2098,40.78
2099,40.76
2100,40.62
2101,40.6
2102,40.32
2103,39.51
2104,42.12
2105,41.67
2106,41.45
2107,41.53
2108,42.1
2109,42.52
2110,42.84
2111,42.8
2112,42.78
2113,42.8
2114,42.7
2115,42.7
2116,42.72
2117,42.8
2118,42.58
2119,42.6
2120,42.52
2121,42.5
2122,42.5
2123,42.46
2124,42.56
2125,42.6
2126,42.7
2127,42.66
2128,42.8
2129,42.84
2130,42.96
2131,42.76
2132,42.98
2133,42.96
2134,42.8
2135,42.8
2136,42.88
2137,42.84
2138,42.84
2139,42.8
2140,43.0
2141,42.72
2142,42.86
2143,42.74
2144,42.66
2145,42.58
2146,42.48
2147,42.4
2148,42.38
2149,42.46
2150,42.52
2151,42.46
2152,42.48
2153,42.56
2154,42.58
2155,42.72
2156,42.54
2157,42.46
2158,42.46
2159,42.56
2160,42.5
2161,42.48
2162,42.44
2163,42.52
2164,42.44
2165,42.34
2166,42.28
2167,42.36
2168,42.38
2169,42.24
2170,42.26
2171,42.16
2172,42.2
2173,42.2
2174,42.38
2175,42.16
2176,42.24
2177,42.26
2178,42.5
2179,42.28
2180,42.24
2181,42.16
2182,42.16
2183,42.14
2184,42.26
2185,42.16
2186,42.12
2187,42.06
2188,41.98
2189,42.0
2190,42.0
2191,42.0
2192,41.85
2193,41.75
2194,41.85
2195,41.77
2196,41.63
2197,41.55
2198,41.55
2199,41.59
2200,41.59
2201,41.65
2202,41.67
2203,41.67
2204,41.71
2205,41.67
2206,41.67
2207,41.79
2208,41.73
2209,41.69
2210,41.75
2211,41.69
2212,41.57
2213,41.59
2214,41.67
2215,41.61
2216,41.45
2217,41.49
2218,41.37
2219,41.27
2220,41.2
2221,41.16
2222,41.04
2223,40.92
2224,40.78
2225,40.68
2226,40.88
2227,40.92
2228,41.02
2229,40.94
2230,40.94
2231,41.04
2232,41.0
2233,40.92
2234,40.84
2235,40.78
2236,40.68
2237,40.6
2238,40.32
2239,39.67
2240,41.94
2241,41.57
2242,41.49
2243,41.47
2244,42.2
2245,42.56
2246,42.76
2247,42.92
2248,42.78
2249,42.74
2250,42.66
2251,42.7
2252,42.72
2253,42.7
2254,42.7
2255,42.64
2256,42.54
2257,42.48
2258,42.52
2259,42.4
2260,42.6
2261,42.56
2262,42.72
2263,42.56
2264,42.72
2265,42.62
2266,42.88
2267,42.86
2268,42.74
2269,42.8
2270,42.82
2271,42.82
2272,42.86
2273,42.82
2274,42.78
2275,42.76
2276,42.82
2277,42.76
2278,42.94
2279,42.92
2280,42.68
2281,42.7
2282,42.48
2283,42.38
2284,42.42
2285,42.5
2286,42.54
2287,42.56
2288,42.52
2289,42.5
2290,42.58
2291,42.66
2292,42.62
2293,42.46
2294,42.42
2295,42.5
2296,42.5
2297,42.5
2298,42.48
2299,42.5
2300,42.48
2301,42.32
2302,42.36
2303,42.28
2304,42.28
2305,42.2
2306,42.16
2307,42.14
2308,42.04
2309,42.18
2310,42.26
2311,42.18
2312,42.2
2313,42.2
2314,42.3
2315,42.2
2316,42.16
2317,42.22
2318,42.14
2319,42.04
2320,42.2
2321,42.38
2322,42.18
2323,42.06
2324,42.06
2325,42.02
2326,41.94
2327,41.94
2328,41.9
2329,41.88
2330,41.83
2331,41.77
2332,41.71
2333,41.55
2334,41.59
2335,41.59
2336,41.61
2337,41.65
2338,41.63
2339,41.73
2340,41.71
2341,41.73
2342,41.73
2343,41.73
2344,41.69
2345,41.71
2346,41.75
2347,41.75
2348,41.63
2349,41.69
2350,41.63
2351,41.63
2352,41.45
2353,41.53
2354,41.63
2355,41.27
2356,41.16
2357,41.14
2358,41.0
2359,40.98
2360,40.94
2361,40.74
2362,40.8
2363,40.9
2364,40.98
2365,41.0
2366,40.86
2367,40.98
2368,41.0
2369,40.9
2370,40.82
2371,40.76
2372,40.84
2373,40.66
2374,40.52
2375,39.79
2376,42.02
2377,41.57
2378,41.35
2379,41.59
2380,42.18
2381,42.52
2382,42.84
2383,42.84
2384,42.84
2385,42.78
2386,42.84
2387,42.66
2388,42.72
2389,42.74
2390,42.66
2391,42.6
2392,42.48
2393,42.48
2394,42.52
2395,42.42
2396,42.54
2397,42.58
2398,42.58
2399,42.74
2400,42.78
2401,42.86
2402,42.78
2403,42.82
2404,42.92
2405,42.86
2406,42.84
2407,42.82
2408,42.88
2409,42.84
2410,42.88
2411,42.84
2412,42.92
2413,42.86
2414,42.96
2415,42.82
2416,42.72
2417,42.7
2418,42.44
2419,42.46
2420,42.32
2421,42.48
2422,42.56
2423,42.6
2424,42.56
2425,42.6
2426,42.58
2427,42.62
2428,42.62
2429,42.58
2430,42.56
2431,42.5
2432,42.5
2433,42.48
2434,42.5
2435,42.48
2436,42.54
2437,42.38
2438,42.34
2439,42.26
2440,42.2
2441,42.16
2442,42.16
2443,42.14
2444,42.14
2445,42.16
2446,42.16
2447,42.18
2448,42.16
2449,41.98
2450,42.18
2451,42.22
2452,42.26
2453,42.2
2454,42.22
2455,42.16
2456,42.12
2457,42.2
2458,42.2
2459,42.06
2460,42.04
2461,42.1
2462,41.96
2463,41.98
2464,41.88
2465,41.83
2466,41.81
2467,41.75
2468,41.69
2469,41.59
2470,41.55
2471,41.59
2472,41.65
2473,41.59
2474,41.43
2475,41.67
2476,41.73
2477,41.73
2478,41.73
2479,41.73
2480,41.75
2481,41.79
2482,41.81
2483,41.69
2484,41.65
2485,41.73
2486,41.61
2487,41.63
2488,41.57
2489,41.55
2490,41.41
2491,41.37
2492,41.31
2493,41.14
2494,41.14
2495,41.1
2496,41.0
2497,40.78
2498,40.92
2499,40.92
2500,40.96
2501,41.06
2502,40.94
2503,41.0
2504,41.0
2505,40.92
2506,40.72
2507,40.84
2508,40.74
2509,40.72
2510,40.56
2511,40.1
2512,41.67
2513,41.47
2514,41.29
2515,41.47
2516,42.08
2517,42.7
2518,42.9
2519,42.84
2520,42.86
2521,42.88
2522,42.92
2523,42.78
2524,42.78
2525,42.92
2526,42.74
2527,42.6
2528,42.56
2529,42.54
2530,42.5
2531,42.5
2532,42.44
2533,42.54
2534,42.58
2535,42.74
2536,42.88
2537,42.88
2538,42.86
2539,42.72
2540,42.96
2541,42.8
2542,42.78
2543,42.78
2544,42.92
2545,42.86
2546,42.96
2547,42.88
2548,42.92
2549,42.92
2550,42.96
2551,42.94
2552,42.8
2553,42.64
2554,42.52
2555,42.42
2556,42.48
2557,42.58
2558,42.64
2559,42.64
2560,42.66
2561,42.66
2562,42.6
2563,42.7
2564,42.68
2565,42.66
2566,42.66
2567,42.46
2568,42.44
2569,42.42
2570,42.38
2571,42.46
2572,42.44
2573,42.36
2574,42.3
2575,42.22
2576,42.2
2577,42.2
2578,42.18
2579,42.18
2580,42.16
2581,42.14
2582,42.14
2583,42.14
2584,42.18
2585,42.22
2586,42.16
2587,42.2
2588,42.3
2589,42.2
2590,42.24
2591,42.26
2592,42.12
2593,42.12
2594,42.14
2595,42.04
2596,42.02
2597,42.0
2598,41.96
2599,41.94
2600,42.04
2601,41.9
2602,41.83
2603,41.75
2604,41.79
2605,41.55
2606,41.51
2607,41.49
2608,41.77
2609,41.61
2610,41.63
2611,41.65
2612,41.71
2613,41.71
2614,41.86
2615,41.73
2616,41.75
2617,41.85
2618,41.85
2619,41.77
2620,41.73
2621,41.73
2622,41.65
2623,41.67
2624,41.59
2625,41.57
2626,41.45
2627,41.41
2628,41.41
2629,41.24
2630,41.16
2631,41.1
2632,40.98
2633,40.88
2634,40.94
2635,41.1
2636,41.1
2637,41.18
2638,40.98
2639,41.12
2640,41.22
2641,41.0
2642,40.86
2643,40.9
2644,40.82
2645,40.86
2646,40.76
2647,40.18
2648,41.43
2649,41.29
2650,41.16
2651,41.51
2652,41.94
2653,42.6
2654,42.76
2655,42.94
2656,42.8
2657,42.82
2658,42.76
2659,42.74
2660,42.78
2661,42.72
2662,42.62
2663,42.58
2664,42.48
2665,42.5
2666,42.36
2667,42.24
2668,42.5
2669,42.54
2670,42.76
2671,42.8
2672,42.92
2673,42.98
2674,42.9
2675,42.86
2676,43.0
2677,42.88
2678,42.74
2679,42.82
2680,42.96
2681,42.98
2682,42.96
2683,42.88
2684,42.88
2685,42.96
2686,43.04
2687,42.96
2688,42.78
2689,42.64
2690,42.56
2691,42.42
2692,42.3
2693,42.52
2694,42.62
2695,42.82
2696,42.7
2697,42.66
2698,42.68
2699,43.0
2700,42.74
2701,42.7
2702,42.76
2703,42.48
2704,42.52
2705,42.4
2706,42.42
2707,42.42
2708,42.44
2709,42.28
2710,42.32
2711,42.28
2712,42.22
2713,42.16
2714,42.14
2715,42.18
2716,42.2
2717,42.14
2718,42.12
2719,42.18
2720,42.22
2721,42.24
2722,42.64
2723,42.68
2724,42.58
2725,42.64
2726,42.32
2727,42.32
2728,42.2
2729,42.08
2730,42.1
2731,42.04
2732,41.9
2733,41.96
2734,41.94
2735,41.94
2736,41.94
2737,41.88
2738,41.9
2739,41.73
2740,41.65
2741,41.53
2742,41.53
2743,41.45
2744,41.35
2745,41.37
2746,41.65
2747,41.69
2748,41.73
2749,41.77
2750,41.83
2751,41.81
2752,41.73
2753,41.85
2754,41.86
2755,41.73
2756,41.85
2757,41.73
2758,41.77
2759,41.69
2760,41.59
2761,41.55
2762,41.51
2763,41.51
2764,41.41
2765,41.35
2766,41.31
2767,41.22
2768,41.04
2769,40.9
2770,41.02
2771,41.08
2772,41.06
2773,41.0
2774,40.96
2775,41.14
2776,41.18
2777,40.94
2778,40.92
2779,40.86
2780,40.86
2781,40.76
2782,40.7
2783,40.24
2784,41.59
2785,41.45
2786,41.24
2787,41.31
2788,42.08
2789,42.52
2790,42.92
2791,42.84
2792,42.94
2793,42.82
2794,42.68
2795,42.7
2796,42.78
2797,42.76
2798,42.7
2799,42.56
2800,42.48
2801,42.46
2802,42.32
2803,42.44
2804,42.54
2805,42.56
2806,42.66
2807,42.7
2808,42.86
2809,42.92
2810,42.98
2811,42.9
2812,43.0
2813,42.92
2814,42.88
2815,42.86
2816,42.96
2817,43.0
2818,42.98
2819,42.9
2820,42.86
2821,42.86
2822,42.96
2823,42.96
2824,42.92
2825,42.66
2826,42.58
2827,42.5
2828,42.56
2829,42.66
2830,42.72
2831,42.64
2832,42.56
2833,42.68
2834,42.64
2835,42.68
2836,42.62
2837,42.56
2838,42.52
2839,42.54
2840,42.4
2841,42.44
2842,42.32
2843,42.38
2844,42.38
2845,42.3
2846,42.3
2847,42.28
2848,42.26
2849,42.28
2850,42.16
2851,42.22
2852,42.22
2853,42.16
2854,42.16
2855,42.16
2856,42.34
2857,42.4
2858,42.54
2859,42.7
2860,42.64
2861,42.76
2862,42.62
2863,42.28
2864,42.24
2865,42.1
2866,42.1
2867,41.98
2868,41.96
2869,41.94
2870,41.79
2871,41.86
2872,41.9
2873,41.86
2874,41.73
2875,41.69
2876,41.67
2877,41.43
2878,41.37
2879,41.45
2880,41.45
2881,41.59
2882,41.67
2883,41.69
2884,41.69
2885,41.73
2886,41.79
2887,41.75
2888,41.79
2889,41.88
2890,41.86
2891,41.85
2892,41.79
2893,41.81
2894,41.79
2895,41.75
2896,41.61
2897,41.65
2898,41.59
2899,41.45
2900,41.41
2901,41.29
2902,41.31
2903,41.2
2904,41.0
2905,40.9
2906,41.02
2907,41.08
2908,40.98
2909,41.12
2910,41.08
2911,41.12
2912,41.12
2913,40.92
2914,40.9
2915,40.96
2916,40.84
2917,40.86
2918,40.84
2919,40.44
2920,41.92
2921,41.49
2922,41.35
2923,41.47
2924,42.04
2925,42.56
2926,42.94
2927,42.92
2928,42.92
2929,42.92
2930,42.86
2931,42.88
2932,42.86
2933,42.78
2934,42.72
2935,42.56
2936,42.48
2937,42.46
2938,42.34
2939,42.44
2940,42.38
2941,42.58
2942,42.74
2943,42.78
2944,42.76
2945,42.86
2946,42.9
2947,42.98
2948,43.02
2949,42.96
2950,42.94
2951,42.94
2952,42.96
2953,43.0
2954,43.02
2955,42.98
2956,42.96
2957,42.92
2958,43.08
2959,42.92
2960,42.9
2961,42.82
2962,42.74
2963,42.52
2964,42.66
2965,42.6
2966,42.66
2967,42.62
2968,42.6
2969,42.64
2970,42.62
2971,42.6
2972,42.62
2973,42.48
2974,42.52
2975,42.46
2976,42.48
2977,42.42
2978,42.38
2979,42.36
2980,42.34
2981,42.36
2982,42.38
2983,42.38
2984,42.4
2985,42.28
2986,42.24
2987,42.26
2988,42.34
2989,42.26
2990,42.22
2991,42.34
2992,42.46
2993,42.36
2994,42.24
2995,42.6
2996,42.6
2997,42.34
2998,42.42
2999,42.36
3000,42.38
3001,42.14
3002,42.16
3003,42.04
3004,42.04
3005,41.98
3006,41.92
3007,42.02
3008,41.98
3009,41.85
3010,41.83
3011,41.75
3012,41.57
3013,41.51
3014,41.49
3015,41.51
3016,41.55
3017,41.61
3018,41.63
3019,41.61
3020,41.69
3021,41.71
3022,41.75
3023,41.75
3024,41.75
3025,41.73
3026,41.86
3027,41.85
3028,41.77
3029,41.83
3030,41.79
3031,41.73
3032,41.69
3033,41.73
3034,41.73
3035,41.57
3036,41.47
3037,41.37
3038,41.33
3039,41.33
3040,41.08
3041,40.9
3042,41.08
3043,41.12
3044,41.1
3045,41.14
3046,41.1
3047,41.16
3048,41.29
3049,40.96
3050,40.96
3051,41.0
3052,40.88
3053,40.86
3054,40.98
3055,40.72
3056,40.04
3057,41.94
3058,41.53
3059,41.24
3060,41.35
3061,41.98
3062,42.62
3063,42.86
3064,43.0
3065,43.04
3066,42.9
3067,42.74
3068,42.86
3069,42.86
3070,42.78
3071,42.76
3072,42.78
3073,42.62
3074,42.48
3075,42.46
3076,42.38
3077,42.54
3078,42.56
3079,42.76
3080,42.7
3081,42.8
3082,42.92
3083,42.92
3084,42.94
3085,43.02
3086,43.0
3087,42.92
3088,42.98
3089,43.02
3090,43.02
3091,43.04
3092,43.04
3093,43.04
3094,43.02
3095,42.98
3096,42.96
3097,42.92
3098,42.86
3099,42.72
3100,42.68
3101,42.68
3102,42.6
3103,42.58
3104,42.58
3105,42.58
3106,42.58
3107,42.5
3108,42.6
3109,42.62
3110,42.48
3111,42.6
3112,42.44
3113,42.42
3114,42.46
3115,42.42
3116,42.38
3117,42.4
3118,42.38
3119,42.26
3120,42.38
3121,42.32
3122,42.22
3123,42.18
3124,42.4
3125,42.24
3126,42.24
3127,42.32
3128,42.42
3129,42.36
3130,42.36
3131,42.38
3132,42.36
3133,42.34
3134,42.52
3135,42.26
3136,42.42
3137,42.3
3138,42.24
3139,42.22
3140,42.12
3141,42.04
3142,41.94
3143,41.98
3144,41.94
3145,42.04
3146,41.92
3147,41.92
3148,41.85
3149,41.73
3150,41.63
3151,41.51
3152,41.51
3153,41.55
3154,41.57
3155,41.59
3156,41.59
3157,41.67
3158,41.71
3159,41.73
3160,41.65
3161,41.69
3162,41.69
3163,41.83
3164,41.73
3165,41.63
3166,41.79
3167,41.77
3168,41.92
3169,41.81
3170,41.69
3171,41.67
3172,41.63
3173,41.47
3174,41.37
3175,41.41
3176,41.27
3177,41.16
3178,41.0
3179,41.1
3180,41.22
3181,41.14
3182,41.14
3183,41.2
3184,41.22
3185,41.27
3186,41.04
3187,40.98
3188,40.94
3189,40.9
3190,40.9
3191,40.82
3192,40.8
3193,40.46
3194,41.9
3195,41.63
3196,41.2
3197,41.33
3198,42.0
3199,42.46
3200,42.9
3201,43.0
3202,42.9
3203,42.82
3204,42.8
3205,42.72
3206,42.84
3207,42.78
3208,42.76
3209,42.76
3210,42.6
3211,42.5
3212,42.36
3213,42.44
3214,42.54
3215,42.58
3216,42.72
3217,42.8
3218,42.84
3219,42.92
3220,42.88
3221,43.0
3222,43.04
3223,43.02
3224,43.04
3225,43.08
3226,43.02
3227,43.04
3228,43.04
3229,43.04
3230,43.02
3231,42.98
3232,43.23
3233,42.92
3234,43.0
3235,42.72
3236,42.7
3237,42.7
3238,42.58
3239,42.6
3240,42.58
3241,42.62
3242,42.6
3243,42.58
3244,42.58
3245,42.58
3246,42.64
3247,42.52
3248,42.58
3249,42.54
3250,42.48
3251,42.56
3252,42.4
3253,42.46
3254,42.38
3255,42.5
3256,42.4
3257,42.32
3258,42.38
3259,42.38
3260,42.16
3261,42.2
3262,42.36
3263,42.24
3264,42.32
3265,42.3
3266,42.34
3267,42.3
3268,42.28
3269,42.32
3270,42.34
3271,42.4
3272,42.4
3273,42.42
3274,42.4
3275,42.26
3276,42.26
3277,42.12
3278,42.04
3279,42.04
3280,41.96
3281,42.12
3282,41.96
3283,42.02
3284,41.9
3285,41.86
3286,41.81
3287,41.63
3288,41.53
3289,41.57
3290,41.61
3291,41.53
3292,41.55
3293,41.57
3294,41.73
3295,41.71
3296,41.69
3297,41.65
3298,41.59
3299,41.75
3300,41.79
3301,41.75
3302,41.73
3303,41.83
3304,41.81
3305,41.79
3306,41.77
3307,41.79
3308,41.75
3309,41.55
3310,41.51
3311,41.45
3312,41.39
3313,41.41
3314,41.2
3315,41.02
3316,41.08
3317,41.1
3318,41.12
3319,41.12
3320,41.18
3321,41.31
3322,41.24
3323,41.04
3324,41.02
3325,40.9
3326,40.9
3327,40.9
3328,41.0
3329,40.82
3330,40.52
3331,39.53
3332,41.83
3333,41.41
3334,41.27
3335,41.49
3336,41.96
3337,42.58
3338,42.76
3339,42.86
3340,42.84
3341,42.88
3342,42.68
3343,42.68
3344,42.74
3345,42.7
3346,42.68
3347,42.7
3348,42.56
3349,42.54
3350,42.46
3351,42.44
3352,42.56
3353,42.64
3354,42.66
3355,42.8
3356,42.92
3357,42.92
3358,42.9
3359,42.9
3360,43.06
3361,43.08
3362,43.04
3363,42.98
3364,43.0
3365,43.02
3366,43.04
3367,43.04
3368,43.02
3369,43.02
3370,42.94
3371,42.96
3372,42.86
3373,42.92
3374,42.8
3375,42.72
3376,42.6
3377,42.62
3378,42.56
3379,42.66
3380,42.6
3381,42.56
3382,42.6
3383,42.68
3384,42.58
3385,42.56
3386,42.54
3387,42.54
3388,42.64
3389,42.76
3390,42.46
3391,42.42
3392,42.42
3393,42.36
3394,42.42
3395,42.4
3396,42.38
3397,42.34
3398,42.22
3399,42.28
3400,42.14
3401,42.22
3402,42.3
3403,42.28
3404,42.38
3405,42.32
3406,42.28
3407,42.34
3408,42.36
3409,42.46
3410,42.4
3411,42.42
3412,42.34
3413,42.24
3414,42.3
3415,42.18
3416,42.06
3417,42.0
3418,42.04
3419,42.14
3420,42.12
3421,41.96
3422,42.0
3423,41.86
3424,41.79
3425,41.81
3426,41.61
3427,41.53
3428,41.59
3429,41.61
3430,41.47
3431,41.57
3432,41.63
3433,41.63
3434,41.65
3435,41.65
3436,41.69
3437,41.71
3438,41.85
3439,41.83
3440,41.79
3441,41.85
3442,41.83
3443,41.81
3444,41.79
3445,41.77
3446,41.71
3447,41.51
3448,41.49
3449,41.49
3450,41.43
3451,41.31
3452,41.22
3453,41.06
3454,41.1
3455,41.1
3456,41.1
3457,41.14
3458,41.2
3459,41.24
3460,41.14
3461,41.06
3462,40.92
3463,40.92
3464,40.9
3465,40.9
3466,40.94
3467,41.0
3468,40.58
3469,39.79
3470,41.88
3471,41.49
3472,41.14
3473,41.45
3474,41.83
3475,42.5
3476,42.72
3477,42.78
3478,42.74
3479,42.68
3480,42.64
3481,42.6
3482,42.54
3483,42.66
3484,42.62
3485,42.68
3486,42.52
3487,42.54
3488,42.5
3489,42.5
3490,42.46
3491,42.68
3492,42.7
3493,42.9
3494,42.98
3495,42.96
3496,42.96
3497,43.0
3498,43.0
3499,43.04
3500,42.98
3501,43.04
3502,43.02
3503,43.02
3504,42.98
3505,43.0
3506,43.13
3507,43.02
3508,43.02
3509,42.9
3510,42.9
3511,42.8
3512,42.76
3513,42.78
3514,42.64
3515,42.54
3516,42.7
3517,42.58
3518,42.58
3519,42.56
3520,42.52
3521,42.64
3522,42.62
3523,42.52
3524,42.52
3525,42.58
3526,42.54
3527,42.5
3528,42.3
3529,42.36
3530,42.34
3531,42.4
3532,42.42
3533,42.42
3534,42.36
3535,42.36
3536,42.22
3537,42.3
3538,42.28
3539,42.22
3540,42.24
3541,42.26
3542,42.26
3543,42.34
3544,42.38
3545,42.36
3546,42.44
3547,42.42
3548,42.44
3549,42.44
3550,42.42
3551,42.26
3552,42.26
3553,42.22
3554,42.08
3555,42.08
3556,42.0
3557,42.04
3558,42.1
3559,41.98
3560,41.88
3561,41.85
3562,41.86
3563,41.75
3564,41.55
3565,41.55
3566,41.59
3567,41.57
3568,41.55
3569,41.53
3570,41.53
3571,41.71
3572,41.59
3573,41.79
3574,41.75
3575,41.79
3576,41.81
3577,41.83
3578,41.81
3579,41.86
3580,41.85
3581,41.83
3582,41.81
3583,41.81
3584,41.75
3585,41.71
3586,41.65
3587,41.55
3588,41.35
3589,41.33
3590,41.22
3591,41.02
3592,41.04
3593,41.04
3594,41.08
3595,41.08
3596,41.12
3597,41.24
3598,41.04
3599,41.04
3600,41.04
3601,40.96
3602,40.9
3603,40.9
3604,40.9
3605,40.88
3606,40.72
3607,39.97
3608,41.9
3609,41.47
3610,41.22
3611,41.45
3612,41.9
3613,42.34
3614,42.62
3615,42.66
3616,42.64
3617,42.62
3618,42.6
3619,42.54
3620,42.58
3621,42.64
3622,42.62
3623,42.56
3624,42.54
3625,42.52
3626,42.5
3627,42.5
3628,42.52
3629,42.66
3630,42.84
3631,42.96
3632,42.86
3633,42.94
3634,42.98
3635,42.98
3636,43.0
3637,42.98
3638,42.88
3639,43.0
3640,43.06
3641,43.0
3642,42.98
3643,42.98
3644,43.0
3645,42.98
3646,43.02
3647,42.94
3648,42.84
3649,42.78
3650,42.76
3651,42.72
3652,42.7
3653,42.6
3654,42.7
3655,42.56
3656,42.58
3657,42.58
3658,42.58
3659,42.68
3660,42.64
3661,42.64
3662,42.5
3663,42.48
3664,42.46
3665,42.5
3666,42.38
3667,42.32
3668,42.4
3669,42.4
3670,42.44
3671,42.38
3672,42.36
3673,42.36
3674,42.3
3675,42.3
3676,42.24
3677,42.12
3678,42.26
3679,42.12
3680,42.22
3681,42.28
3682,42.34
3683,42.52
3684,42.46
3685,42.44
3686,42.36
3687,42.46
3688,42.38
3689,42.26
3690,42.26
3691,42.14
3692,42.14
3693,42.0
3694,42.0
3695,41.96
3696,41.92
3697,41.83
3698,41.83
3699,41.81
3700,41.81
3701,41.71
3702,41.65
3703,41.61
3704,41.61
3705,41.55
3706,41.55
3707,41.57
3708,41.55
3709,41.63
3710,41.65
3711,41.71
3712,41.73
3713,41.67
3714,41.79
3715,41.83
3716,41.83
3717,41.9
3718,41.94
3719,41.69
3720,41.75
3721,41.75
3722,41.71
3723,41.69
3724,41.65
3725,41.61
3726,41.47
3727,41.37
3728,41.22
3729,41.02
3730,41.02
3731,40.94
3732,41.0
3733,41.02
3734,40.92
3735,41.12
3736,41.16
3737,40.98
3738,40.96
3739,40.96
3740,40.9
3741,40.9
3742,40.92
3743,40.9
3744,40.7
3745,40.18
3746,41.88
3747,41.37
3748,40.92
3749,41.1
3750,41.69
3751,42.2
3752,42.48
3753,42.58
3754,42.6
3755,42.6
3756,42.54
3757,42.64
3758,42.56
3759,42.58
3760,42.58
3761,42.6
3762,42.58
3763,42.5
3764,42.5
3765,42.5
3766,42.62
3767,42.7
3768,42.86
3769,42.88
3770,42.86
3771,42.86
3772,42.94
3773,43.0
3774,42.96
3775,42.82
3776,42.82
3777,42.9
3778,42.9
3779,42.98
3780,42.92
3781,42.9
3782,42.88
3783,42.88
3784,42.92
3785,42.94
3786,42.8
3787,42.78
3788,42.78
3789,42.58
3790,42.58
3791,42.58
3792,42.82
3793,42.64
3794,42.62
3795,42.56
3796,42.7
3797,42.6
3798,42.56
3799,42.58
3800,42.44
3801,42.46
3802,42.36
3803,42.46
3804,42.42
3805,42.4
3806,42.36
3807,42.46
3808,42.46
3809,42.44
3810,42.28
3811,42.36
3812,42.32
3813,42.42
3814,42.14
3815,42.08
3816,42.32
3817,42.22
3818,42.3
3819,42.26
3820,42.24
3821,42.46
3822,42.52
3823,42.42
3824,42.4
3825,42.48
3826,42.48
3827,42.24
3828,42.26
3829,42.14
3830,42.0
3831,41.94
3832,41.96
3833,41.9
3834,41.9
3835,41.77
3836,41.88
3837,41.81
3838,41.75
3839,41.63
3840,41.61
3841,41.63
3842,41.69
3843,41.53
3844,41.51
3845,41.49
3846,41.51
3847,41.61
3848,41.59
3849,41.55
3850,41.67
3851,41.71
3852,41.81
3853,41.88
3854,41.83
3855,41.79
3856,41.86
3857,41.85
3858,41.81
3859,41.77
3860,41.75
3861,41.67
3862,41.57
3863,41.53
3864,41.53
3865,41.35
3866,41.16
3867,40.9
3868,40.88
3869,40.98
3870,40.86
3871,40.96
3872,41.04
3873,41.1
3874,41.12
3875,40.92
3876,40.94
3877,40.94
3878,40.9
3879,40.74
3880,40.9
3881,40.94
3882,40.84
3883,40.3
3884,42.0
3885,41.49
3886,41.1
3887,41.02
3888,41.47
3889,42.16
3890,42.4
3891,42.42
3892,42.48
3893,42.56
3894,42.52
3895,42.62
3896,42.62
3897,42.58
3898,42.58
3899,42.5
3900,42.54
3901,42.48
3902,42.42
3903,42.38
3904,42.58
3905,42.66
3906,43.0
3907,42.92
3908,42.96
3909,42.9
3910,42.98
3911,42.94
3912,42.86
3913,42.7
3914,42.7
3915,42.78
3916,42.86
3917,42.88
3918,42.96
3919,42.8
3920,42.86
3921,42.94
3922,42.9
3923,42.86
3924,42.74
3925,42.76
3926,42.68
3927,42.64
3928,42.58
3929,42.56
3930,42.64
3931,42.62
3932,42.62
3933,42.58
3934,42.54
3935,42.6
3936,42.52
3937,42.42
3938,42.46
3939,42.48
3940,42.38
3941,42.3
3942,42.4
3943,42.28
3944,42.36
3945,42.34
3946,42.36
3947,42.44
3948,42.28
3949,42.16
3950,42.22
3951,42.2
3952,42.32
3953,42.26
3954,42.22
3955,42.16
3956,42.22
3957,42.32
3958,42.3
3959,42.58
3960,42.44
3961,42.42
3962,42.42
3963,42.56
3964,42.38
3965,42.34
3966,42.22
3967,42.06
3968,41.9
3969,41.96
3970,41.94
3971,41.94
3972,41.88
3973,41.88
3974,41.98
3975,41.83
3976,41.61
3977,41.61
3978,41.49
3979,41.57
3980,41.55
3981,41.45
3982,41.41
3983,41.43
3984,41.59
3985,41.61
3986,41.53
3987,41.59
3988,41.41
3989,41.71
3990,41.67
3991,41.71
3992,41.79
3993,41.81
3994,41.71
3995,41.77
3996,41.67
3997,41.77
3998,41.77
3999,41.63
4000,41.55
4001,41.39
4002,41.43
4003,41.37
4004,41.22
4005,40.82
4006,40.86
4007,40.94
4008,40.84
4009,40.88
4010,40.94
4011,41.06
4012,41.0
4013,41.0
4014,41.0
4015,41.08
4016,40.8
4017,40.74
4018,40.88
4019,40.8
4020,40.8
4021,40.24
4022,41.86
4023,41.51
4024,40.9
4025,41.16
4026,41.41
4027,42.02
4028,42.26
4029,42.4
4030,42.54
4031,42.5
4032,42.56
4033,42.54
4034,42.54
4035,42.54
4036,42.58
4037,42.54
4038,42.42
4039,42.44
4040,42.34
4041,42.4
4042,42.54
4043,42.56
4044,42.72
4045,42.88
4046,42.92
4047,42.92
4048,42.92
4049,42.98
4050,42.88
4051,42.76
4052,42.8
4053,42.68
4054,42.76
4055,42.84
4056,42.88
4057,42.74
4058,42.66
4059,42.84
4060,42.82
4061,42.82
4062,42.82
4063,42.8
4064,42.7
4065,42.62
4066,42.62
4067,42.6
4068,42.56
4069,42.56
4070,42.54
4071,42.64
4072,42.56
4073,42.42
4074,42.42
4075,42.42
4076,42.44
4077,42.44
4078,42.2
4079,42.14
4080,42.2
4081,42.32
4082,42.32
4083,42.34
4084,42.18
4085,42.18
4086,42.2
4087,42.2
4088,42.16
4089,42.14
4090,42.08
4091,42.16
4092,42.14
4093,42.06
4094,42.08
4095,42.16
4096,42.28
4097,42.5
4098,42.5
4099,42.36
4100,42.22
4101,42.4
4102,42.3
4103,42.2
4104,42.12
4105,41.94
4106,41.83
4107,41.98
4108,41.92
4109,41.92
4110,41.92
4111,41.9
4112,41.86
4113,41.75
4114,41.71
4115,41.53
4116,41.53
4117,41.41
4118,41.43
4119,41.24
4120,41.39
4121,41.37
4122,41.47
4123,41.53
4124,41.37
4125,41.47
4126,41.43
4127,41.59
4128,41.57
4129,41.73
4130,41.55
4131,41.63
4132,41.67
4133,41.47
4134,41.63
4135,41.73
4136,41.73
4137,41.63
4138,41.55
4139,41.43
4140,41.41
4141,41.33
4142,41.18
4143,40.78
4144,40.7
4145,40.82
4146,40.8
4147,40.8
4148,40.92
4149,40.98
4150,40.98
4151,40.86
4152,40.98
4153,40.94
4154,40.96
4155,40.58
4156,40.7
4157,40.82
4158,40.76
4159,40.26
4160,39.65
4161,41.73
4162,41.31
4163,41.06
4164,41.18
4165,41.73
4166,41.96
4167,42.28
4168,42.44
4169,42.32
4170,42.56
4171,42.36
4172,42.54
4173,42.44
4174,42.58
4175,42.56
4176,42.54
4177,42.5
4178,42.52
4179,42.4
4180,42.42
4181,42.52
4182,42.62
4183,42.72
4184,42.78
4185,42.92
4186,42.98
4187,43.0
4188,42.96
4189,42.94
4190,42.9
4191,42.8
4192,42.76
4193,42.84
4194,42.96
4195,42.92
4196,42.86
4197,42.76
4198,42.78
4199,42.8
4200,42.8
4201,42.78
4202,42.8
4203,42.82
4204,42.8
4205,42.82
4206,42.58
4207,42.54
4208,42.54
4209,42.56
4210,42.6
4211,42.58
4212,42.48
4213,42.42
4214,42.42
4215,42.42
4216,42.38
4217,42.24
4218,42.2
4219,42.24
4220,42.24
4221,42.26
4222,42.3
4223,42.24
4224,42.24
4225,42.16
4226,42.16
4227,42.16
4228,42.14
4229,42.08
4230,42.16
4231,42.24
4232,42.12
4233,42.1
4234,42.12
4235,42.32
4236,42.36
4237,42.4
4238,42.36
4239,42.36
4240,42.3
4241,42.3
4242,42.1
4243,42.18
4244,42.1
4245,41.94
4246,42.0
4247,42.0
4248,42.0
4249,41.94
4250,41.92
4251,41.79
4252,41.77
4253,41.73
4254,41.63
4255,41.53
4256,41.49
4257,41.41
4258,41.29
4259,41.39
4260,41.43
4261,41.53
4262,41.45
4263,41.47
4264,41.45
4265,41.51
4266,41.61
4267,41.55
4268,41.63
4269,41.57
4270,41.71
4271,41.67
4272,41.65
4273,41.69
4274,41.75
4275,41.67
4276,41.51
4277,41.57
4278,41.55
4279,41.47
4280,41.33
4281,41.1
4282,40.9
4283,40.9
4284,40.8
4285,40.74
4286,40.86
4287,40.9
4288,41.0
4289,41.02
4290,40.96
4291,40.82
4292,40.92
4293,40.88
4294,40.74
4295,40.84
4296,41.06
4297,40.84
4298,40.44
4299,39.95
4300,41.85
4301,41.39
4302,41.2
4303,41.33
4304,41.75
4305,42.2
4306,42.54
4307,42.56
4308,42.46
4309,42.6
4310,42.44
4311,42.56
4312,42.58
4313,42.8
4314,42.66
4315,42.64
4316,42.56
4317,42.46
4318,42.46
4319,42.48
4320,42.56
4321,42.6
4322,42.74
4323,42.82
4324,42.94
4325,42.94
4326,42.98
4327,42.86
4328,42.94
4329,42.92
4330,42.82
4331,42.86
4332,42.88
4333,42.96
4334,42.88
4335,42.8
4336,42.8
4337,42.74
4338,42.72
4339,42.76
4340,42.8
4341,42.8
4342,42.78
4343,42.62
4344,42.68
4345,42.68
4346,42.62
4347,42.46
4348,42.62
4349,42.6
4350,42.58
4351,42.58
4352,42.4
4353,42.4
4354,42.54
4355,42.38
4356,42.28
4357,42.3
4358,42.22
4359,42.22
4360,42.32
4361,42.34
4362,42.32
4363,42.3
4364,42.2
4365,42.14
4366,42.12
4367,42.1
4368,42.12
4369,42.06
4370,42.14
4371,42.12
4372,42.12
4373,42.22
4374,42.24
4375,42.34
4376,42.32
4377,42.34
4378,42.34
4379,42.34
4380,42.3
4381,42.18
4382,42.06
4383,42.1
4384,41.98
4385,42.02
4386,42.04
4387,42.04
4388,42.06
4389,41.96
4390,41.83
4391,41.77
4392,41.77
4393,41.53
4394,41.61
4395,41.63
4396,41.63
4397,41.47
4398,41.29
4399,41.43
4400,41.47
4401,41.51
4402,41.53
4403,41.51
4404,41.49
4405,41.57
4406,41.65
4407,41.67
4408,41.67
4409,41.73
4410,41.69
4411,41.71
4412,41.61
4413,41.73
4414,41.69
4415,41.67
4416,41.65
4417,41.61
4418,41.49
4419,41.39
4420,41.24
4421,41.0
4422,40.94
4423,40.94
4424,40.92
4425,40.98
4426,40.9
4427,40.98
4428,41.04
4429,41.06
4430,40.94
4431,41.0
4432,40.94
4433,40.88
4434,40.92
4435,40.86
4436,40.98
4437,40.74
4438,40.3
4439,41.9
4440,41.37
4441,41.06
4442,41.35
4443,41.69
4444,42.2
4445,42.46
4446,42.56
4447,42.54
4448,42.54
4449,42.54
4450,42.5
4451,42.6
4452,42.66
4453,42.64
4454,42.6
4455,42.54
4456,42.5
4457,42.42
4458,42.44
4459,42.4
4460,42.6
4461,42.74
4462,42.76
4463,42.88
4464,42.88
4465,42.94
4466,42.9
4467,42.92
4468,42.88
4469,42.82
4470,42.86
4471,42.82
4472,42.82
4473,42.88
4474,42.74
4475,42.72
4476,42.64
4477,42.76
4478,42.76
4479,42.8
4480,42.8
4481,42.72
4482,42.76
4483,42.72
4484,42.62
4485,42.58
4486,42.38
4487,42.58
4488,42.58
4489,42.5
4490,42.46
4491,42.38
4492,42.34
4493,42.54
4494,42.26
4495,42.28
4496,42.22
4497,42.24
4498,42.3
4499,42.3
4500,42.26
4501,42.3
4502,42.26
4503,42.22
4504,42.2
4505,42.1
4506,42.04
4507,42.08
4508,42.04
4509,42.16
4510,42.14
4511,42.2
4512,42.2
4513,42.22
4514,42.2
4515,42.34
4516,42.34
4517,42.34
4518,42.3
4519,42.32
4520,42.06
4521,42.1
4522,42.04
4523,42.08
4524,42.08
4525,41.94
4526,42.04
4527,41.94
4528,41.86
4529,41.9
4530,41.83
4531,41.63
4532,41.61
4533,41.53
4534,41.55
4535,41.57
4536,41.45
4537,41.41
4538,41.45
4539,41.45
4540,41.49
4541,41.57
4542,41.51
4543,41.49
4544,41.61
4545,41.63
4546,41.65
4547,41.67
4548,41.75
4549,41.71
4550,41.67
4551,41.73
4552,41.71
4553,41.71
4554,41.65
4555,41.53
4556,41.57
4557,41.49
4558,41.29
4559,41.1
4560,40.9
4561,40.96
4562,40.92
4563,40.82
4564,40.92
4565,40.86
4566,41.08
4567,41.1
4568,41.08
4569,41.02
4570,41.04
4571,41.0
4572,40.88
4573,40.86
4574,40.92
4575,40.98
4576,40.64
4577,40.36
4578,41.94
4579,41.47
4580,41.12
4581,41.22
4582,41.65
4583,41.98
4584,42.46
4585,42.5
4586,42.56
4587,42.52
4588,42.46
4589,42.5
4590,42.6
4591,42.58
4592,42.64
4593,42.56
4594,42.52
4595,42.4
4596,42.3
4597,42.48
4598,42.44
4599,42.66
4600,42.72
4601,42.78
4602,42.82
4603,42.88
4604,42.98
4605,42.84
4606,42.96
4607,42.88
4608,42.78
4609,42.78
4610,42.8
4611,42.82
4612,42.7
4613,42.72
4614,42.62
4615,42.68
4616,42.76
4617,42.72
4618,42.8
4619,42.8
4620,42.78
4621,42.7
4622,42.66
4623,42.64
4624,42.6
4625,42.58
4626,42.62
4627,42.62
4628,42.4
4629,42.5
4630,42.4
4631,42.32
4632,42.36
4633,42.32
4634,42.26
4635,42.24
4636,42.14
4637,42.28
4638,42.3
4639,42.28
4640,42.3
4641,42.3
4642,42.24
4643,42.2
4644,42.18
4645,42.06
4646,42.08
4647,42.06
4648,42.08
4649,42.14
4650,42.22
4651,42.22
4652,42.14
4653,42.2
4654,42.28
4655,42.42
4656,42.56
4657,42.28
4658,42.22
4659,42.2
4660,42.1
4661,42.0
4662,41.98
4663,41.88
4664,41.94
4665,41.94
4666,41.88
4667,41.88
4668,41.83
4669,41.77
4670,41.59
4671,41.57
4672,41.51
4673,41.31
4674,41.47
4675,41.47
4676,41.45
4677,41.39
4678,41.45
4679,41.47
4680,41.47
4681,41.47
4682,41.57
4683,41.59
4684,41.55
4685,41.59
4686,41.63
4687,41.71
4688,41.71
4689,41.63
4690,41.67
4691,41.69
4692,41.65
4693,41.63
4694,41.51
4695,41.55
4696,41.63
4697,41.31
4698,41.24
4699,40.98
4700,41.0
4701,40.88
4702,40.84
4703,40.84
4704,40.86
4705,40.96
4706,41.02
4707,41.08
4708,41.0
4709,41.02
4710,40.94
4711,40.72
4712,40.74
4713,40.82
4714,40.84
4715,40.78
4716,40.4
4717,41.77
4718,41.45
4719,41.14
4720,41.1
4721,41.45
4722,42.18
4723,42.56
4724,42.56
4725,42.5
4726,42.38
4727,42.48
4728,42.52
4729,42.58
4730,42.58
4731,42.56
4732,42.58
4733,42.54
4734,42.38
4735,42.34
4736,42.34
4737,42.42
4738,42.5
4739,42.62
4740,42.5
4741,42.74
4742,42.92
4743,42.94
4744,42.8
4745,42.82
4746,42.84
4747,42.64
4748,42.76
4749,42.78
4750,42.98
4751,42.8
4752,42.64
4753,42.62
4754,42.56
4755,42.62
4756,42.68
4757,42.7
4758,42.64
4759,42.66
4760,42.6
4761,42.46
4762,42.66
4763,42.64
4764,42.58
4765,42.58
4766,42.46
4767,42.4
4768,42.32
4769,42.32
4770,42.28
4771,42.3
4772,42.3
4773,42.16
4774,42.22
4775,42.1
4776,42.24
4777,42.32
4778,42.44
4779,42.28
4780,42.34
4781,42.22
4782,42.18
4783,42.18
4784,42.08
4785,42.1
4786,42.1
4787,42.1
4788,42.16
4789,42.1
4790,42.2
4791,42.14
4792,42.16
4793,42.24
4794,42.26
4795,42.28
4796,42.22
4797,42.18
4798,42.1
4799,42.1
4800,42.0
4801,42.02
4802,41.96
4803,41.88
4804,41.88
4805,41.85
4806,41.85
4807,41.71
4808,41.71
4809,41.61
4810,41.55
4811,41.37
4812,41.47
4813,41.37
4814,41.43
4815,41.45
4816,41.43
4817,41.45
4818,41.45
4819,41.45
4820,41.47
4821,41.43
4822,41.43
4823,41.55
4824,41.55
4825,41.57
4826,41.69
4827,41.59
4828,41.55
4829,41.45
4830,41.59
4831,41.59
4832,41.47
4833,41.53
4834,41.53
4835,41.47
4836,41.31
4837,41.18
4838,41.04
4839,41.02
4840,40.9
4841,40.72
4842,40.88
4843,40.96
4844,40.98
4845,41.08
4846,40.98
4847,40.96
4848,40.94
4849,40.88
4850,40.78
4851,40.76
4852,40.84
4853,40.9
4854,40.72
4855,40.62
4856,39.63
4857,41.73
4858,41.31
4859,41.1
4860,41.16
4861,41.45
4862,42.1
4863,42.4
4864,42.54
4865,42.56
4866,42.42
4867,42.42
4868,42.48
4869,42.52
4870,42.66
4871,42.58
4872,42.52
4873,42.46
4874,42.26
4875,42.2
4876,42.32
4877,42.3
4878,42.4
4879,42.64
4880,42.68
4881,42.94
4882,42.84
4883,42.96
4884,42.84
4885,42.88
4886,42.76
4887,42.72
4888,42.66
4889,42.7
4890,42.82
4891,42.76
4892,42.64
4893,42.56
4894,42.6
4895,42.56
4896,42.54
4897,42.7
4898,42.64
4899,42.62
4900,42.64
4901,42.6
4902,42.54
4903,42.5
4904,42.46
4905,42.38
4906,42.32
4907,42.32
4908,42.36
4909,42.2
4910,42.2
4911,42.22
4912,42.2
4913,42.2
4914,42.22
4915,42.28
4916,42.16
4917,42.34
4918,42.28
4919,42.24
4920,42.24
4921,42.16
4922,42.16
4923,42.08
4924,42.14
4925,42.06
4926,42.14
4927,42.14
4928,42.2
4929,42.2
4930,42.2
4931,42.18
4932,42.22
4933,42.24
4934,42.22
4935,42.24
4936,42.2
4937,42.22
4938,42.14
4939,42.06
4940,41.92
4941,41.86
4942,41.88
4943,41.85
4944,41.86
4945,41.85
4946,41.71
4947,41.67
4948,41.61
4949,41.61
4950,41.55
4951,41.51
4952,41.45
4953,41.45
4954,41.43
4955,41.43
4956,41.39
4957,41.43
4958,41.35
4959,41.39
4960,41.37
4961,41.33
4962,41.43
4963,41.45
4964,41.43
4965,41.49
4966,41.49
4967,41.47
4968,41.55
4969,41.51
4970,41.57
4971,41.57
4972,41.45
4973,41.37
4974,41.37
4975,41.35
4976,41.37
4977,41.22
4978,41.0
4979,41.14
4980,41.02
4981,40.82
4982,40.86
4983,40.94
4984,40.98
4985,41.18
4986,40.96
4987,40.84
4988,40.84
4989,40.78
4990,40.8
4991,40.9
4992,40.9
4993,40.8
4994,40.82
4995,40.64
4996,39.77
4997,41.61
4998,41.43
4999,41.12
5000,41.12
5001,41.47
5002,42.0
5003,42.26
5004,42.38
5005,42.32
5006,42.46
5007,42.42
5008,42.48
5009,42.4
5010,42.46
5011,42.48
5012,42.48
5013,42.3
5014,42.26
5015,42.22
5016,42.28
5017,42.38
5018,42.46
5019,42.56
5020,42.6
5021,42.74
5022,42.9
5023,42.88
5024,42.96
5025,42.76
5026,42.78
5027,42.62
5028,42.62
5029,42.66
5030,42.62
5031,42.84
5032,42.54
5033,42.48
5034,42.52
5035,42.58
5036,42.68
5037,42.7
5038,42.5
5039,42.62
5040,42.64
5041,42.38
5042,42.42
5043,42.44
5044,42.32
5045,42.24
5046,42.32
5047,42.22
5048,42.16
5049,42.16
5050,42.2
5051,42.08
5052,42.14
5053,42.14
5054,42.18
5055,42.0
5056,42.26
5057,42.22
5058,42.24
5059,42.28
5060,42.14
5061,42.12
5062,42.08
5063,42.22
5064,42.04
5065,42.08
5066,42.16
5067,42.12
5068,42.26
5069,42.18
5070,42.18
5071,42.06
5072,42.14
5073,42.18
5074,42.14
5075,42.18
5076,42.16
5077,42.14
5078,42.04
5079,42.02
5080,41.92
5081,41.85
5082,41.79
5083,41.71
5084,41.85
5085,41.96
5086,41.65
5087,41.77
5088,41.65
5089,41.53
5090,41.55
5091,41.51
5092,41.41
5093,41.45
5094,41.45
5095,41.35
5096,41.39
5097,41.31
5098,41.37
5099,41.37
5100,41.37
5101,41.35
5102,41.33
5103,41.39
5104,41.47
5105,41.37
5106,41.49
5107,41.49
5108,41.47
5109,41.53
5110,41.57
5111,41.45
5112,41.39
5113,41.43
5114,41.39
5115,41.45
5116,41.45
5117,41.24
5118,41.14
5119,41.1
5120,41.02
5121,40.96
5122,40.86
5123,40.94
5124,40.94
5125,40.92
5126,40.82
5127,40.84
5128,40.84
5129,40.84
5130,40.76
5131,40.84
5132,40.92
5133,40.84
5134,40.78
5135,40.56
5136,40.0
5137,41.1
5138,41.31
5139,41.14
5140,41.24
5141,41.49
5142,41.81
5143,42.04
5144,42.28
5145,42.24
5146,42.28
5147,42.32
5148,42.34
5149,42.46
5150,42.46
5151,42.44
5152,42.36
5153,42.26
5154,42.18
5155,42.14
5156,42.18
5157,42.26
5158,42.42
5159,42.6
5160,42.6
5161,42.7
5162,42.78
5163,42.78
5164,42.7
5165,42.7
5166,42.62
5167,42.46
5168,42.36
5169,42.42
5170,42.48
5171,42.64
5172,42.66
5173,42.28
5174,42.38
5175,42.6
5176,42.6
5177,42.44
5178,42.44
5179,42.44
5180,42.34
5181,42.26
5182,42.28
5183,42.24
5184,42.14
5185,42.3
5186,42.22
5187,42.1
5188,42.12
5189,42.12
5190,42.06
5191,42.24
5192,42.02
5193,41.94
5194,42.1
5195,42.06
5196,42.04
5197,42.1
5198,42.24
5199,42.22
5200,42.06
5201,42.04
5202,42.06
5203,42.02
5204,42.02
5205,41.96
5206,42.04
5207,42.1
5208,41.96
5209,42.12
5210,42.08
5211,41.98
5212,42.06
5213,42.0
5214,42.1
5215,42.14
5216,42.04
5217,41.94
5218,41.94
5219,41.96
5220,41.75
5221,41.69
5222,41.61
5223,41.63
5224,41.73
5225,41.65
5226,41.65
5227,41.63
5228,41.57
5229,41.53
5230,41.59
5231,41.45
5232,41.37
5233,41.33
5234,41.33
5235,41.31
5236,41.22
5237,41.2
5238,41.18
5239,41.24
5240,41.31
5241,41.27
5242,41.35
5243,41.33
5244,41.39
5245,41.37
5246,41.41
5247,41.45
5248,41.41
5249,41.43
5250,41.57
5251,41.53
5252,41.49
5253,41.41
5254,41.59
5255,41.53
5256,41.35
5257,41.31
5258,41.14
5259,41.16
5260,41.0
5261,40.78
5262,40.9
5263,40.9
5264,40.9
5265,41.0
5266,40.92
5267,40.88
5268,40.88
5269,40.76
5270,40.8
5271,40.78
5272,40.66
5273,40.84
5274,40.68
5275,40.5
5276,39.89
5277,41.06
5278,41.45
5279,41.14
5280,41.14
5281,41.29
5282,41.75
5283,42.18
5284,42.2
5285,42.26
5286,42.14
5287,42.24
5288,42.32
5289,42.4
5290,42.44
5291,42.36
5292,42.34
5293,42.22
5294,42.16
5295,41.96
5296,42.0
5297,42.22
5298,42.4
5299,42.5
5300,42.56
5301,42.58
5302,42.64
5303,42.72
5304,42.64
5305,42.62
5306,42.62
5307,42.52
5308,42.22
5309,42.52
5310,42.52
5311,42.58
5312,42.5
5313,42.44
5314,42.42
5315,42.56
5316,42.6
5317,42.44
5318,42.32
5319,42.32
5320,42.24
5321,42.24
5322,42.08
5323,42.16
5324,42.22
5325,42.2
5326,42.18
5327,42.06
5328,42.16
5329,42.14
5330,42.0
5331,42.16
5332,42.12
5333,42.02
5334,42.0
5335,42.04
5336,42.12
5337,41.98
5338,42.06
5339,41.94
5340,42.12
5341,41.94
5342,41.94
5343,41.94
5344,41.94
5345,41.92
5346,42.0
5347,42.06
5348,41.88
5349,42.0
5350,41.94
5351,41.92
5352,41.92
5353,42.0
5354,42.22
5355,41.98
5356,41.98
5357,41.98
5358,41.94
5359,41.94
5360,41.79
5361,41.65
5362,41.53
5363,41.65
5364,41.71
5365,41.69
5366,41.49
5367,41.55
5368,41.51
5369,41.49
5370,41.41
5371,41.43
5372,41.29
5373,41.39
5374,41.27
5375,41.22
5376,41.16
5377,41.22
5378,41.16
5379,41.24
5380,41.16
5381,41.12
5382,41.29
5383,41.27
5384,41.37
5385,41.39
5386,41.31
5387,41.47
5388,41.41
5389,41.43
5390,41.61
5391,41.61
5392,41.45
5393,41.55
5394,41.65
5395,41.65
5396,41.55
5397,41.55
5398,41.35
5399,41.33
5400,41.16
5401,40.96
5402,40.9
5403,40.82
5404,40.94
5405,41.0
5406,40.86
5407,40.92
5408,40.96
5409,40.8
5410,40.78
5411,40.78
5412,40.72
5413,40.78
5414,40.64
5415,40.64
5416,39.77
5417,41.35
5418,41.51
5419,41.08
5420,41.2
5421,41.49
5422,41.85
5423,42.16
5424,42.34
5425,42.28
5426,42.14
5427,42.28
5428,42.34
5429,42.36
5430,42.34
5431,42.34
5432,42.3
5433,42.2
5434,42.16
5435,41.98
5436,42.18
5437,42.26
5438,42.38
5439,42.62
5440,42.56
5441,42.66
5442,42.64
5443,42.68
5444,42.66
5445,42.62
5446,42.54
5447,42.36
5448,42.42
5449,42.48
5450,42.54
5451,42.54
5452,42.54
5453,42.44
5454,42.44
5455,42.52
5456,42.5
5457,42.46
5458,42.42
5459,42.18
5460,42.24
5461,42.22
5462,42.1
5463,42.22
5464,42.2
5465,42.18
5466,42.06
5467,42.16
5468,42.16
5469,42.1
5470,42.08
5471,42.0
5472,41.96
5473,42.02
5474,42.06
5475,42.08
5476,42.02
5477,42.06
5478,42.06
5479,41.98
5480,42.02
5481,41.94
5482,41.94
5483,42.0
5484,41.96
5485,41.92
5486,41.96
5487,42.06
5488,41.94
5489,41.98
5490,41.92
5491,41.79
5492,41.96
5493,42.02
5494,42.02
5495,41.98
5496,41.96
5497,42.08
5498,41.94
5499,41.94
5500,41.83
5501,41.67
5502,41.67
5503,41.69
5504,41.73
5505,41.67
5506,41.55
5507,41.57
5508,41.61
5509,41.51
5510,41.31
5511,41.35
5512,41.24
5513,41.27
5514,41.2
5515,41.22
5516,41.12
5517,41.14
5518,41.18
5519,41.24
5520,41.16
5521,41.24
5522,41.31
5523,41.31
5524,41.31
5525,41.35
5526,41.47
5527,41.31
5528,41.37
5529,41.51
5530,41.71
5531,41.69
5532,41.75
5533,41.71
5534,41.73
5535,41.73
5536,41.77
5537,41.57
5538,41.37
5539,41.31
5540,41.31
5541,41.1
5542,40.94
5543,40.86
5544,40.9
5545,40.94
5546,41.0
5547,40.9
5548,40.92
5549,40.84
5550,40.78
5551,40.76
5552,40.7
5553,40.74
5554,40.64
5555,40.58
5556,40.12
5557,41.33
5558,41.57
5559,41.29
5560,41.1
5561,41.31
5562,41.75
5563,42.24
5564,42.28
5565,42.38
5566,42.34
5567,42.34
5568,42.34
5569,42.38
5570,42.48
5571,42.32
5572,42.34
5573,42.24
5574,42.16
5575,42.1
5576,42.16
5577,42.28
5578,42.5
5579,42.46
5580,42.62
5581,42.72
5582,42.7
5583,42.74
5584,42.66
5585,42.64
5586,42.64
5587,42.36
5588,42.46
5589,42.52
5590,42.54
5591,42.54
5592,42.52
5593,42.48
5594,42.46
5595,42.52
5596,42.5
5597,42.52
5598,42.64
5599,42.5
5600,42.3
5601,42.32
5602,42.16
5603,42.2
5604,42.1
5605,42.1
5606,42.14
5607,42.14
5608,42.16
5609,42.06
5610,42.0
5611,42.1
5612,41.98
5613,42.06
5614,42.06
5615,42.08
5616,42.06
5617,42.12
5618,42.04
5619,42.08
5620,42.1
5621,42.0
5622,41.98
5623,42.0
5624,42.06
5625,41.98
5626,41.98
5627,42.18
5628,41.9
5629,42.0
5630,41.9
5631,41.94
5632,41.96
5633,41.98
5634,41.9
5635,41.96
5636,42.1
5637,42.04
5638,41.98
5639,41.98
5640,41.83
5641,41.69
5642,41.65
5643,41.69
5644,41.79
5645,41.71
5646,41.57
5647,41.75
5648,41.63
5649,41.57
5650,41.47
5651,41.39
5652,41.27
5653,41.51
5654,41.29
5655,41.22
5656,41.24
5657,41.24
5658,41.18
5659,41.08
5660,41.33
5661,41.18
5662,41.2
5663,41.35
5664,41.35
5665,41.49
5666,41.45
5667,41.45
5668,41.53
5669,41.53
5670,41.75
5671,41.83
5672,41.85
5673,42.06
5674,41.92
5675,41.85
5676,41.92
5677,41.67
5678,41.61
5679,41.57
5680,41.33
5681,41.24
5682,41.04
5683,40.96
5684,41.0
5685,40.88
5686,40.9
5687,40.88
5688,41.0
5689,40.86
5690,40.84
5691,40.9
5692,40.72
5693,40.72
5694,40.7
5695,40.6
5696,40.38
5697,39.57
5698,41.49
5699,41.51
5700,41.06
5701,41.16
5702,41.37
5703,41.81
5704,42.08
5705,42.36
5706,42.38
5707,42.34
5708,42.3
5709,42.34
5710,42.36
5711,42.36
5712,42.36
5713,42.28
5714,42.24
5715,42.16
5716,41.94
5717,42.22
5718,42.28
5719,42.32
5720,42.54
5721,42.68
5722,42.74
5723,42.68
5724,42.78
5725,42.66
5726,42.62
5727,42.58
5728,42.44
5729,42.54
5730,42.48
5731,42.38
5732,42.58
5733,42.54
5734,42.5
5735,42.48
5736,42.5
5737,42.5
5738,42.52
5739,42.74
5740,42.48
5741,42.34
5742,42.3
5743,42.14
5744,42.18
5745,42.18
5746,42.12
5747,42.2
5748,42.16
5749,42.14
5750,42.04
5751,42.02
5752,42.0
5753,42.04
5754,42.08
5755,42.06
5756,42.12
5757,42.14
5758,42.14
5759,42.18
5760,42.16
5761,42.18
5762,42.04
5763,42.02
5764,42.04
5765,42.08
5766,42.16
5767,41.98
5768,42.02
5769,41.79
5770,42.0
5771,41.94
5772,41.98
5773,42.04
5774,42.02
5775,41.94
5776,42.02
5777,42.06
5778,42.08
5779,42.14
5780,41.92
5781,41.9
5782,41.73
5783,41.73
5784,41.65
5785,41.73
5786,41.57
5787,41.67
5788,41.59
5789,41.55
5790,41.57
5791,41.47
5792,41.41
5793,41.27
5794,41.35
5795,41.31
5796,41.37
5797,41.27
5798,41.24
5799,41.29
5800,41.33
5801,41.33
5802,41.27
5803,41.29
5804,41.29
5805,41.39
5806,41.49
5807,41.67
5808,41.55
5809,41.49
5810,41.59
5811,41.71
5812,41.77
5813,41.9
5814,42.0
5815,42.04
5816,41.98
5817,41.85
5818,41.79
5819,41.65
5820,41.55
5821,41.51
5822,41.22
5823,40.96
5824,41.04
5825,40.96
5826,40.9
5827,40.86
5828,40.88
5829,40.9
5830,40.88
5831,40.9
5832,40.78
5833,40.74
5834,40.68
5835,40.64
5836,40.54
5837,40.3
5838,39.73
5839,41.51
5840,41.73
5841,41.18
5842,41.24
5843,41.37
5844,41.81
5845,42.3
5846,42.3
5847,42.34
5848,42.32
5849,42.32
5850,42.36
5851,42.34
5852,42.4
5853,42.38
5854,42.26
5855,42.18
5856,42.16
5857,42.08
5858,42.12
5859,42.32
5860,42.4
5861,42.5
5862,42.48
5863,42.78
5864,42.78
5865,42.78
5866,42.78
5867,42.8
5868,42.58
5869,42.56
5870,42.52
5871,42.5
5872,42.52
5873,42.46
5874,42.44
5875,42.46
5876,42.44
5877,42.46
5878,42.44
5879,42.48
5880,42.6
5881,42.34
5882,42.36
5883,42.22
5884,42.22
5885,42.16
5886,42.06
5887,42.06
5888,42.18
5889,42.18
5890,42.2
5891,42.1
5892,42.08
5893,42.08
5894,42.06
5895,42.04
5896,42.14
5897,42.14
5898,42.12
5899,42.2
5900,42.22
5901,42.26
5902,42.2
5903,42.12
5904,42.0
5905,42.18
5906,42.14
5907,41.96
5908,42.08
5909,42.06
5910,42.02
5911,42.0
5912,42.04
5913,42.02
5914,42.12
5915,41.94
5916,41.98
5917,42.04
5918,42.06
5919,42.08
5920,42.08
5921,41.96
5922,41.83
5923,41.79
5924,41.83
5925,41.77
5926,41.85
5927,41.61
5928,41.53
5929,41.65
5930,41.69
5931,41.59
5932,41.69
5933,41.51
5934,41.49
5935,41.35
5936,41.37
5937,41.33
5938,41.2
5939,41.27
5940,41.29
5941,41.31
5942,41.31
5943,41.39
5944,41.39
5945,41.31
5946,41.43
5947,41.49
5948,41.57
5949,41.57
5950,41.53
5951,41.57
5952,41.67
5953,41.85
5954,41.92
5955,41.96
5956,42.04
5957,42.0
5958,41.98
5959,41.79
5960,41.77
5961,41.65
5962,41.41
5963,41.33
5964,41.18
5965,41.18
5966,41.06
5967,40.96
5968,41.04
5969,40.86
5970,41.02
5971,40.94
5972,40.86
5973,40.94
5974,40.72
5975,40.76
5976,40.54
5977,40.76
5978,40.52
5979,39.97
5980,41.51
5981,41.51
5982,41.16
5983,41.2
5984,41.31
5985,41.81
5986,42.2
5987,42.42
5988,42.4
5989,42.32
5990,42.34
5991,42.34
5992,42.42
5993,42.4
5994,42.42
5995,42.34
5996,42.2
5997,42.18
5998,42.02
5999,42.2
6000,42.3
6001,42.48
6002,42.52
6003,42.54
6004,42.62
6005,42.8
6006,42.88
6007,42.68
6008,42.86
6009,42.78
6010,42.64
6011,42.56
6012,42.54
6013,42.54
6014,42.62
6015,42.38
6016,42.48
6017,42.46
6018,42.48
6019,42.3
6020,42.54
6021,42.56
6022,42.38
6023,42.3
6024,42.08
6025,42.2
6026,42.06
6027,42.08
6028,42.16
6029,42.16
6030,42.26
6031,42.26
6032,42.3
6033,42.06
6034,42.22
6035,42.04
6036,42.06
6037,42.12
6038,42.2
6039,42.22
6040,42.18
6041,42.14
6042,42.28
6043,42.26
6044,42.14
6045,42.26
6046,42.36
6047,42.2
6048,42.18
6049,42.08
6050,42.1
6051,42.08
6052,42.04
6053,42.16
6054,41.92
6055,41.94
6056,41.85
6057,41.94
6058,42.02
6059,42.04
6060,42.1
6061,42.04
6062,42.04
6063,42.04
6064,41.9
6065,41.83
6066,41.85
6067,41.83
6068,41.75
6069,41.71
6070,41.69
6071,41.69
6072,41.69
6073,41.53
6074,41.59
6075,41.35
6076,41.43
6077,41.43
6078,41.39
6079,41.18
6080,41.22
6081,41.33
6082,41.35
6083,41.37
6084,41.37
6085,41.43
6086,41.61
6087,41.47
6088,41.45
6089,41.59
6090,41.63
6091,41.53
6092,41.55
6093,41.73
6094,41.86
6095,41.96
6096,41.98
6097,42.08
6098,42.0
6099,41.98
6100,41.98
6101,41.81
6102,41.73
6103,41.57
6104,41.35
6105,41.31
6106,41.02
6107,41.06
6108,41.02
6109,40.76
6110,40.9
6111,40.98
6112,41.0
6113,40.86
6114,40.86
6115,40.74
6116,40.8
6117,40.78
6118,40.64
6119,40.4
6120,39.89
6121,41.73
6122,41.47
6123,41.29
6124,41.2
6125,41.22
6126,41.85
6127,42.24
6128,42.36
6129,42.42
6130,42.38
6131,42.4
6132,42.52
6133,42.42
6134,42.4
6135,42.34
6136,42.38
6137,42.2
6138,42.22
6139,42.08
6140,42.16
6141,42.36
6142,42.48
6143,42.56
6144,42.58
6145,42.64
6146,42.76
6147,42.84
6148,42.78
6149,42.92
6150,42.68
6151,42.64
6152,42.5
6153,42.54
6154,42.62
6155,42.64
6156,42.62
6157,42.5
6158,42.46
6159,42.54
6160,42.46
6161,42.52
6162,42.46
6163,42.4
6164,42.34
6165,42.28
6166,42.24
6167,42.2
6168,42.16
6169,42.16
6170,42.3
6171,42.26
6172,42.36
6173,42.2
6174,42.28
6175,42.16
6176,42.06
6177,42.14
6178,42.12
6179,42.22
6180,42.28
6181,42.58
6182,42.6
6183,42.3
6184,42.26
6185,42.2
6186,42.3
6187,42.22
6188,42.16
6189,42.14
6190,42.18
6191,42.12
6192,41.98
6193,42.1
6194,42.08
6195,41.98
6196,42.0
6197,41.83
6198,42.04
6199,42.02
6200,42.08
6201,42.06
6202,42.0
6203,42.0
6204,41.94
6205,41.92
6206,41.92
6207,42.0
6208,41.85
6209,41.77
6210,41.81
6211,41.75
6212,41.73
6213,41.65
6214,41.59
6215,41.57
6216,41.53
6217,41.47
6218,41.47
6219,41.43
6220,41.22
6221,41.27
6222,41.29
6223,41.35
6224,41.35
6225,41.35
6226,41.41
6227,41.57
6228,41.57
6229,41.49
6230,41.55
6231,41.65
6232,41.59
6233,41.69
6234,41.71
6235,41.88
6236,41.98
6237,42.02
6238,42.02
6239,42.04
6240,42.04
6241,41.98
6242,41.94
6243,41.79
6244,41.69
6245,41.29
6246,41.22
6247,41.08
6248,41.02
6249,41.04
6250,40.84
6251,40.92
6252,40.96
6253,40.86
6254,40.86
6255,40.84
6256,40.86
6257,40.82
6258,40.66
6259,40.72
6260,40.62
6261,40.22
6262,41.73
6263,41.69
6264,41.35
6265,41.14
6266,41.16
6267,41.94
6268,42.14
6269,42.26
6270,42.36
6271,42.36
6272,42.36
6273,42.4
6274,42.44
6275,42.44
6276,42.42
6277,42.36
6278,42.22
6279,42.24
6280,42.18
6281,42.3
6282,42.6
6283,42.58
6284,42.6
6285,42.64
6286,42.7
6287,42.92
6288,43.04
6289,42.9
6290,42.86
6291,42.78
6292,42.66
6293,42.56
6294,42.5
6295,42.64
6296,42.66
6297,42.66
6298,42.6
6299,42.56
6300,42.54
6301,42.6
6302,42.54
6303,42.48
6304,42.48
6305,42.34
6306,42.38
6307,42.24
6308,42.18
6309,42.18
6310,42.24
6311,42.26
6312,42.38
6313,42.46
6314,42.32
6315,42.2
6316,42.1
6317,42.16
6318,42.12
6319,42.16
6320,42.16
6321,42.3
6322,42.38
6323,42.34
6324,42.24
6325,42.28
6326,42.18
6327,42.18
6328,42.02
6329,42.18
6330,42.18
6331,42.18
6332,42.12
6333,42.04
6334,42.36
6335,42.22
6336,42.1
6337,42.12
6338,42.02
6339,42.14
6340,42.08
6341,42.08
6342,42.04
6343,42.02
6344,42.02
6345,41.9
6346,41.94
6347,41.94
6348,41.85
6349,41.86
6350,41.81
6351,41.85
6352,41.83
6353,41.71
6354,41.71
6355,41.61
6356,41.57
6357,41.63
6358,41.51
6359,41.49
6360,41.43
6361,41.24
6362,41.22
6363,41.31
6364,41.33
6365,41.24
6366,41.2
6367,41.41
6368,41.57
6369,41.53
6370,41.61
6371,41.51
6372,41.55
6373,41.69
6374,41.71
6375,41.77
6376,41.81
6377,41.92
6378,41.96
6379,42.08
6380,42.06
6381,42.04
6382,41.96
6383,41.92
6384,41.85
6385,41.65
6386,41.51
6387,41.24
6388,41.02
6389,41.1
6390,40.82
6391,40.8
6392,40.9
6393,40.92
6394,40.9
6395,40.78
6396,40.86
6397,40.9
6398,40.92
6399,40.72
6400,40.72
6401,40.48
6402,40.42
6403,39.51
6404,41.65
6405,41.63
6406,41.22
6407,41.1
6408,40.96
6409,41.63
6410,42.14
6411,42.16
6412,42.26
6413,42.36
6414,42.38
6415,42.36
6416,42.42
6417,42.38
6418,42.38
6419,42.38
6420,42.3
6421,42.2
6422,42.24
6423,42.26
6424,42.44
6425,42.6
6426,42.66
6427,42.66
6428,42.78
6429,42.9
6430,43.02
6431,42.84
6432,42.94
6433,42.88
6434,42.72
6435,42.58
6436,42.4
6437,42.64
6438,42.72
6439,42.68
6440,42.6
6441,42.64
6442,42.64
6443,42.6
6444,42.52
6445,42.54
6446,42.56
6447,42.5
6448,42.4
6449,42.24
6450,42.28
6451,42.36
6452,42.36
6453,42.42
6454,42.5
6455,42.52
6456,42.32
6457,42.3
6458,42.18
6459,42.2
6460,42.22
6461,42.28
6462,42.12
6463,42.34
6464,42.28
6465,42.3
6466,42.2
6467,42.22
6468,42.26
6469,42.24
6470,42.18
6471,42.06
6472,42.18
6473,42.2
6474,42.24
6475,42.1
6476,42.48
6477,42.28
6478,41.92
6479,41.92
6480,41.98
6481,42.18
6482,42.06
6483,42.1
6484,42.06
6485,42.04
6486,41.94
6487,41.96
6488,41.9
6489,41.88
6490,41.86
6491,41.88
6492,41.88
6493,41.77
6494,41.86
6495,41.75
6496,41.79
6497,41.69
6498,41.65
6499,41.59
6500,41.63
6501,41.55
6502,41.43
6503,41.37
6504,41.2
6505,41.29
6506,41.37
6507,41.35
6508,41.33
6509,41.43
6510,41.51
6511,41.57
6512,41.37
6513,41.61
6514,41.69
6515,41.75
6516,41.71
6517,41.81
6518,41.75
6519,41.83
6520,41.96
6521,41.98
6522,42.02
6523,42.04
6524,41.96
6525,41.83
6526,41.86
6527,41.51
6528,41.37
6529,41.16
6530,41.0
6531,41.04
6532,40.92
6533,40.82
6534,40.88
6535,40.82
6536,40.86
6537,40.9
6538,40.9
6539,40.88
6540,40.98
6541,40.7
6542,40.64
6543,40.52
6544,40.26
6545,39.77
6546,41.63
6547,41.69
6548,41.29
6549,41.14
6550,40.72
6551,41.37
6552,41.86
6553,42.22
6554,42.28
6555,42.32
6556,42.36
6557,42.38
6558,42.46
6559,42.48
6560,42.46
6561,42.32
6562,42.18
6563,42.04
6564,42.22
6565,42.26
6566,42.36
6567,42.54
6568,42.66
6569,42.7
6570,42.78
6571,42.92
6572,42.98
6573,42.98
6574,42.94
6575,42.9
6576,42.9
6577,42.74
6578,42.66
6579,42.6
6580,42.72
6581,42.8
6582,42.76
6583,42.76
6584,42.66
6585,42.64
6586,42.64
6587,42.6
6588,42.56
6589,42.46
6590,42.52
6591,42.4
6592,42.18
6593,42.42
6594,42.5
6595,42.52
6596,42.76
6597,42.54
6598,42.4
6599,42.32
6600,42.32
6601,42.36
6602,42.26
6603,42.24
6604,42.22
6605,42.24
6606,42.44
6607,42.42
6608,42.4
6609,42.4
6610,42.32
6611,42.24
6612,42.34
6613,42.36
6614,42.28
6615,42.46
6616,42.26
6617,42.04
6618,42.22
6619,42.08
6620,42.06
6621,42.0
6622,42.04
6623,42.08
6624,42.08
6625,42.08
6626,42.08
6627,42.06
6628,42.0
6629,41.94
6630,41.92
6631,41.85
6632,41.77
6633,41.9
6634,41.86
6635,41.83
6636,41.81
6637,41.86
6638,41.86
6639,41.85
6640,41.65
6641,41.69
6642,41.65
6643,41.51
6644,41.47
6645,41.37
6646,41.14
6647,41.16
6648,41.39
6649,41.35
6650,41.41
6651,41.57
6652,41.55
6653,41.53
6654,41.47
6655,41.73
6656,41.77
6657,41.77
6658,41.77
6659,41.73
6660,41.83
6661,41.85
6662,41.83
6663,41.9
6664,42.06
6665,42.06
6666,41.96
6667,41.71
6668,41.77
6669,41.59
6670,41.24
6671,41.14
6672,40.96
6673,40.88
6674,40.88
6675,40.88
6676,40.88
6677,40.88
6678,40.98
6679,40.88
6680,40.94
6681,40.84
6682,40.84
6683,40.58
6684,40.64
6685,40.52
6686,40.34
6687,40.06
6688,41.39
6689,41.86
6690,41.49
6691,40.9
6692,40.8
6693,41.35
6694,42.08
6695,42.32
6696,42.32
6697,42.32
6698,42.42
6699,42.42
6700,42.5
6701,42.54
6702,42.46
6703,42.34
6704,42.32
6705,42.3
6706,42.28
6707,42.26
6708,42.34
6709,42.52
6710,42.72
6711,42.68
6712,42.86
6713,42.86
6714,42.9
6715,42.96
6716,43.06
6717,42.98
6718,42.94
6719,42.86
6720,42.86
6721,42.86
6722,42.82
6723,42.9
6724,42.72
6725,42.7
6726,42.76
6727,42.66
6728,42.64
6729,42.64
6730,42.72
6731,42.68
6732,42.58
6733,42.48
6734,42.38
6735,42.5
6736,42.56
6737,42.58
6738,42.54
6739,42.48
6740,42.5
6741,42.36
6742,42.36
6743,42.34
6744,42.36
6745,42.34
6746,42.22
6747,42.34
6748,42.44
6749,42.42
6750,42.48
6751,42.38
6752,42.52
6753,42.32
6754,42.34
6755,42.36
6756,42.26
6757,42.36
6758,42.28
6759,41.9
6760,42.14
6761,42.06
6762,42.06
6763,42.1
6764,41.98
6765,42.08
6766,42.08
6767,42.14
6768,42.22
6769,42.08
6770,42.02
6771,41.96
6772,42.0
6773,41.98
6774,41.75
6775,41.9
6776,41.96
6777,41.92
6778,41.88
6779,41.9
6780,41.88
6781,41.83
6782,41.77
6783,41.77
6784,41.67
6785,41.65
6786,41.51
6787,41.39
6788,41.55
6789,41.37
6790,41.53
6791,41.55
6792,41.49
6793,41.61
6794,41.63
6795,41.57
6796,41.59
6797,41.81
6798,41.88
6799,41.81
6800,41.75
6801,41.75
6802,41.83
6803,41.83
6804,41.79
6805,41.85
6806,41.83
6807,41.86
6808,41.86
6809,41.67
6810,41.61
6811,41.49
6812,41.31
6813,41.04
6814,40.92
6815,40.82
6816,40.78
6817,40.88
6818,40.86
6819,40.9
6820,40.86
6821,40.96
6822,40.98
6823,40.9
6824,40.98
6825,40.74
6826,40.68
6827,40.56
6828,40.38
6829,40.02
6830,41.45
6831,41.69
6832,41.49
6833,41.02
6834,40.7
6835,41.51
6836,41.98
6837,42.28
6838,42.38
6839,42.4
6840,42.38
6841,42.56
6842,42.56
6843,42.56
6844,42.54
6845,42.52
6846,42.58
6847,42.42
6848,42.36
6849,42.42
6850,42.46
6851,42.6
6852,42.64
6853,42.72
6854,42.86
6855,42.86
6856,42.94
6857,42.92
6858,42.98
6859,42.98
6860,42.92
6861,42.9
6862,42.96
6863,42.9
6864,42.96
6865,42.94
6866,42.92
6867,42.78
6868,42.9
6869,42.86
6870,42.78
6871,42.78
6872,42.72
6873,42.74
6874,42.78
6875,42.6
6876,42.54
6877,42.52
6878,42.42
6879,42.66
6880,42.6
6881,42.54
6882,42.46
6883,42.42
6884,42.44
6885,42.54
6886,42.38
6887,42.36
6888,42.38
6889,42.34
6890,42.44
6891,42.5
6892,42.4
6893,42.48
6894,42.4
6895,42.4
6896,42.36
6897,42.34
6898,42.3
6899,42.34
6900,42.42
6901,42.26
6902,42.2
6903,42.12
6904,42.14
6905,42.22
6906,42.14
6907,42.12
6908,42.2
6909,42.16
6910,42.16
6911,42.18
6912,42.06
6913,42.06
6914,42.02
6915,42.02
6916,41.92
6917,41.92
6918,42.08
6919,42.08
6920,41.96
6921,42.04
6922,41.98
6923,41.92
6924,41.88
6925,41.88
6926,41.81
6927,41.79
6928,41.69
6929,41.55
6930,41.53
6931,41.57
6932,41.65
6933,41.67
6934,41.59
6935,41.75
6936,41.73
6937,41.63
6938,41.69
6939,41.88
6940,41.85
6941,41.86
6942,41.75
6943,41.77
6944,41.81
6945,41.73
6946,41.79
6947,41.77
6948,41.81
6949,41.83
6950,41.65
6951,41.63
6952,41.65
6953,41.49
6954,41.33
6955,41.02
6956,40.84
6957,40.78
6958,40.92
6959,40.88
6960,40.88
6961,40.86
6962,40.9
6963,40.74
6964,40.92
6965,40.86
6966,40.96
6967,40.66
6968,40.78
6969,40.7
6970,40.56
6971,40.26
6972,41.39
6973,41.81
6974,41.43
6975,40.84
6976,40.66
6977,41.39
6978,42.08
6979,42.28
6980,42.34
6981,42.36
6982,42.44
6983,42.44
6984,42.5
6985,42.56
6986,42.64
6987,42.56
6988,42.54
6989,42.5
6990,42.22
6991,42.3
6992,42.44
6993,42.64
6994,42.64
6995,42.7
6996,42.82
6997,42.86
6998,42.96
6999,42.92
7000,43.04
7001,42.98
7002,42.88
7003,43.02
7004,43.06
7005,42.98
7006,42.98
7007,42.98
7008,42.9
7009,42.96
7010,42.88
7011,42.78
7012,42.8
7013,42.78
7014,42.76
7015,42.74
7016,42.7
7017,42.66
7018,42.68
7019,42.64
7020,42.62
7021,42.58
7022,42.6
7023,42.52
7024,42.38
7025,42.44
7026,42.5
7027,42.34
7028,42.4
7029,42.42
7030,42.38
7031,42.48
7032,42.4
7033,42.32
7034,42.48
7035,42.4
7036,42.4
7037,42.4
7038,42.34
7039,42.38
7040,42.38
7041,42.34
7042,42.34
7043,42.26
7044,42.2
7045,42.1
7046,42.12
7047,42.18
7048,42.26
7049,42.22
7050,42.18
7051,42.2
7052,42.22
7053,42.18
7054,42.16
7055,42.1
7056,42.04
7057,42.08
7058,42.0
7059,42.12
7060,42.08
7061,42.14
7062,42.08
7063,42.06
7064,42.04
7065,42.0
7066,41.96
7067,41.86
7068,42.04
7069,41.86
7070,41.85
7071,41.77
7072,41.63
7073,41.75
7074,41.75
7075,41.79
7076,41.69
7077,41.94
7078,41.85
7079,41.75
7080,41.86
7081,41.88
7082,41.96
7083,41.98
7084,41.85
7085,41.88
7086,41.83
7087,41.69
7088,41.71
7089,41.69
7090,41.65
7091,41.81
7092,41.63
7093,41.59
7094,41.71
7095,41.31
7096,41.24
7097,40.88
7098,40.66
7099,40.8
7100,40.86
7101,40.82
7102,40.78
7103,40.88
7104,40.9
7105,40.82
7106,40.92
7107,40.9
7108,40.86
7109,40.64
7110,40.84
7111,40.7
7112,40.62
7113,40.46
7114,39.59
7115,41.41
7116,41.75
7117,41.47
7118,41.02
7119,40.78
7120,41.43
7121,42.04
7122,42.16
7123,42.26
7124,42.32
7125,42.36
7126,42.42
7127,42.46
7128,42.52
7129,42.56
7130,42.54
7131,42.6
7132,42.4
7133,42.26
7134,42.28
7135,42.38
7136,42.42
7137,42.7
7138,42.64
7139,42.72
7140,42.7
7141,42.84
7142,42.92
7143,43.0
7144,42.94
7145,42.98
7146,42.94
7147,43.04
7148,42.84
7149,42.94
7150,42.96
7151,42.92
7152,42.92
7153,42.8
7154,42.9
7155,42.86
7156,42.8
7157,42.72
7158,42.7
7159,42.74
7160,42.78
7161,42.84
7162,42.68
7163,42.56
7164,42.48
7165,42.54
7166,42.52
7167,42.48
7168,42.52
7169,42.48
7170,42.4
7171,42.48
7172,42.44
7173,42.4
7174,42.34
7175,42.36
7176,42.36
7177,42.36
7178,42.38
7179,42.36
7180,42.4
7181,42.4
7182,42.68
7183,42.66
7184,42.36
7185,42.4
7186,42.3
7187,42.36
7188,42.24
7189,42.22
7190,42.28
7191,42.26
7192,42.24
7193,42.18
7194,42.22
7195,42.24
7196,42.26
7197,42.34
7198,42.18
7199,42.06
7200,42.06
7201,42.04
7202,42.24
7203,42.2
7204,42.1
7205,42.12
7206,42.14
7207,42.1
7208,42.0
7209,42.08
7210,41.98
7211,42.0
7212,41.96
7213,41.9
7214,41.92
7215,41.83
7216,41.86
7217,41.85
7218,41.75
7219,41.61
7220,41.81
7221,41.81
7222,41.9
7223,41.98
7224,41.94
7225,41.94
7226,42.0
7227,41.92
7228,41.71
7229,41.77
7230,41.73
7231,41.73
7232,41.71
7233,41.61
7234,41.67
7235,41.61
7236,41.53
7237,41.47
7238,41.47
7239,41.14
7240,40.86
7241,40.84
7242,40.84
7243,40.84
7244,40.82
7245,40.86
7246,40.84
7247,40.84
7248,40.62
7249,40.88
7250,40.84
7251,40.86
7252,40.58
7253,40.74
7254,40.7
7255,40.78
7256,40.54
7257,39.81
7258,41.24
7259,41.65
7260,41.35
7261,40.98
7262,40.66
7263,41.45
7264,42.02
7265,42.16
7266,42.28
7267,42.28
7268,42.32
7269,42.32
7270,42.4
7271,42.54
7272,42.5
7273,42.58
7274,42.5
7275,42.52
7276,42.22
7277,42.2
7278,42.42
7279,42.4
7280,42.56
7281,42.68
7282,42.72
7283,42.8
7284,42.76
7285,42.78
7286,42.84
7287,42.8
7288,42.88
7289,42.84
7290,42.98
7291,42.94
7292,42.88
7293,42.86
7294,42.76
7295,42.88
7296,42.88
7297,42.78
7298,42.84
7299,42.86
7300,42.74
7301,42.68
7302,42.74
7303,42.64
7304,42.9
7305,42.76
7306,42.54
7307,42.34
7308,42.44
7309,42.54
7310,42.52
7311,42.54
7312,42.46
7313,42.48
7314,42.58
7315,42.34
7316,42.24
7317,42.24
7318,42.32
7319,42.38
7320,42.38
7321,42.34
7322,42.4
7323,42.28
7324,42.36
7325,42.42
7326,42.4
7327,42.32
7328,42.52
7329,42.38
7330,42.54
7331,42.54
7332,42.24
7333,42.24
7334,42.3
7335,42.26
7336,42.2
7337,42.24
7338,42.24
7339,42.28
7340,42.34
7341,42.2
7342,42.2
7343,42.04
7344,42.04
7345,42.08
7346,42.2
7347,42.12
7348,42.08
7349,42.08
7350,42.12
7351,42.16
7352,42.04
7353,42.08
7354,42.02
7355,42.14
7356,42.06
7357,42.08
7358,41.9
7359,41.92
7360,41.92
7361,41.9
7362,41.85
7363,41.94
7364,42.02
7365,42.0
7366,42.0
7367,42.06
7368,42.02
7369,41.98
7370,41.86
7371,41.88
7372,41.75
7373,41.69
7374,41.69
7375,41.67
7376,41.67
7377,41.71
7378,41.61
7379,41.53
7380,41.59
7381,41.37
7382,41.14
7383,41.04
7384,40.82
7385,40.82
7386,40.8
7387,40.86
7388,40.82
7389,40.8
7390,40.8
7391,40.72
7392,40.82
7393,40.78
7394,40.8
7395,40.66
7396,40.76
7397,40.68
7398,40.56
7399,40.42
7400,39.79
7401,41.2
7402,41.75
7403,41.49
7404,40.88
7405,40.48
7406,41.39
7407,42.08
7408,42.08
7409,42.12
7410,42.28
7411,42.18
7412,42.34
7413,42.34
7414,42.22
7415,42.2
7416,42.32
7417,42.4
7418,42.38
7419,42.08
7420,42.04
7421,42.22
7422,42.36
7423,42.42
7424,42.44
7425,42.58
7426,42.64
7427,42.74
7428,42.62
7429,42.72
7430,42.72
7431,42.82
7432,42.68
7433,42.82
7434,42.8
7435,42.8
7436,42.76
7437,42.64
7438,42.76
7439,42.7
7440,42.7
7441,43.02
7442,42.9
7443,42.72
7444,42.64
7445,42.66
7446,42.56
7447,42.56
7448,42.52
7449,42.46
7450,42.38
7451,42.46
7452,42.46
7453,42.48
7454,42.44
7455,42.32
7456,42.48
7457,42.32
7458,42.32
7459,42.4
7460,42.16
7461,42.32
7462,42.32
7463,42.36
7464,42.46
7465,42.3
7466,42.24
7467,42.28
7468,42.36
7469,42.32
7470,42.2
7471,42.44
7472,42.28
7473,42.36
7474,42.32
7475,42.22
7476,42.22
7477,42.22
7478,42.24
7479,42.14
7480,42.26
7481,42.24
7482,42.2
7483,42.32
7484,42.18
7485,42.14
7486,42.12
7487,42.04
7488,41.98
7489,42.06
7490,42.08
7491,41.96
7492,42.06
7493,42.04
7494,41.96
7495,42.06
7496,41.98
7497,42.14
7498,42.06
7499,41.96
7500,41.9
7501,41.94
7502,41.94
7503,41.92
7504,41.81
7505,41.77
7506,41.83
7507,41.9
7508,41.86
7509,41.94
7510,41.96
7511,41.88
7512,41.9
7513,41.9
7514,41.77
7515,41.83
7516,41.67
7517,41.65
7518,41.53
7519,41.59
7520,41.67
7521,41.49
7522,41.37
7523,41.39
7524,41.31
7525,41.2
7526,40.92
7527,40.92
7528,40.78
7529,40.56
7530,40.56
7531,40.66
7532,40.66
7533,40.64
7534,40.62
7535,40.62
7536,40.64
7537,40.74
7538,40.58
7539,40.58
7540,40.48
7541,40.46
7542,40.42
7543,40.02
7544,41.24
7545,41.51
7546,41.33
7547,40.62
7548,40.28
7549,41.1
7550,41.86
7551,41.92
7552,41.9
7553,41.9
7554,41.86
7555,42.12
7556,41.98
7557,42.02
7558,42.06
7559,42.12
7560,41.85
7561,42.06
7562,41.88
7563,41.79
7564,41.9
7565,41.88
7566,42.18
7567,42.16
7568,42.38
7569,42.38
7570,42.5
7571,42.54
7572,42.5
7573,42.54
7574,42.54
7575,42.44
7576,42.6
7577,42.68
7578,42.66
7579,42.52
7580,42.52
7581,42.58
7582,42.58
7583,42.7
7584,42.8
7585,42.72
7586,42.62
7587,42.52
7588,42.52
7589,42.34
7590,42.28
7591,42.36
7592,42.28
7593,42.34
7594,42.34
7595,42.26
7596,42.32
7597,42.3
7598,42.32
7599,42.28
7600,42.22
7601,42.3
7602,42.22
7603,42.1
7604,42.28
7605,42.12
7606,42.2
7607,42.24
7608,42.08
7609,42.22
7610,42.18
7611,42.24
7612,42.22
7613,42.22
7614,42.12
7615,42.28
7616,42.36
7617,42.22
7618,42.18
7619,42.02
7620,42.12
7621,42.14
7622,42.16
7623,42.1
7624,42.18
7625,42.08
7626,42.14
7627,42.06
7628,42.06
7629,42.1
7630,41.96
7631,42.0
7632,41.92
7633,41.86
7634,41.96
7635,41.85
7636,42.0
7637,41.94
7638,41.92
7639,41.96
7640,41.96
7641,41.9
7642,41.88
7643,41.92
7644,41.77
7645,41.75
7646,41.77
7647,41.69
7648,41.67
7649,41.67
7650,41.75
7651,41.73
7652,41.86
7653,41.79
7654,41.79
7655,41.79
7656,41.73
7657,41.77
7658,41.49
7659,41.45
7660,41.41
7661,41.1
7662,41.29
7663,41.39
7664,41.22
7665,41.14
7666,41.12
7667,40.94
7668,40.96
7669,40.84
7670,40.72
7671,40.5
7672,40.38
7673,40.36
7674,40.46
7675,40.82
7676,40.54
7677,40.4
7678,40.52
7679,40.48
7680,40.46
7681,40.26
7682,40.38
7683,40.38
7684,40.28
7685,40.32
7686,40.0
7687,40.94
7688,41.45
7689,41.18
7690,40.5
7691,40.0
7692,41.12
7693,41.53
7694,41.85
7695,41.75
7696,41.69
7697,41.77
7698,41.71
7699,41.81
7700,41.83
7701,41.77
7702,41.77
7703,41.63
7704,41.65
7705,41.55
7706,41.39
7707,41.63
7708,41.75
7709,41.96
7710,41.98
7711,42.2
7712,42.2
7713,42.3
7714,42.22
7715,42.28
7716,42.34
7717,42.42
7718,42.36
7719,42.36
7720,42.3
7721,42.44
7722,42.44
7723,42.44
7724,42.52
7725,42.52
7726,42.72
7727,42.88
7728,42.68
7729,42.6
7730,42.58
7731,42.42
7732,42.24
7733,42.24
7734,42.22
7735,42.16
7736,42.16
7737,42.3
7738,42.28
7739,42.24
7740,42.24
7741,42.26
7742,42.16
7743,42.18
7744,42.24
7745,42.2
7746,42.08
7747,42.24
7748,42.08
7749,42.08
7750,42.08
7751,42.12
7752,42.14
7753,42.18
7754,42.12
7755,42.08
7756,42.06
7757,42.02
7758,41.96
7759,42.16
7760,41.98
7761,41.94
7762,41.83
7763,41.94
7764,41.96
7765,42.0
7766,42.04
7767,42.06
7768,41.88
7769,42.0
7770,41.92
7771,41.98
7772,41.94
7773,41.98
7774,41.92
7775,41.86
7776,41.77
7777,41.85
7778,41.77
7779,41.88
7780,41.79
7781,41.83
7782,41.79
7783,41.83
7784,41.75
7785,41.81
7786,41.65
7787,41.69
7788,41.69
7789,41.57
7790,41.55
7791,41.59
7792,41.59
7793,41.59
7794,41.65
7795,41.57
7796,41.73
7797,41.63
7798,41.51
7799,41.67
7800,41.53
7801,41.39
7802,41.18
7803,41.24
7804,41.16
7805,41.1
7806,41.24
7807,41.12
7808,41.0
7809,40.88
7810,40.8
7811,40.76
7812,40.44
7813,40.38
7814,40.32
7815,40.38
7816,39.95
7817,40.28
7818,40.28
7819,40.28
7820,40.22
7821,40.32
7822,40.36
7823,40.36
7824,40.12
7825,40.24
7826,40.22
7827,40.14
7828,40.12
7829,39.91
7830,40.54
7831,41.41
7832,41.29
7833,40.58
7834,39.75
7835,40.5
7836,41.35
7837,41.53
7838,41.37
7839,41.55
7840,41.39
7841,41.24
7842,41.22
7843,41.31
7844,41.22
7845,41.31
7846,41.22
7847,41.08
7848,40.84
7849,40.86
7850,41.2
7851,41.27
7852,41.43
7853,41.57
7854,41.51
7855,41.81
7856,41.96
7857,41.83
7858,42.06
7859,41.94
7860,42.12
7861,42.04
7862,41.98
7863,42.24
7864,41.98
7865,42.28
7866,42.34
7867,42.26
7868,42.28
7869,42.44
7870,42.54
7871,42.34
7872,42.36
7873,42.24
7874,42.24
7875,42.1
7876,41.96
7877,41.92
7878,41.98
7879,41.98
7880,42.22
7881,42.1
7882,42.14
7883,42.18
7884,42.14
7885,42.02
7886,41.98
7887,42.0
7888,41.98
7889,42.14
7890,42.06
7891,41.98
7892,41.94
7893,42.0
7894,41.83
7895,42.08
7896,41.96
7897,42.06
7898,42.04
7899,41.92
7900,41.79
7901,41.85
7902,42.0
7903,41.73
7904,41.75
7905,41.73
7906,41.83
7907,41.83
7908,41.73
7909,41.77
7910,41.81
7911,41.69
7912,41.81
7913,41.73
7914,41.79
7915,41.81
7916,41.71
7917,41.71
7918,41.69
7919,41.63
7920,41.67
7921,41.71
7922,41.65
7923,41.71
7924,41.59
7925,41.61
7926,41.51
7927,41.55
7928,41.51
7929,41.49
7930,41.53
7931,41.41
7932,41.41
7933,41.45
7934,41.47
7935,41.51
7936,41.39
7937,41.45
7938,41.47
7939,41.51
7940,41.53
7941,41.43
7942,41.51
7943,41.47
7944,41.37
7945,41.02
7946,40.98
7947,41.04
7948,41.0
7949,41.06
7950,41.08
7951,40.76
7952,40.76
7953,40.58
7954,40.26
7955,40.14
7956,39.91
7957,39.83
7958,40.0
7959,39.95
7960,40.06
7961,40.08
7962,40.08
7963,40.14
7964,40.2
7965,40.32
7966,40.3
7967,40.28
7968,40.28
7969,40.06
7970,40.02
7971,39.85
7972,39.83
7973,40.82
7974,41.41
7975,41.37
7976,41.22
7977,41.02
7978,41.14
7979,41.35
7980,41.37
7981,41.35
7982,41.22
7983,40.86
7984,41.04
7985,41.1
7986,40.82
7987,40.78
7988,40.88
7989,40.64
7990,40.16
7991,40.16
7992,40.66
7993,40.82
7994,40.88
7995,41.16
7996,41.2
7997,41.35
7998,41.27
7999,41.45
8000,41.55
8001,41.61
8002,41.53
8003,41.55
8004,41.75
8005,41.85
8006,41.86
8007,41.77
8008,41.63
8009,41.79
8010,41.86
8011,41.85
8012,42.1
8013,42.0
8014,42.02
8015,41.85
8016,41.92
8017,41.65
8018,41.77
8019,41.65
8020,41.73
8021,41.63
8022,41.61
8023,41.57
8024,41.73
8025,42.04
8026,41.79
8027,41.85
8028,41.77
8029,41.67
8030,41.71
8031,41.63
8032,41.61
8033,41.63
8034,41.67
8035,41.71
8036,41.67
8037,41.55
8038,41.65
8039,41.75
8040,41.59
8041,41.9
8042,41.59
8043,41.49
8044,41.49
8045,41.29
8046,41.37
8047,41.39
8048,41.43
8049,41.39
8050,41.37
8051,41.41
8052,41.55
8053,41.61
8054,41.43
8055,41.33
8056,41.51
8057,41.47
8058,41.41
8059,41.37
8060,41.18
8061,41.45
8062,41.47
8063,41.33
8064,41.43
8065,41.37
8066,41.37
8067,41.16
8068,41.14
8069,41.18
8070,41.1
8071,41.16
8072,41.06
8073,40.86
8074,41.29
8075,41.08
8076,41.18
8077,41.14
8078,41.08
8079,41.08
8080,41.12
8081,41.06
8082,41.04
8083,40.9
8084,41.02
8085,40.8
8086,40.52
8087,40.54
8088,40.62
8089,40.68
8090,40.68
8091,40.38
8092,40.3
8093,40.2
8094,40.04
8095,39.91
8096,39.67
8097,39.57
8098,39.75
8099,39.55
8100,39.65
8101,39.83
8102,39.73
8103,39.95
8104,40.0
8105,40.12
8106,39.91
8107,39.79
8108,39.69
8109,41.57
8110,41.45
8111,41.22
8112,41.59
8113,41.41
8114,41.55
8115,41.53
8116,41.51
8117,41.27
8118,41.39
8119,41.18
8120,41.12
8121,40.98
8122,40.86
8123,40.7
8124,40.6
8125,40.48
8126,39.89
8127,39.93
8128,40.5
8129,40.72
8130,40.84
8131,41.04
8132,41.12
8133,41.39
8134,41.57
8135,41.59
8136,41.65
8137,41.59
8138,41.9
8139,41.85
8140,42.0
8141,42.04
8142,41.98
8143,42.06
8144,42.0
8145,42.12
8146,42.24
8147,42.06
8148,42.3
8149,42.2
8150,42.14
8151,42.22
8152,42.22
8153,42.16
8154,42.24
8155,42.24
8156,42.2
8157,42.16
8158,42.18
8159,42.18
8160,42.18
8161,42.3
8162,42.12
8163,42.16
8164,42.12
8165,42.24
8166,42.16
8167,42.26
8168,42.1
8169,42.1
8170,42.16
8171,41.92
8172,42.08
8173,41.94
8174,42.02
8175,42.16
8176,41.98
8177,42.02
8178,41.96
8179,41.94
8180,41.81
8181,41.71
8182,41.71
8183,41.83
8184,41.88
8185,41.83
8186,41.88
8187,41.85
8188,41.77
8189,41.81
8190,41.69
8191,41.69
8192,41.69
8193,41.53
8194,41.61
8195,41.63
8196,41.61
8197,41.57
8198,41.63
8199,41.55
8200,41.51
8201,41.45
8202,41.35
8203,41.43
8204,41.22
8205,41.31
8206,41.18
8207,41.31
8208,41.33
8209,41.22
8210,41.1
8211,41.1
8212,41.0
8213,41.08
8214,41.0
8215,40.96
8216,40.98
8217,40.94
8218,40.94
8219,40.84
8220,40.8
8221,40.56
8222,40.38
8223,40.32
8224,40.38
8225,40.3
8226,40.2
8227,40.02
8228,39.79
8229,39.83
8230,39.69
8231,39.57
8232,39.63
8233,39.71
8234,39.77
8235,39.93
8236,39.61
8237,39.71
8238,39.81
8239,41.18
8240,41.0
8241,40.3
8242,40.42
8243,40.56
8244,40.28
8245,40.4
8246,40.34
8247,40.22
8248,40.24
8249,40.16
8250,40.12
8251,40.08
8252,40.02
8253,39.93
8254,39.81
8255,39.61
8256,39.79
8257,40.0
8258,40.02
8259,40.16
8260,40.38
8261,40.52
8262,40.7
8263,40.72
8264,40.8
8265,40.96
8266,41.18
8267,41.12
8268,41.24
8269,41.39
8270,41.39
8271,41.49
8272,41.63
8273,41.55
8274,41.61
8275,41.69
8276,41.77
8277,41.75
8278,41.81
8279,41.81
8280,41.65
8281,41.86
8282,41.73
8283,41.81
8284,41.96
8285,42.06
8286,42.0
8287,41.92
8288,41.88
8289,41.9
8290,41.92
8291,42.0
8292,42.04
8293,41.98
8294,42.08
8295,41.9
8296,41.83
8297,41.88
8298,42.0
8299,41.98
8300,41.94
8301,41.98
8302,41.88
8303,41.85
8304,41.88
8305,41.96
8306,41.85
8307,41.79
8308,41.85
8309,41.77
8310,41.67
8311,41.86
8312,41.85
8313,41.79
8314,42.0
8315,41.86
8316,41.77
8317,41.83
8318,41.86
8319,41.67
8320,41.83
8321,41.61
8322,41.75
8323,41.61
8324,41.67
8325,41.63
8326,41.65
8327,41.77
8328,41.55
8329,41.65
8330,41.43
8331,41.57
8332,41.43
8333,41.24
8334,41.37
8335,41.35
8336,41.24
8337,41.24
8338,41.22
8339,41.2
8340,41.31
8341,41.02
8342,41.06
8343,41.0
8344,40.9
8345,40.86
8346,40.82
8347,40.72
8348,40.7
8349,40.44
8350,40.4
8351,40.28
8352,40.26
8353,40.42
8354,40.4
8355,40.1
8356,39.81
8357,39.79
8358,39.61
8359,39.65
8360,39.87
8361,39.85
8362,39.73
8363,40.1
8364,39.91
8365,39.85
8366,40.02
8367,40.06
8368,39.83
8369,39.59
