{
	"info": {
		"_postman_id": "23a55d1f-5af9-4a28-a889-2c79a293ad6f",
		"name": "knightAPI",
		"schema": "https://schema.getpostman.com/json/collection/v2.1.0/collection.json"
	},
	"item": [
		{
			"name": "Cria guerreiro Johny com sucesso",
			"event": [
				{
					"listen": "test",
					"script": {
						"id": "d8502b49-f6c1-49fb-99b7-e803465b8750",
						"exec": [
							"pm.test(\"Knight criado com sucesso\", function() {",
							"   pm.response.to.have.status(201); ",
							"});",
							"",
							"pm.test(\"Resposta com id do knight\", function() {",
							"    var jsonData = pm.response.json();",
							"    pm.environment.set(\"id\", jsonData.data._id);",
							"    pm.expect(jsonData.data._id); ",
							"});",
							""
						],
						"type": "text/javascript"
					}
				}
			],
			"request": {
				"method": "POST",
				"header": [
					{
						"key": "Content-Type",
						"name": "Content-Type",
						"value": "application/json",
						"type": "text"
					}
				],
				"body": {
					"mode": "raw",
					"raw": "{\n\t\"nickName\":\"Guerreiro Bolado\",\n\t\"name\": \"Johny\"\n}"
				},
				"url": {
					"raw": "localhost:3000/knights",
					"host": [
						"localhost"
					],
					"port": "3000",
					"path": [
						"knights"
					]
				}
			},
			"response": []
		},
		{
			"name": "Altera nick do johny com id criado",
			"event": [
				{
					"listen": "test",
					"script": {
						"id": "837983cf-5fb3-4147-9f8b-7df78edbd033",
						"exec": [
							"pm.test(\"Alterado com sucesso\", function() {",
							"   pm.response.to.have.status(200); ",
							"});"
						],
						"type": "text/javascript"
					}
				}
			],
			"request": {
				"method": "PUT",
				"header": [
					{
						"key": "Content-Type",
						"name": "Content-Type",
						"value": "application/json",
						"type": "text"
					}
				],
				"body": {
					"mode": "raw",
					"raw": "{\n\t\"nickName\":\"Johny bolado2\",\n\t\"name\": \"TESTEC\"\n}"
				},
				"url": {
					"raw": "localhost:3000/knights/{{id}}",
					"host": [
						"localhost"
					],
					"port": "3000",
					"path": [
						"knights",
						"{{id}}"
					]
				}
			},
			"response": []
		},
		{
			"name": "Falha ao Criar guerreiro Johny, pois já existe",
			"event": [
				{
					"listen": "test",
					"script": {
						"id": "d8502b49-f6c1-49fb-99b7-e803465b8750",
						"exec": [
							"pm.test(\"Knight já existe\", function() {",
							"   pm.response.to.have.status(412); ",
							"});",
							"",
							"pm.test(\"Resposta sem data\", function() {",
							"    var jsonData = pm.response.json();",
							"    pm.expect(!jsonData.data); ",
							"});"
						],
						"type": "text/javascript"
					}
				}
			],
			"request": {
				"method": "POST",
				"header": [
					{
						"key": "Content-Type",
						"name": "Content-Type",
						"value": "application/json",
						"type": "text"
					}
				],
				"body": {
					"mode": "raw",
					"raw": "{\n\t\"nickName\":\"Guerreiro Bolado\",\n\t\"name\": \"Johny\"\n}"
				},
				"url": {
					"raw": "localhost:3000/knights",
					"host": [
						"localhost"
					],
					"port": "3000",
					"path": [
						"knights"
					]
				}
			},
			"response": []
		},
		{
			"name": "Busca Knight por Id",
			"event": [
				{
					"listen": "test",
					"script": {
						"id": "995885be-93bd-45a3-af94-3a07d0ba2f52",
						"exec": [
							"pm.test(\"Resposta com sucesso\", function() {",
							"   pm.response.to.have.status(200); ",
							"});",
							"",
							"pm.test(\"Knight retornado e com nome\", function() {",
							"    var jsonData = pm.response.json();",
							"    pm.expect(jsonData.data.nome); ",
							"});"
						],
						"type": "text/javascript"
					}
				}
			],
			"request": {
				"method": "GET",
				"header": [],
				"url": {
					"raw": "localhost:3000/knights/{{id}}",
					"host": [
						"localhost"
					],
					"port": "3000",
					"path": [
						"knights",
						"{{id}}"
					]
				}
			},
			"response": []
		},
		{
			"name": "Busca lista de Knights vivos",
			"event": [
				{
					"listen": "test",
					"script": {
						"id": "995885be-93bd-45a3-af94-3a07d0ba2f52",
						"exec": [
							"pm.test(\"Resposta com sucesso\", function() {",
							"   pm.response.to.have.status(200); ",
							"});",
							"",
							"pm.test(\"Knight retornado e com nome\", function() {",
							"    var jsonData = pm.response.json();",
							"    pm.expect(jsonData.data.nome); ",
							"});"
						],
						"type": "text/javascript"
					}
				}
			],
			"request": {
				"method": "GET",
				"header": [],
				"url": {
					"raw": "localhost:3000/knights/",
					"host": [
						"localhost"
					],
					"port": "3000",
					"path": [
						"knights",
						""
					]
				}
			},
			"response": []
		},
		{
			"name": "Remove Johny dos knights vivos",
			"event": [
				{
					"listen": "test",
					"script": {
						"id": "d8502b49-f6c1-49fb-99b7-e803465b8750",
						"exec": [
							"pm.test(\"Knight removido para altar de herois\", function() {",
							"   pm.response.to.have.status(200); ",
							"});",
							"",
							"pm.test(\"Resposta com id do knight\", function() {",
							"    var jsonData = pm.response.json();",
							"    pm.environment.set(\"nome\", jsonData.data.name);",
							"    pm.expect(jsonData.data._id); ",
							"});"
						],
						"type": "text/javascript"
					}
				}
			],
			"request": {
				"method": "DELETE",
				"header": [
					{
						"key": "Content-Type",
						"name": "Content-Type",
						"value": "application/json",
						"type": "text",
						"disabled": true
					}
				],
				"url": {
					"raw": "localhost:3000/knights/{{id}}",
					"host": [
						"localhost"
					],
					"port": "3000",
					"path": [
						"knights",
						"{{id}}"
					]
				}
			},
			"response": []
		},
		{
			"name": "localhost:3000/knights?filter=heroes",
			"event": [
				{
					"listen": "test",
					"script": {
						"id": "ee44ec08-44fc-4ddc-8f83-1dbecab92682",
						"exec": [
							"pm.test(\"lista altar de herois\", function() {",
							"   pm.response.to.have.status(200); ",
							"});",
							"",
							"pm.test(\"Resposta com nome do Johny\", function() {",
							"    var jsonData = pm.response.json();",
							"    jsonData.data.find( obj => obj.nome == pm.environment.get(\"nome\"));",
							"});",
							""
						],
						"type": "text/javascript"
					}
				}
			],
			"request": {
				"method": "GET",
				"header": [
					{
						"key": "Content-Type",
						"name": "Content-Type",
						"value": "application/json",
						"type": "text"
					}
				],
				"url": {
					"raw": "localhost:3000/knights?filter=heroes",
					"host": [
						"localhost"
					],
					"port": "3000",
					"path": [
						"knights"
					],
					"query": [
						{
							"key": "filter",
							"value": "heroes"
						}
					]
				},
				"description": "busca lista dos guerreiros herois e encontra o johny"
			},
			"response": []
		},
		{
			"name": "Busca lista de herois e encontra o johny",
			"event": [
				{
					"listen": "test",
					"script": {
						"id": "ee44ec08-44fc-4ddc-8f83-1dbecab92682",
						"exec": [
							"pm.test(\"lista altar de herois\", function() {",
							"   pm.response.to.have.status(200); ",
							"});",
							"",
							"pm.test(\"Resposta contem o Johny\", function() {",
							"    var jsonData = pm.response.json();",
							"    jsonData.data.find( obj => obj.nome == pm.environment.get(\"nome\"));",
							"});",
							""
						],
						"type": "text/javascript"
					}
				}
			],
			"request": {
				"method": "GET",
				"header": [
					{
						"key": "Content-Type",
						"name": "Content-Type",
						"value": "application/json",
						"type": "text"
					}
				],
				"url": {
					"raw": "localhost:3000/knights?filter=heroes",
					"host": [
						"localhost"
					],
					"port": "3000",
					"path": [
						"knights"
					],
					"query": [
						{
							"key": "filter",
							"value": "heroes"
						}
					]
				}
			},
			"response": []
		}
	],
	"protocolProfileBehavior": {}
}