module helloaws

go 1.17

require (
	github.com/aws/aws-sdk-go v1.42.19
	github.com/aws/aws-sdk-go-v2 v1.11.2 // indirect
	github.com/aws/aws-sdk-go-v2/config v1.11.0 // indirect
	github.com/aws/aws-sdk-go-v2/credentials v1.6.4 // indirect
	github.com/aws/aws-sdk-go-v2/feature/ec2/imds v1.8.2 // indirect
	github.com/aws/aws-sdk-go-v2/internal/configsources v1.1.2 // indirect
	github.com/aws/aws-sdk-go-v2/internal/endpoints/v2 v2.0.2 // indirect
	github.com/aws/aws-sdk-go-v2/internal/ini v1.3.2 // indirect
	github.com/aws/aws-sdk-go-v2/service/dynamodb v1.10.0 // indirect
	github.com/aws/aws-sdk-go-v2/service/internal/accept-encoding v1.5.0 // indirect
	github.com/aws/aws-sdk-go-v2/service/internal/endpoint-discovery v1.3.3 // indirect
	github.com/aws/aws-sdk-go-v2/service/internal/presigned-url v1.5.2 // indirect
	github.com/aws/aws-sdk-go-v2/service/sso v1.6.2 // indirect
	github.com/aws/aws-sdk-go-v2/service/sts v1.11.1 // indirect
	github.com/aws/smithy-go v1.9.0 // indirect
	github.com/jmespath/go-jmespath v0.4.0 // indirect
)
