{
  "openapi": "3.0.1",
  "info": {
    "title": "Express Boilerplate",
    "description": "",
    "version": "1.0.0"
  },
  "servers": [
    {
      "url": "http://localhost:3000/api",
      "description": "Local server"
    }
  ],
  "security": [],
  "tags": [
    {
      "name": "General"
    },
    {
      "name": "Users"
    }
  ],
  "paths": {
    "/status": {
      "get": {
        "tags": ["General"],
        "description": "Get API Status",
        "parameters": [],
        "responses": {
          "200": {
            "description": "API is OK",
            "content": {
              "text/plain": {
                "schema": {
                  "type": "string",
                  "example": "ok"
                }
              }
            }
          }
        }
      }
    }
  }
}
