{
  "name": "Agenda",
  "fields": [
    {
      "fieldName": "horaMedicamento",
      "fieldType": "Integer"
    }
  ],
  "relationships": [
    {
      "relationshipType": "many-to-one",
      "otherEntityName": "medicamento",
      "otherEntityRelationshipName": "agenda",
      "relationshipName": "medicamento",
      "otherEntityField": "nombre"
    }
  ],
  "entityTableName": "agenda",
  "dto": "no",
  "pagination": "infinite-scroll",
  "service": "no",
  "jpaMetamodelFiltering": false,
  "fluentMethods": true,
  "readOnly": false,
  "embedded": false,
  "applications": ["gateway", "pacientes"],
  "microserviceName": "pacientes",
  "clientRootFolder": "pacientes",
  "databaseType": "sql",
  "changelogDate": "20211111155153"
}
