{
  "name": "Sueno",
  "fields": [
    {
      "fieldName": "superficial",
      "fieldType": "Integer"
    },
    {
      "fieldName": "profundo",
      "fieldType": "Integer"
    },
    {
      "fieldName": "despierto",
      "fieldType": "Integer"
    },
    {
      "fieldName": "timeInstant",
      "fieldType": "Instant"
    }
  ],
  "relationships": [
    {
      "relationshipType": "many-to-one",
      "otherEntityName": "user",
      "otherEntityRelationshipName": "sueno",
      "relationshipName": "user",
      "otherEntityField": "login"
    }
  ],
  "entityTableName": "sueno",
  "dto": "no",
  "pagination": "infinite-scroll",
  "service": "no",
  "jpaMetamodelFiltering": false,
  "fluentMethods": true,
  "readOnly": false,
  "embedded": false,
  "applications": ["gateway", "manilla"],
  "microserviceName": "manilla",
  "clientRootFolder": "manilla",
  "databaseType": "sql",
  "changelogDate": "20211111160152"
}
