id;superficial;profundo;despierto;time_instant
1;87255;1016;40077;2021-11-11T01:58:46
2;9566;39;30465;2021-11-11T06:05:28
3;77795;95322;95418;2021-11-11T15:16:42
4;98955;51726;28384;2021-11-11T07:20:11
5;70353;63305;28282;2021-11-11T12:12:37
6;45130;85001;19865;2021-11-11T01:22:41
7;49008;33103;19626;2021-11-10T16:21:28
8;41929;57500;30256;2021-11-11T06:56:38
9;3184;51147;35050;2021-11-11T00:03:45
10;87632;76157;66057;2021-11-10T20:12:57
