{
  "name": "Vacuna",
  "fields": [
    {
      "fieldName": "nombreVacuna",
      "fieldType": "String"
    },
    {
      "fieldName": "tipoVacuna",
      "fieldType": "String"
    },
    {
      "fieldName": "descripcionVacuna",
      "fieldType": "String"
    },
    {
      "fieldName": "fechaIngreso",
      "fieldType": "Instant"
    },
    {
      "fieldName": "loteVacuna",
      "fieldType": "String"
    }
  ],
  "relationships": [
    {
      "relationshipType": "many-to-one",
      "otherEntityName": "fabricante",
      "otherEntityRelationshipName": "vacuna",
      "relationshipName": "fabricante"
    }
  ],
  "entityTableName": "vacuna",
  "dto": "no",
  "pagination": "infinite-scroll",
  "service": "no",
  "jpaMetamodelFiltering": false,
  "fluentMethods": true,
  "readOnly": false,
  "embedded": false,
  "applications": ["gateway", "biologico"],
  "microserviceName": "biologico",
  "clientRootFolder": "biologico",
  "databaseType": "sql",
  "changelogDate": "20211111162653"
}
