{
  "name": "Espirometria",
  "fields": [
    {
      "fieldName": "fev1T",
      "fieldType": "Integer"
    },
    {
      "fieldName": "fev1R",
      "fieldType": "Integer"
    },
    {
      "fieldName": "fvcT",
      "fieldType": "Integer"
    },
    {
      "fieldName": "fvcR",
      "fieldType": "Integer"
    },
    {
      "fieldName": "indiceTP",
      "fieldType": "Integer"
    },
    {
      "fieldName": "fechaToma",
      "fieldType": "Instant"
    },
    {
      "fieldName": "resultado",
      "fieldType": "String"
    }
  ],
  "relationships": [
    {
      "relationshipType": "many-to-one",
      "otherEntityName": "user",
      "otherEntityRelationshipName": "espirometria",
      "relationshipName": "user",
      "otherEntityField": "login"
    }
  ],
  "entityTableName": "espirometria",
  "dto": "no",
  "pagination": "infinite-scroll",
  "service": "no",
  "jpaMetamodelFiltering": false,
  "fluentMethods": true,
  "readOnly": false,
  "embedded": false,
  "applications": ["gateway", "expedientemanual"],
  "microserviceName": "expedientemanual",
  "clientRootFolder": "expedientemanual",
  "databaseType": "sql",
  "changelogDate": "20211111155052"
}
