id;nombre;descripcion;fecha_ingreso;presentacion;generico
1;District Ergonomic;../fake-data/blob/hipster.txt;2021-11-11T00:56:44;Emulsion;../fake-data/blob/hipster.txt
2;blockchains Platinum;../fake-data/blob/hipster.txt;2021-11-11T06:53:24;Crema;../fake-data/blob/hipster.txt
3;haptic synthesize;../fake-data/blob/hipster.txt;2021-11-10T21:57:11;Comprimido;../fake-data/blob/hipster.txt
4;engineer;../fake-data/blob/hipster.txt;2021-11-11T11:24:25;Emulsion;../fake-data/blob/hipster.txt
5;EXE;../fake-data/blob/hipster.txt;2021-11-10T18:26:04;Pasta;../fake-data/blob/hipster.txt
6;infrastructure compress;../fake-data/blob/hipster.txt;2021-11-11T02:10:31;Gragea;../fake-data/blob/hipster.txt
7;copying;../fake-data/blob/hipster.txt;2021-11-11T04:02:12;Unguento;../fake-data/blob/hipster.txt
8;Universal Thailand;../fake-data/blob/hipster.txt;2021-11-11T12:59:34;Unguento;../fake-data/blob/hipster.txt
9;synthesize bypass and;../fake-data/blob/hipster.txt;2021-11-11T02:38:10;Comprimido;../fake-data/blob/hipster.txt
10;multi-state;../fake-data/blob/hipster.txt;2021-11-11T15:53:19;Suspension;../fake-data/blob/hipster.txt
