{
  "name": "Caloria",
  "fields": [
    {
      "fieldName": "caloriasActivas",
      "fieldType": "Integer"
    },
    {
      "fieldName": "descripcion",
      "fieldType": "String"
    },
    {
      "fieldName": "fechaRegistro",
      "fieldType": "Instant"
    }
  ],
  "relationships": [
    {
      "relationshipType": "many-to-one",
      "otherEntityName": "user",
      "otherEntityRelationshipName": "caloria",
      "relationshipName": "user",
      "otherEntityField": "login"
    }
  ],
  "entityTableName": "caloria",
  "dto": "no",
  "pagination": "infinite-scroll",
  "service": "no",
  "jpaMetamodelFiltering": false,
  "fluentMethods": true,
  "readOnly": false,
  "embedded": false,
  "applications": ["gateway", "manilla"],
  "microserviceName": "manilla",
  "clientRootFolder": "manilla",
  "databaseType": "sql",
  "changelogDate": "20211111155052"
}
