{
  "name": "Programa",
  "fields": [
    {
      "fieldName": "caloriasActividad",
      "fieldType": "Integer"
    },
    {
      "fieldName": "pasosActividad",
      "fieldType": "Integer"
    },
    {
      "fieldName": "fechaRegistro",
      "fieldType": "Instant"
    }
  ],
  "relationships": [
    {
      "relationshipType": "many-to-one",
      "otherEntityName": "user",
      "otherEntityRelationshipName": "programa",
      "relationshipName": "user",
      "otherEntityField": "login"
    }
  ],
  "entityTableName": "programa",
  "dto": "no",
  "pagination": "infinite-scroll",
  "service": "no",
  "jpaMetamodelFiltering": false,
  "fluentMethods": true,
  "readOnly": false,
  "embedded": false,
  "applications": ["gateway", "manilla"],
  "microserviceName": "manilla",
  "clientRootFolder": "manilla",
  "databaseType": "sql",
  "changelogDate": "20211111160052"
}
