{
  "name": "IPS",
  "fields": [
    {
      "fieldName": "nombre",
      "fieldType": "String"
    },
    {
      "fieldName": "nit",
      "fieldType": "String"
    },
    {
      "fieldName": "direccion",
      "fieldType": "String"
    },
    {
      "fieldName": "telefono",
      "fieldType": "String"
    },
    {
      "fieldName": "correoElectronico",
      "fieldType": "String"
    }
  ],
  "relationships": [],
  "entityTableName": "ips",
  "dto": "no",
  "pagination": "infinite-scroll",
  "service": "no",
  "jpaMetamodelFiltering": false,
  "fluentMethods": true,
  "readOnly": false,
  "embedded": false,
  "applications": ["gateway", "pacientes"],
  "microserviceName": "pacientes",
  "clientRootFolder": "pacientes",
  "databaseType": "sql",
  "changelogDate": "20211111161053"
}
