id;nombre;direccion;propietario
1;lime Tactics;Maine mobile Macao;transition Concrete
2;index Turkish Cambridgeshire;pixel;Plastic
3;sexy contingency;incubate Central;Gloves withdrawal
4;Account;optimize turn-key Technician;Won back
5;Lebanese Avon iterate;Customer Communications Loan;e-business
6;deposit;e-services programming South;payment
7;Saint software primary;Salad;Crossing Nevada Ergonomic
8;Gorgeous;Reactive Dram Nigeria;AGP IB Generic
9;Games;productize;Investment Montserrat
10;Saint Account;Arizona Corners;SDD scalable
