{
  "name": "Fabricante",
  "fields": [
    {
      "fieldName": "nombreFabricante",
      "fieldType": "byte[]",
      "fieldTypeBlobContent": "text"
    },
    {
      "fieldName": "productosFabricanet",
      "fieldType": "byte[]",
      "fieldTypeBlobContent": "text"
    },
    {
      "fieldName": "detalleFabricante",
      "fieldType": "byte[]",
      "fieldTypeBlobContent": "text"
    }
  ],
  "relationships": [],
  "entityTableName": "fabricante",
  "dto": "no",
  "pagination": "infinite-scroll",
  "service": "no",
  "jpaMetamodelFiltering": false,
  "fluentMethods": true,
  "readOnly": false,
  "embedded": false,
  "applications": ["gateway", "biologico"],
  "microserviceName": "biologico",
  "clientRootFolder": "biologico",
  "databaseType": "sql",
  "changelogDate": "20211111160253"
}
