{
  "name": "CicloActividad",
  "fields": [
    {
      "fieldName": "periodoCiclo",
      "fieldType": "Integer"
    },
    {
      "fieldName": "cantidad",
      "fieldType": "Integer"
    },
    {
      "fieldName": "fechaInicioCiclo",
      "fieldType": "Instant"
    }
  ],
  "relationships": [
    {
      "relationshipType": "many-to-one",
      "otherEntityName": "biologico",
      "otherEntityRelationshipName": "cicloActividad",
      "relationshipName": "biologico"
    },
    {
      "relationshipType": "many-to-one",
      "otherEntityName": "vacuna",
      "otherEntityRelationshipName": "cicloActividad",
      "relationshipName": "vacuna"
    },
    {
      "relationshipType": "many-to-one",
      "otherEntityName": "user",
      "otherEntityRelationshipName": "cicloActividad",
      "relationshipName": "user",
      "otherEntityField": "login"
    }
  ],
  "entityTableName": "ciclo_actividad",
  "dto": "no",
  "pagination": "infinite-scroll",
  "service": "no",
  "jpaMetamodelFiltering": false,
  "fluentMethods": true,
  "readOnly": false,
  "embedded": false,
  "applications": ["gateway", "biologico"],
  "microserviceName": "biologico",
  "clientRootFolder": "biologico",
  "databaseType": "sql",
  "changelogDate": "20211111155553"
}
