{
  "name": "Tratamiento",
  "fields": [
    {
      "fieldName": "descripcionTratamiento",
      "fieldType": "byte[]",
      "fieldTypeBlobContent": "text"
    },
    {
      "fieldName": "fechaInicio",
      "fieldType": "Instant"
    },
    {
      "fieldName": "fechaFin",
      "fieldType": "ZonedDateTime"
    }
  ],
  "relationships": [],
  "entityTableName": "tratamiento",
  "dto": "no",
  "pagination": "infinite-scroll",
  "service": "no",
  "jpaMetamodelFiltering": false,
  "fluentMethods": true,
  "readOnly": false,
  "embedded": false,
  "applications": ["gateway", "pacientes"],
  "microserviceName": "pacientes",
  "clientRootFolder": "pacientes",
  "databaseType": "sql",
  "changelogDate": "20211111162453"
}
