id;pais
1;Buckinghamshire
2;Networked algorithm
3;synthesize Beauty Loan
4;asymmetric Row
5;Georgia Rustic
6;Chair Bedfordshire
7;digital pink content
8;Clothing Cambridgeshire 1080p
9;card Awesome
10;Ergonomic
