{
  "name": "CuestionarioEstado",
  "fields": [
    {
      "fieldName": "valor",
      "fieldType": "Integer"
    },
    {
      "fieldName": "valoracion",
      "fieldType": "String"
    }
  ],
  "relationships": [
    {
      "relationshipType": "many-to-one",
      "otherEntityName": "pregunta",
      "otherEntityRelationshipName": "cuestionarioEstado",
      "relationshipName": "pregunta",
      "otherEntityField": "pregunta"
    }
  ],
  "entityTableName": "cuestionario_estado",
  "dto": "no",
  "pagination": "infinite-scroll",
  "service": "no",
  "jpaMetamodelFiltering": false,
  "fluentMethods": true,
  "readOnly": false,
  "embedded": false,
  "applications": ["gateway", "pacientes"],
  "microserviceName": "pacientes",
  "clientRootFolder": "pacientes",
  "databaseType": "sql",
  "changelogDate": "20211111155853"
}
