<?xml version="1.0" standalone="no"?>
<!DOCTYPE svg PUBLIC "-//W3C//DTD SVG 1.1//EN" "http://www.w3.org/Graphics/SVG/1.1/DTD/svg11.dtd">
<svg xmlns="http://www.w3.org/2000/svg">
<metadata>Copyright (C) 2021 by original authors @ fontello.com</metadata>
<defs>
<font id="fontello" horiz-adv-x="1000" >
<font-face font-family="fontello" font-weight="400" font-stretch="normal" units-per-em="1000" ascent="850" descent="-150" />
<missing-glyph horiz-adv-x="1000" />
<glyph glyph-name="th-list" unicode="&#xe800;" d="M1000 850v-160h-1000v160h1000z m0-280v-160h-1000v160h1000z m0-280v-160h-1000v160h1000z m0-280v-160h-1000v160h1000z" horiz-adv-x="1000" />

<glyph glyph-name="right-open" unicode="&#xe801;" d="M154 849l500-500-500-500-154 154 346 346-346 346z" horiz-adv-x="654" />

<glyph glyph-name="left-open" unicode="&#xe802;" d="M308 349l346-346-154-154-500 500 500 500 154-154z" horiz-adv-x="654" />
</font>
</defs>
</svg>
