<svg width="153" height="58" viewBox="0 0 153 58" fill="none" xmlns="http://www.w3.org/2000/svg">
<path d="M24.6817 25.3913H17.7942V15.2174H14.4812V25.3913H7.59375V0H14.4812V8.95652H17.7942V0H24.6817V25.3913Z" fill="white"/>
<path d="M17.3608 43.9321V4.04297C17.3608 4.04297 14.4918 8.03188 9.36218 10.3732C4.23261 12.7145 0.581055 13.4082 0.581055 13.4082C0.581055 13.4082 0.581055 16.7901 0.581055 25.1148C0.581055 43.5852 17.3608 43.9321 17.3608 43.9321Z" fill="#1962BA"/>
<path d="M17.3613 43.9321V4.04297C17.3613 4.04297 20.2304 8.03188 25.36 10.3732C30.4895 12.7145 34.1411 13.4082 34.1411 13.4082C34.1411 13.4082 34.1411 16.7901 34.1411 25.1148C34.1411 43.5852 17.3613 43.9321 17.3613 43.9321Z" fill="#1962BA"/>
<path d="M25.1861 38.2956H18.3177V28.1498H15.0139V38.2956H8.14551V12.9746H15.0139V21.9063H18.3177V12.9746H25.1861V38.2956Z" fill="white"/>
<path d="M43.9653 13.0615H47.7038V23.8142H53.1812V13.0615H56.9197V40.5503H53.1812V27.0227H47.7038V40.6371H43.9653V13.0615Z" fill="#232323"/>
<path d="M60.0493 13.0615H69.9607V16.1833H63.7878V24.9416H69.2652V28.0633H63.7878V37.4286H69.9607V40.5504H60.0493V13.0615Z" fill="#232323"/>
<path d="M72.3086 13.0615H77.1773C79.177 13.0615 80.742 13.5818 81.6983 14.5357C82.9155 15.7497 83.611 17.6574 83.611 20.2589C83.611 22.2534 83.2633 23.8142 82.6547 25.0283C81.9591 26.2423 81.0897 26.936 79.7856 27.2829L84.8282 40.6371H81.0897L76.0471 27.1962V40.6371H72.3086V13.0615ZM75.9602 25.2884C77.4382 25.2884 78.3945 24.9416 79.0031 24.2478C79.6117 23.5541 79.8725 22.4268 79.8725 20.8659C79.8725 19.9988 79.7856 19.305 79.6987 18.698C79.6117 18.091 79.3509 17.5707 79.0901 17.2239C78.8292 16.877 78.4815 16.5301 78.0468 16.3567C77.612 16.1833 77.0904 16.0966 76.5687 16.0966H75.9602V25.2884Z" fill="#232323"/>
<path d="M100.217 27.5432C100.217 32.3993 99.6949 35.8679 98.5646 37.8623C97.5213 39.9435 95.6956 40.8974 93.0873 40.8974C90.3921 40.8974 88.4794 39.7701 87.4361 37.6022C86.3928 35.4343 85.7842 31.6188 85.7842 26.1558C85.7842 21.2997 86.3058 17.8311 87.4361 15.7499C88.4794 13.6687 90.3921 12.7148 92.9134 12.7148C95.2608 12.7148 96.9127 13.4953 98.043 15.0562C98.7385 16.0968 99.3471 17.6576 99.6949 19.5654C100.043 21.3864 100.217 24.0746 100.217 27.5432ZM96.3911 27.8901C96.3911 23.1207 96.2172 19.9989 95.7825 18.4381C95.3478 16.8772 94.4784 16.0967 93.1742 16.0967C91.8701 16.0967 91.0007 16.7905 90.566 18.2646C90.1313 19.7388 89.9574 22.6004 89.9574 27.0229C89.9574 31.0118 90.2182 33.8734 90.6529 35.4343C91.0876 36.9085 91.9571 37.6022 93.2612 37.6022C94.4784 37.6022 95.3478 36.9085 95.8694 35.521C96.1303 34.1336 96.3911 31.6188 96.3911 27.8901Z" fill="#232323"/>
<path d="M102.912 13.0615H106.563V32.4858C106.563 34.4803 106.737 35.781 107.085 36.4747C107.433 37.1684 108.215 37.4286 109.258 37.4286C110.302 37.4286 111.084 37.1684 111.432 36.5614C111.78 35.9544 111.954 34.8271 111.954 33.0061V13.0615H115.605V33.0061C115.605 36.0411 115.17 38.0356 114.214 39.0762C113.084 40.2902 111.432 40.8972 109.171 40.8972C106.65 40.8972 104.911 40.1168 103.955 38.5559C103.259 37.5153 102.912 35.4341 102.912 32.4858V13.0615Z" fill="#232323"/>
<path d="M118.735 13.0615H122.213L125.952 24.0744C126.995 27.1962 127.951 30.4913 128.821 33.96C128.56 31.7921 128.299 29.8843 128.125 28.15C127.951 26.4157 127.951 24.7681 127.951 23.294V13.0615H131.69V40.5504H128.212L124.039 28.15C123.691 27.0227 123.256 25.8087 122.996 24.5947C122.648 23.3807 122.3 22.0799 122.039 20.7792C122.039 20.6058 121.952 20.4323 121.952 20.1722C121.865 19.9121 121.865 19.6519 121.778 19.3918C121.778 19.7386 121.865 19.9988 121.865 20.1722C121.865 20.4323 121.865 20.6058 121.952 20.6925L122.126 23.4674L122.3 26.8493C122.3 27.0227 122.3 27.2829 122.3 27.543C122.3 27.8032 122.3 28.15 122.3 28.4969L122.474 40.4636H118.822V13.0615H118.735Z" fill="#232323"/>
<path d="M134.819 13.0615H138.558V40.5504H134.819V13.0615Z" fill="#232323"/>
<path d="M140.21 13.0615H152.295V16.27H148.122V40.5504H144.47V16.27H140.21V13.0615Z" fill="#232323"/>
<path d="M48.1191 55.2637L47.4771 53.8249H44.4758L43.8415 55.2637H43.2691L45.7057 49.8568H46.2627L48.6992 55.2637H48.1191ZM44.6847 53.3453H47.2682L45.9687 50.4215L44.6847 53.3453ZM51.6147 51.195C52.0995 51.195 52.4785 51.3368 52.7518 51.6204C53.0303 51.8989 53.1695 52.2831 53.1695 52.7729V55.2637H52.6435V52.8967C52.6435 52.5151 52.5378 52.216 52.3264 51.9994C52.1149 51.7828 51.821 51.6745 51.4446 51.6745C51.0269 51.6797 50.6917 51.8086 50.439 52.0613C50.1915 52.314 50.0497 52.6543 50.0136 53.0824V55.2637H49.4953V51.2104H50.0136V52.1541C50.1528 51.8396 50.3565 51.6024 50.6246 51.4425C50.8979 51.2826 51.228 51.2001 51.6147 51.195ZM60.8172 55.2637L60.1752 53.8249H57.1739L56.5396 55.2637H55.9672L58.4038 49.8568H58.9607L61.3973 55.2637H60.8172ZM57.3828 53.3453H59.9663L58.6668 50.4215L57.3828 53.3453ZM64.7977 52.1309C64.4676 51.8112 64.0628 51.6513 63.5832 51.6513C63.2945 51.6513 63.034 51.7184 62.802 51.8525C62.5699 51.9865 62.3894 52.1748 62.2605 52.4171C62.1316 52.6543 62.0671 52.9276 62.0671 53.2371C62.0671 53.5465 62.1316 53.8224 62.2605 54.0647C62.3894 54.3071 62.5699 54.4953 62.802 54.6294C63.034 54.7635 63.2945 54.8305 63.5832 54.8305C63.8462 54.8305 64.086 54.7841 64.3026 54.6913C64.5243 54.5984 64.71 54.4644 64.8595 54.289L65.1535 54.5984C64.973 54.815 64.7461 54.9826 64.4728 55.1012C64.1995 55.2198 63.8952 55.2791 63.56 55.2791C63.1733 55.2791 62.8278 55.1941 62.5235 55.0239C62.2193 54.8486 61.9795 54.6062 61.8041 54.2968C61.634 53.9822 61.5489 53.629 61.5489 53.2371C61.5489 52.8451 61.634 52.4945 61.8041 52.1851C61.9795 51.8705 62.2193 51.6281 62.5235 51.458C62.8278 51.2826 63.1733 51.195 63.56 51.195C63.8746 51.195 64.1608 51.2465 64.4186 51.3497C64.6816 51.4528 64.9059 51.5972 65.0916 51.7828L64.7977 52.1309ZM69.2187 55.2637L67.7799 53.152L66.8672 54.0879V55.2637H66.3489V49.5242H66.8672V53.4227L69.0485 51.2104H69.6673L68.1435 52.7807L69.8452 55.2637H69.2187ZM70.7377 49.5242H71.256V55.2637H70.7377V49.5242ZM74.3921 51.195C75.0212 51.195 75.5008 51.3961 75.8309 51.7983C76.1609 52.1954 76.313 52.7317 76.2872 53.4072H72.907C72.9431 53.8404 73.1029 54.1911 73.3865 54.4592C73.6702 54.7222 74.0208 54.8537 74.4385 54.8537C74.6964 54.8537 74.9362 54.8073 75.1579 54.7145C75.3796 54.6217 75.5704 54.4902 75.7303 54.32L76.0242 54.6139C75.8283 54.8253 75.5911 54.9904 75.3126 55.109C75.0393 55.2224 74.7376 55.2791 74.4076 55.2791C74.0157 55.2791 73.6676 55.1941 73.3633 55.0239C73.0591 54.8486 72.8193 54.6062 72.644 54.2968C72.4738 53.9874 72.3887 53.6341 72.3887 53.2371C72.3887 52.8451 72.4738 52.4945 72.644 52.1851C72.8193 51.8705 73.0591 51.6281 73.3633 51.458C73.6676 51.2826 74.0105 51.195 74.3921 51.195ZM75.8231 53.005C75.7973 52.5821 75.6555 52.247 75.3977 51.9994C75.145 51.7467 74.8124 51.6204 74.3998 51.6204C73.9925 51.6204 73.6521 51.7467 73.3788 51.9994C73.1055 52.2521 72.9482 52.5873 72.907 53.005H75.8231ZM79.4886 51.195C79.9733 51.195 80.3523 51.3368 80.6256 51.6204C80.9041 51.8989 81.0433 52.2831 81.0433 52.7729V55.2637H80.5173V52.8967C80.5173 52.5151 80.4116 52.216 80.2002 51.9994C79.9888 51.7828 79.6948 51.6745 79.3184 51.6745C78.9007 51.6797 78.5655 51.8086 78.3128 52.0613C78.0653 52.314 77.9235 52.6543 77.8874 53.0824V55.2637H77.3691V51.2104H77.8874V52.1541C78.0266 51.8396 78.2303 51.6024 78.4985 51.4425C78.7718 51.2826 79.1018 51.2001 79.4886 51.195ZM88.691 55.2637L88.049 53.8249H85.0477L84.4135 55.2637H83.8411L86.2776 49.8568H86.8346L89.2711 55.2637H88.691ZM85.2566 53.3453H87.8401L86.5406 50.4215L85.2566 53.3453ZM89.2194 51.2104H89.7764L91.1223 54.7454L92.4527 51.2104H92.9942L91.3853 55.2637H90.8361L89.2194 51.2104ZM95.188 51.195C95.8171 51.195 96.2967 51.3961 96.6267 51.7983C96.9567 52.1954 97.1089 52.7317 97.0831 53.4072H93.7028C93.7389 53.8404 93.8988 54.1911 94.1824 54.4592C94.466 54.7222 94.8167 54.8537 95.2344 54.8537C95.4922 54.8537 95.732 54.8073 95.9537 54.7145C96.1755 54.6217 96.3663 54.4902 96.5261 54.32L96.8201 54.6139C96.6241 54.8253 96.3869 54.9904 96.1084 55.109C95.8351 55.2224 95.5335 55.2791 95.2034 55.2791C94.8115 55.2791 94.4634 55.1941 94.1592 55.0239C93.8549 54.8486 93.6151 54.6062 93.4398 54.2968C93.2696 53.9874 93.1845 53.6341 93.1845 53.2371C93.1845 52.8451 93.2696 52.4945 93.4398 52.1851C93.6151 51.8705 93.8549 51.6281 94.1592 51.458C94.4634 51.2826 94.8064 51.195 95.188 51.195ZM96.619 53.005C96.5932 52.5821 96.4514 52.247 96.1935 51.9994C95.9408 51.7467 95.6082 51.6204 95.1957 51.6204C94.7883 51.6204 94.448 51.7467 94.1746 51.9994C93.9013 52.2521 93.7441 52.5873 93.7028 53.005H96.619ZM100.284 51.195C100.769 51.195 101.148 51.3368 101.421 51.6204C101.7 51.8989 101.839 52.2831 101.839 52.7729V55.2637H101.313V52.8967C101.313 52.5151 101.207 52.216 100.996 51.9994C100.785 51.7828 100.491 51.6745 100.114 51.6745C99.6965 51.6797 99.3613 51.8086 99.1087 52.0613C98.8611 52.314 98.7193 52.6543 98.6832 53.0824V55.2637H98.165V51.2104H98.6832V52.1541C98.8225 51.8396 99.0262 51.6024 99.2943 51.4425C99.5676 51.2826 99.8977 51.2001 100.284 51.195ZM106.707 51.2104V55.2637H106.181V54.2968C106.047 54.6165 105.846 54.8589 105.578 55.0239C105.315 55.1889 104.995 55.274 104.618 55.2791C104.139 55.2791 103.762 55.1399 103.489 54.8614C103.221 54.5778 103.087 54.1911 103.087 53.7012V51.2104H103.613V53.5774C103.613 53.959 103.716 54.2581 103.922 54.4747C104.134 54.6861 104.422 54.7918 104.789 54.7918C105.222 54.7867 105.562 54.6397 105.81 54.3509C106.057 54.057 106.181 53.6728 106.181 53.1984V51.2104H106.707ZM109.79 51.195C110.419 51.195 110.898 51.3961 111.228 51.7983C111.558 52.1954 111.711 52.7317 111.685 53.4072H108.304C108.341 53.8404 108.5 54.1911 108.784 54.4592C109.068 54.7222 109.418 54.8537 109.836 54.8537C110.094 54.8537 110.334 54.8073 110.555 54.7145C110.777 54.6217 110.968 54.4902 111.128 54.32L111.422 54.6139C111.226 54.8253 110.989 54.9904 110.71 55.109C110.437 55.2224 110.135 55.2791 109.805 55.2791C109.413 55.2791 109.065 55.1941 108.761 55.0239C108.457 54.8486 108.217 54.6062 108.041 54.2968C107.871 53.9874 107.786 53.6341 107.786 53.2371C107.786 52.8451 107.871 52.4945 108.041 52.1851C108.217 51.8705 108.457 51.6281 108.761 51.458C109.065 51.2826 109.408 51.195 109.79 51.195ZM111.221 53.005C111.195 52.5821 111.053 52.247 110.795 51.9994C110.543 51.7467 110.21 51.6204 109.797 51.6204C109.39 51.6204 109.05 51.7467 108.776 51.9994C108.503 52.2521 108.346 52.5873 108.304 53.005H111.221ZM118.919 50.9552C118.703 50.7437 118.452 50.5787 118.169 50.4601C117.885 50.3415 117.591 50.2822 117.287 50.2822C116.869 50.2822 116.485 50.3828 116.134 50.5839C115.789 50.785 115.513 51.0609 115.307 51.4116C115.106 51.7571 115.005 52.1361 115.005 52.5486C115.005 52.9612 115.106 53.3402 115.307 53.6857C115.513 54.0312 115.789 54.3071 116.134 54.5134C116.485 54.7145 116.869 54.815 117.287 54.815C117.586 54.815 117.877 54.7583 118.161 54.6449C118.445 54.5263 118.697 54.3638 118.919 54.1575L119.244 54.5056C118.976 54.7532 118.669 54.9491 118.324 55.0935C117.978 55.2379 117.625 55.3101 117.264 55.3101C116.753 55.3101 116.284 55.1863 115.856 54.9388C115.428 54.6913 115.088 54.3561 114.835 53.9332C114.587 53.5104 114.464 53.0488 114.464 52.5486C114.464 52.0484 114.59 51.5895 114.843 51.1718C115.095 50.7541 115.436 50.424 115.864 50.1817C116.297 49.9341 116.769 49.8104 117.279 49.8104C117.645 49.8104 117.999 49.88 118.339 50.0192C118.679 50.1533 118.978 50.3415 119.236 50.5839L118.919 50.9552ZM121.809 51.195C122.201 51.195 122.552 51.2826 122.861 51.458C123.17 51.6281 123.413 51.8679 123.588 52.1773C123.763 52.4867 123.851 52.8374 123.851 53.2293C123.851 53.6264 123.763 53.9822 123.588 54.2968C123.413 54.6062 123.17 54.8486 122.861 55.0239C122.552 55.1941 122.201 55.2791 121.809 55.2791C121.417 55.2791 121.066 55.1941 120.757 55.0239C120.448 54.8486 120.205 54.6062 120.03 54.2968C119.855 53.9822 119.767 53.6264 119.767 53.2293C119.767 52.8374 119.855 52.4867 120.03 52.1773C120.205 51.8679 120.448 51.6281 120.757 51.458C121.066 51.2826 121.417 51.195 121.809 51.195ZM121.809 51.6436C121.515 51.6436 121.252 51.7106 121.02 51.8447C120.788 51.9788 120.607 52.167 120.478 52.4094C120.35 52.6518 120.285 52.9276 120.285 53.2371C120.285 53.5516 120.35 53.8301 120.478 54.0725C120.607 54.3148 120.788 54.503 121.02 54.6371C121.252 54.7712 121.515 54.8382 121.809 54.8382C122.103 54.8382 122.366 54.7712 122.598 54.6371C122.83 54.503 123.01 54.3148 123.139 54.0725C123.268 53.8301 123.333 53.5516 123.333 53.2371C123.333 52.9276 123.268 52.6518 123.139 52.4094C123.01 52.167 122.83 51.9788 122.598 51.8447C122.366 51.7106 122.103 51.6436 121.809 51.6436ZM130.126 51.195C130.605 51.195 130.979 51.3342 131.247 51.6127C131.516 51.8911 131.65 52.2779 131.65 52.7729V55.2637H131.124V52.8967C131.124 52.5099 131.018 52.2109 130.807 51.9994C130.6 51.7828 130.314 51.6745 129.948 51.6745C129.515 51.6849 129.174 51.8344 128.927 52.1232C128.685 52.412 128.563 52.7936 128.563 53.268V55.2637H128.037V52.8967C128.037 52.5099 127.932 52.2109 127.72 51.9994C127.514 51.7828 127.228 51.6745 126.862 51.6745C126.428 51.6849 126.088 51.8344 125.841 52.1232C125.593 52.412 125.469 52.7936 125.469 53.268V55.2637H124.951V51.2104H125.469V52.1619C125.603 51.8421 125.802 51.6024 126.065 51.4425C126.333 51.2826 126.658 51.2001 127.04 51.195C127.426 51.195 127.746 51.2904 127.999 51.4812C128.257 51.672 128.427 51.9401 128.509 52.2856C128.633 51.9247 128.832 51.6539 129.105 51.4734C129.383 51.2929 129.724 51.2001 130.126 51.195ZM135.207 51.195C135.584 51.195 135.919 51.2826 136.213 51.458C136.512 51.6281 136.744 51.8705 136.909 52.1851C137.074 52.4945 137.157 52.8477 137.157 53.2448C137.157 53.6367 137.074 53.9874 136.909 54.2968C136.744 54.6062 136.515 54.8486 136.221 55.0239C135.927 55.1941 135.591 55.2791 135.215 55.2791C134.844 55.2791 134.519 55.1966 134.24 55.0316C133.962 54.8614 133.745 54.6268 133.591 54.3277V56.7643H133.072V51.2104H133.591V52.1464C133.74 51.8473 133.954 51.6152 134.233 51.4502C134.516 51.2801 134.841 51.195 135.207 51.195ZM135.114 54.8305C135.403 54.8305 135.664 54.7635 135.896 54.6294C136.128 54.4902 136.308 54.2994 136.437 54.057C136.566 53.8146 136.631 53.5387 136.631 53.2293C136.631 52.9251 136.566 52.6518 136.437 52.4094C136.308 52.167 136.128 51.9788 135.896 51.8447C135.664 51.7055 135.403 51.6359 135.114 51.6359C134.821 51.6359 134.558 51.7055 134.325 51.8447C134.099 51.9788 133.918 52.167 133.784 52.4094C133.655 52.6518 133.591 52.9251 133.591 53.2293C133.591 53.5387 133.655 53.8146 133.784 54.057C133.913 54.2994 134.093 54.4902 134.325 54.6294C134.558 54.7635 134.821 54.8305 135.114 54.8305ZM140.798 55.2637L140.791 54.583C140.631 54.8202 140.422 54.9981 140.164 55.1167C139.906 55.2302 139.61 55.2869 139.274 55.2869C139.001 55.2869 138.759 55.2353 138.547 55.1322C138.341 55.0239 138.181 54.8769 138.068 54.6913C137.954 54.5056 137.898 54.2968 137.898 54.0647C137.898 53.7141 138.032 53.4382 138.3 53.2371C138.573 53.0359 138.947 52.9354 139.421 52.9354H140.783V52.626C140.783 52.3063 140.687 52.0587 140.497 51.8834C140.306 51.7081 140.027 51.6204 139.661 51.6204C139.228 51.6204 138.792 51.7828 138.354 52.1077L138.122 51.7519C138.395 51.5611 138.656 51.4219 138.903 51.3342C139.151 51.2414 139.434 51.195 139.754 51.195C140.244 51.195 140.623 51.3187 140.891 51.5663C141.159 51.8086 141.296 52.1464 141.301 52.5796L141.309 55.2637H140.798ZM139.367 54.8537C139.728 54.8537 140.033 54.7712 140.28 54.6062C140.533 54.436 140.703 54.1988 140.791 53.8945V53.3376H139.483C139.128 53.3376 138.857 53.3969 138.671 53.5155C138.485 53.6341 138.393 53.812 138.393 54.0492C138.393 54.2916 138.48 54.4876 138.656 54.6371C138.836 54.7815 139.073 54.8537 139.367 54.8537ZM144.815 51.195C145.299 51.195 145.678 51.3368 145.952 51.6204C146.23 51.8989 146.369 52.2831 146.369 52.7729V55.2637H145.843V52.8967C145.843 52.5151 145.738 52.216 145.526 51.9994C145.315 51.7828 145.021 51.6745 144.644 51.6745C144.227 51.6797 143.891 51.8086 143.639 52.0613C143.391 52.314 143.249 52.6543 143.213 53.0824V55.2637H142.695V51.2104H143.213V52.1541C143.353 51.8396 143.556 51.6024 143.824 51.4425C144.098 51.2826 144.428 51.2001 144.815 51.195ZM148.782 55.8438C148.658 56.1532 148.493 56.3879 148.287 56.5477C148.085 56.7076 147.853 56.7875 147.59 56.7875C147.276 56.7875 146.997 56.6947 146.755 56.509L146.987 56.1068C147.168 56.2306 147.361 56.2925 147.567 56.2925C147.732 56.2925 147.882 56.2383 148.016 56.13C148.15 56.0217 148.261 55.8644 148.348 55.6582L148.519 55.2405L146.84 51.2104H147.389L148.782 54.6913L150.12 51.2104H150.654L148.782 55.8438Z" fill="#1962BA"/>
</svg>
