{
    "data": [
        {
            "previewImageSrc": "assets/img/galleria-login/Escritorio_06.png",
            "alt": "Imagen de plataforma de gestión documental",
            "title": "Plataforma de gestión documental"
        },
        {
            "previewImageSrc": "assets/img/galleria-login/Escritorio_05.png",
            "alt": "Imagen de taxonomias y categorización de documentos",
            "title": "Taxonomias y categorización de documentos"
        },
        {
            "previewImageSrc": "assets/img/galleria-login/Escritorio_07.png",
            "alt": "Imagen de almacenamiento seguro de archivos",
            "title": "Almacenamiento seguro de archivos"
        }
    ]
}