[
   {
      "key":"brave",
      "label":"brave",
      "required":false,
      "order":9,
      "controlType":"dropdown",
      "type":"",
      "mode":"",
      "options":[
         {
            "key":"solid",
            "value":"Solid"
         },
         {
            "key":"great",
            "value":"Great"
         },
         {
            "key":"good",
            "value":"Good"
         },
         {
            "key":"unproven",
            "value":"Unproven"
         }
      ]
   },
   {
      "value":"Bombasto",
      "key":"firstName",
      "label":"First name",
      "required":false,
      "order":1,
      "controlType":"textbox",
      "type":"",
      "mode":"",
      "options":[
         
      ]
   },
   {
      "key":"acta",
      "label":"acta",
      "required":false,
      "order":2,
      "controlType":"textbox",
      "type":"acta",
      "mode":"acta",
      "options":[
         
      ]
   },
   {
      "key":"numero",
      "label":"numero2",
      "required":false,
      "order":3,
      "controlType":"inputnumber",
      "type":"number",
      "mode":"number",
      "options":[
         
      ]
   },
   {
      "key":"calendario",
      "label":"calendario",
      "required":false,
      "order":4,
      "controlType":"calendardate",
      "type":"",
      "mode":"",
      "options":[
         
      ]
   },
   {
      "key":"1",
      "label":"calendar",
      "required":false,
      "order":5,
      "controlType":"calendardate",
      "type":"",
      "mode":"",
      "options":[
         
      ]
   },
   {
      "key":"3",
      "label":"Switch",
      "required":false,
      "order":6,
      "controlType":"inputSwitch",
      "type":"",
      "mode":"",
      "options":[
         
      ]
   },
   {
      "key":"10",
      "label":"Switch2",
      "required":false,
      "order":12,
      "controlType":"inputnumberdecimal",
      "type":"",
      "mode":"",
      "options":[
         
      ]
   },
   {
      "key":"10",
      "label":"Switch2",
      "required":false,
      "order":12,
      "controlType":"inputnumberdecimal",
      "type":"",
      "mode":"",
      "options":[
         
      ]
   },
   {
      "key":"10",
      "label":"Switch2",
      "required":false,
      "order":12,
      "controlType":"inputnumberdecimal",
      "type":"",
      "mode":"",
      "options":[
         
      ]
   },
   {
      "key":"10",
      "label":"Switch2",
      "required":false,
      "order":12,
      "controlType":"inputnumberdecimal",
      "type":"",
      "mode":"",
      "options":[
         
      ]
   },
   {
      "key":"10",
      "label":"Switch2",
      "required":false,
      "order":12,
      "controlType":"inputnumberdecimal",
      "type":"",
      "mode":"",
      "options":[
         
      ]
   },
   {
      "key":"10",
      "label":"Switch2",
      "required":false,
      "order":12,
      "controlType":"inputnumberdecimal",
      "type":"",
      "mode":"",
      "options":[
         
      ]
   },
   {
      "key":"10",
      "label":"Switch2",
      "required":false,
      "order":12,
      "controlType":"inputnumberdecimal",
      "type":"",
      "mode":"",
      "options":[
         
      ]
   },
   {
      "key":"10",
      "label":"Switch2",
      "required":false,
      "order":12,
      "controlType":"inputnumberdecimal",
      "type":"",
      "mode":"",
      "options":[
         
      ]
   },
   {
      "key":"10",
      "label":"Switch2",
      "required":false,
      "order":12,
      "controlType":"inputnumberdecimal",
      "type":"",
      "mode":"",
      "options":[
         
      ]
   },
   {
      "key":"10",
      "label":"Switch2",
      "required":false,
      "order":12,
      "controlType":"inputnumberdecimal",
      "type":"",
      "mode":"",
      "options":[
         
      ]
   }
]