{
  "id": "user1",
  "firstName": "Aya",
  "lastName": "estanislao",
  "email": "ayaestanislao@gmail.com",
  "password": "1234aya",
  "mobileNumber": "09616198334",
  "isAdmin": false,
  "enrollments": [
    {
      "id0": "user1-course1",
      "courseId": "course1",
      "courseName": "Math101""dateEnrolled": "01/15/2022"
    }
  ]
},
{
  "id": "user2",
  "firstName": "kyle",
  "lastName": "luis",
  "email": "kyleluis@gmail.com",
  "password": "1234kyle",
  "mobileNumber": 09616198332,
  "isAdmin": true,
  "enrollments": [
    {
      "id": "user2-course2",
      "courseId": "course2",
      "courseName": "Math101"
    }
  ]
}