<?xml version="1.0" encoding="utf-8"?>
<!-- Generator: Adobe Illustrator 25.2.3, SVG Export Plug-In . SVG Version: 6.00 Build 0)  -->
<svg version="1.1" id="Livello_1" xmlns="http://www.w3.org/2000/svg" xmlns:xlink="http://www.w3.org/1999/xlink" x="0px" y="0px"
	 viewBox="0 0 2024.2 1036.5" style="enable-background:new 0 0 2024.2 1036.5;" xml:space="preserve">
<style type="text/css">
	.st0{fill:#7472F1;}
	.st1{fill:#5E5CE4;}
</style>
<g id="Livello_3">
	<polygon class="st0" points="-0.1,1036.5 2024.2,582.2 2024.2,-0.2 -0.1,-0.2 	"/>
</g>
<g id="Livello_4">
	<line class="st1" x1="2027.1" y1="-0.2" x2="-0.1" y2="-0.2"/>
	<polyline class="st1" points="-0.1,-0.2 -0.1,51.4 668.3,886 2027.1,583.7 2027.1,-0.2 	"/>
</g>
</svg>
