1970-01-01,3700437
1975-01-01,4079480
1980-01-01,4458003
1985-01-01,4870922
1990-01-01,5327231
1995-01-01,5744213
2000-01-01,6143494
2005-01-01,6541907
2010-01-01,6956824
2015-01-01,7379797
2020-01-01,7794799