<?xml version="1.0" encoding="UTF-8" standalone="no"?>
<!-- Created with Inkscape (http://www.inkscape.org/) -->

<svg
   xmlns:dc="http://purl.org/dc/elements/1.1/"
   xmlns:cc="http://creativecommons.org/ns#"
   xmlns:rdf="http://www.w3.org/1999/02/22-rdf-syntax-ns#"
   xmlns:svg="http://www.w3.org/2000/svg"
   xmlns="http://www.w3.org/2000/svg"
   xmlns:xlink="http://www.w3.org/1999/xlink"
   xmlns:sodipodi="http://sodipodi.sourceforge.net/DTD/sodipodi-0.dtd"
   xmlns:inkscape="http://www.inkscape.org/namespaces/inkscape"
   width="235"
   height="224"
   viewBox="0 0 62.177082 59.266668"
   version="1.1"
   id="svg8"
   inkscape:version="0.92.5 (2060ec1f9f, 2020-04-08)"
   sodipodi:docname="gitlab.svg">
  <defs
     id="defs2">
    <linearGradient
       inkscape:collect="always"
       id="linearGradient1068">
      <stop
         style="stop-color:#eaff24;stop-opacity:1"
         offset="0"
         id="stop1064" />
      <stop
         id="stop1072"
         offset="0.39655173"
         style="stop-color:#95ff10;stop-opacity:0.92156863;" />
      <stop
         style="stop-color:#95ff10;stop-opacity:0;"
         offset="1"
         id="stop1066" />
    </linearGradient>
    <linearGradient
       inkscape:collect="always"
       id="linearGradient900">
      <stop
         style="stop-color:#efffbe;stop-opacity:1"
         offset="0"
         id="stop896" />
      <stop
         style="stop-color:#c3ff10;stop-opacity:0"
         offset="1"
         id="stop898" />
    </linearGradient>
    <linearGradient
       inkscape:collect="always"
       id="linearGradient888">
      <stop
         style="stop-color:#00d766;stop-opacity:1"
         offset="0"
         id="stop884" />
      <stop
         style="stop-color:#009647;stop-opacity:0;"
         offset="1"
         id="stop886" />
    </linearGradient>
    <linearGradient
       id="linearGradient880"
       inkscape:collect="always">
      <stop
         id="stop876"
         offset="0"
         style="stop-color:#8afe00;stop-opacity:1" />
      <stop
         id="stop878"
         offset="1"
         style="stop-color:#44d700;stop-opacity:0;" />
    </linearGradient>
    <linearGradient
       inkscape:collect="always"
       id="linearGradient843">
      <stop
         style="stop-color:#44d700;stop-opacity:1;"
         offset="0"
         id="stop839" />
      <stop
         style="stop-color:#44d700;stop-opacity:0;"
         offset="1"
         id="stop841" />
    </linearGradient>
    <linearGradient
       gradientTransform="matrix(3.7795276,0,0,3.7795276,0,-707.34698)"
       inkscape:collect="always"
       xlink:href="#linearGradient843"
       id="linearGradient845-9"
       x1="0"
       y1="239.26978"
       x2="89.000748"
       y2="239.26978"
       gradientUnits="userSpaceOnUse" />
    <radialGradient
       inkscape:collect="always"
       xlink:href="#linearGradient888"
       id="radialGradient892"
       cx="-4.2421426e-15"
       cy="288.31375"
       fx="-4.2421426e-15"
       fy="288.31375"
       r="80.982666"
       gradientTransform="matrix(0.48572094,0,0,0.84893975,0,47.288332)"
       gradientUnits="userSpaceOnUse" />
    <radialGradient
       inkscape:collect="always"
       xlink:href="#linearGradient1068"
       id="radialGradient1070"
       cx="31.088541"
       cy="294.02188"
       fx="31.088541"
       fy="294.02188"
       r="2.9992409"
       gradientTransform="matrix(0.75828264,0,0,0.46864445,7.5146402,157.75026)"
       gradientUnits="userSpaceOnUse" />
    <linearGradient
       inkscape:collect="always"
       xlink:href="#linearGradient880"
       id="linearGradient882"
       gradientUnits="userSpaceOnUse"
       gradientTransform="matrix(0.34685996,0,0,0.34685996,0,190.97873)"
       x1="0"
       y1="239.26978"
       x2="89.000748"
       y2="239.26978" />
    <linearGradient
       inkscape:collect="always"
       xlink:href="#linearGradient843"
       id="linearGradient884"
       gradientUnits="userSpaceOnUse"
       gradientTransform="matrix(0.34685996,0,0,0.34685996,0,190.97873)"
       x1="51.581104"
       y1="291.80847"
       x2="51.581104"
       y2="185.21918" />
    <radialGradient
       inkscape:collect="always"
       xlink:href="#linearGradient900"
       id="radialGradient886"
       gradientUnits="userSpaceOnUse"
       gradientTransform="matrix(0.89879508,0,0,1.6888322,0,-133.64742)"
       cx="-6.1905383e-14"
       cy="252.06575"
       fx="-6.1905383e-14"
       fy="252.06575"
       r="45.004379" />
  </defs>
  <sodipodi:namedview
     id="base"
     pagecolor="#ffffff"
     bordercolor="#666666"
     borderopacity="1.0"
     inkscape:pageopacity="0.0"
     inkscape:pageshadow="2"
     inkscape:zoom="2.8284271"
     inkscape:cx="93.69451"
     inkscape:cy="115.85521"
     inkscape:document-units="px"
     inkscape:current-layer="layer1"
     showgrid="false"
     inkscape:pagecheckerboard="true"
     units="px"
     inkscape:snap-object-midpoints="true"
     inkscape:snap-intersection-paths="true"
     inkscape:window-width="1920"
     inkscape:window-height="1061"
     inkscape:window-x="0"
     inkscape:window-y="0"
     inkscape:window-maximized="1"
     inkscape:snap-global="false" />
  <metadata
     id="metadata5">
    <rdf:RDF>
      <cc:Work
         rdf:about="">
        <dc:format>image/svg+xml</dc:format>
        <dc:type
           rdf:resource="http://purl.org/dc/dcmitype/StillImage" />
        <dc:title></dc:title>
      </cc:Work>
    </rdf:RDF>
  </metadata>
  <g
     inkscape:label="Layer 1"
     inkscape:groupmode="layer"
     id="layer1"
     transform="translate(0,-237.73333)">
    <g
       id="g939"
       transform="matrix(0.96414686,0,0,0.96414686,31.088542,13.963532)">
      <path
         inkscape:connector-curvature="0"
         id="path835"
         d="M 30.870796,269.52199 28.089644,255.89434 0,292.04933"
         style="opacity:0.42000002;fill:url(#linearGradient882);fill-opacity:1;stroke:none;stroke-width:0.09177336px;stroke-linecap:butt;stroke-linejoin:miter;stroke-opacity:1" />
      <path
         inkscape:connector-curvature="0"
         id="path837"
         d="M 19.004545,233.73782 0,292.04933 28.089644,255.89434 Z"
         style="opacity:0.42000002;vector-effect:none;fill:url(#linearGradient884);fill-opacity:1;stroke:none;stroke-width:0.09177336px;stroke-linecap:butt;stroke-linejoin:miter;stroke-miterlimit:4;stroke-dasharray:none;stroke-dashoffset:0;stroke-opacity:1" />
      <path
         inkscape:connector-curvature="0"
         id="path882"
         d="m 0,292.04933 19.004545,-58.31151 9.085099,22.15652 h -56.179288 l 9.085099,-22.15652 z"
         style="opacity:0.23000004;fill:url(#radialGradient892);fill-opacity:1;fill-rule:nonzero;stroke:none;stroke-width:0.09177336px;stroke-linecap:butt;stroke-linejoin:miter;stroke-opacity:1" />
      <path
         inkscape:connector-curvature="0"
         d="M 0,292.04933 19.004545,233.73782 M 30.870797,269.52199 0,292.04933 28.089644,255.89434"
         style="fill:none;fill-opacity:1;stroke:#75fa00;stroke-width:0.69371992;stroke-linecap:round;stroke-linejoin:miter;stroke-miterlimit:4;stroke-dasharray:none;stroke-opacity:1"
         id="path828" />
      <use
         height="100%"
         width="100%"
         transform="scale(-1,1)"
         id="use833"
         xlink:href="#path828"
         y="0"
         x="0" />
      <use
         height="100%"
         width="100%"
         transform="scale(-1,1)"
         id="use872"
         xlink:href="#path835"
         y="0"
         x="0" />
      <use
         height="100%"
         width="100%"
         transform="scale(-1,1)"
         id="use874"
         xlink:href="#path837"
         y="0"
         x="0" />
      <path
         inkscape:connector-curvature="0"
         id="path894"
         style="fill:none;fill-opacity:1;stroke:url(#radialGradient886);stroke-width:0.34685996;stroke-linecap:round;stroke-linejoin:miter;stroke-miterlimit:4;stroke-dasharray:none;stroke-opacity:1"
         d="M 0,292.04933 19.004545,233.73782 M 30.870797,269.52199 0,292.04933 28.089644,255.89434" />
      <use
         height="100%"
         width="100%"
         transform="scale(-1,1)"
         id="use904"
         xlink:href="#path894"
         y="0"
         x="0" />
    </g>
    <circle
       style="opacity:1;vector-effect:none;fill:#00d704;fill-opacity:1;fill-rule:nonzero;stroke:none;stroke-width:0.68715978;stroke-linecap:butt;stroke-linejoin:miter;stroke-miterlimit:4;stroke-dasharray:none;stroke-dashoffset:0;stroke-opacity:1"
       id="path974"
       cx="1.3245609"
       cy="273.8223"
       r="1.0377902" />
    <circle
       r="0.77793157"
       cy="273.8223"
       cx="1.3245609"
       id="circle976"
       style="opacity:1;vector-effect:none;fill:#ceff99;fill-opacity:1;fill-rule:nonzero;stroke:none;stroke-width:0.51509762;stroke-linecap:butt;stroke-linejoin:miter;stroke-miterlimit:4;stroke-dasharray:none;stroke-dashoffset:0;stroke-opacity:1" />
    <circle
       r="1.0377902"
       cy="273.8223"
       cx="1.3245609"
       id="circle978"
       style="opacity:1;vector-effect:none;fill:#00d704;fill-opacity:1;fill-rule:nonzero;stroke:none;stroke-width:0.68715978;stroke-linecap:butt;stroke-linejoin:miter;stroke-miterlimit:4;stroke-dasharray:none;stroke-dashoffset:0;stroke-opacity:1" />
    <circle
       style="opacity:1;vector-effect:none;fill:#ceff99;fill-opacity:1;fill-rule:nonzero;stroke:none;stroke-width:0.51509762;stroke-linecap:butt;stroke-linejoin:miter;stroke-miterlimit:4;stroke-dasharray:none;stroke-dashoffset:0;stroke-opacity:1"
       id="circle980"
       cx="1.3245609"
       cy="273.8223"
       r="0.77793157" />
    <use
       x="0"
       y="0"
       xlink:href="#circle978"
       id="use982"
       transform="translate(2.6814391,-13.139054)"
       width="100%"
       height="100%" />
    <use
       x="0"
       y="0"
       xlink:href="#circle980"
       id="use984"
       transform="translate(2.6814391,-13.139054)"
       width="100%"
       height="100%" />
    <use
       height="100%"
       width="100%"
       transform="translate(11.440809,-34.501193)"
       id="use986"
       xlink:href="#circle978"
       y="0"
       x="0" />
    <use
       height="100%"
       width="100%"
       transform="translate(11.440809,-34.501193)"
       id="use988"
       xlink:href="#circle980"
       y="0"
       x="0" />
    <use
       x="0"
       y="0"
       xlink:href="#circle978"
       id="use990"
       transform="translate(48.087154,-34.501193)"
       width="100%"
       height="100%" />
    <use
       x="0"
       y="0"
       xlink:href="#circle980"
       id="use992"
       transform="translate(48.087154,-34.501193)"
       width="100%"
       height="100%" />
    <use
       height="100%"
       width="100%"
       transform="translate(56.846523,-13.139054)"
       id="use994"
       xlink:href="#circle978"
       y="0"
       x="0" />
    <use
       height="100%"
       width="100%"
       transform="translate(56.846523,-13.139054)"
       id="use996"
       xlink:href="#circle980"
       y="0"
       x="0" />
    <use
       x="0"
       y="0"
       xlink:href="#circle978"
       id="use998"
       transform="translate(59.527962,1.7561383e-6)"
       width="100%"
       height="100%" />
    <use
       x="0"
       y="0"
       xlink:href="#circle980"
       id="use1000"
       transform="translate(59.527962,1.7561383e-6)"
       width="100%"
       height="100%" />
    <use
       height="100%"
       width="100%"
       transform="translate(41.124931,-13.139054)"
       id="use1002"
       xlink:href="#circle978"
       y="0"
       x="0" />
    <use
       height="100%"
       width="100%"
       transform="translate(41.124931,-13.139054)"
       id="use1004"
       xlink:href="#circle980"
       y="0"
       x="0" />
    <use
       x="0"
       y="0"
       xlink:href="#circle978"
       id="use1006"
       transform="translate(18.403032,-13.139054)"
       width="100%"
       height="100%" />
    <use
       x="0"
       y="0"
       xlink:href="#circle980"
       id="use1008"
       transform="translate(18.403032,-13.139054)"
       width="100%"
       height="100%" />
    <ellipse
       style="opacity:1;vector-effect:none;fill:url(#radialGradient1070);fill-opacity:1;fill-rule:nonzero;stroke:none;stroke-width:0.20062894;stroke-linecap:butt;stroke-linejoin:miter;stroke-miterlimit:4;stroke-dasharray:none;stroke-dashoffset:0;stroke-opacity:1"
       id="path1062"
       cx="31.088541"
       cy="295.54196"
       rx="2.2742722"
       ry="1.4055775" />
    <path
       sodipodi:type="star"
       style="opacity:1;vector-effect:none;fill:#ffffff;fill-opacity:1;fill-rule:nonzero;stroke:#cfff40;stroke-width:0.15333107;stroke-linecap:butt;stroke-linejoin:miter;stroke-miterlimit:4;stroke-dasharray:none;stroke-dashoffset:0;stroke-opacity:1"
       id="path1060"
       sodipodi:sides="8"
       sodipodi:cx="31.088541"
       sodipodi:cy="295.54199"
       sodipodi:r1="1.1893682"
       sodipodi:r2="0.59468406"
       sodipodi:arg1="1.5707963"
       sodipodi:arg2="1.9634954"
       inkscape:flatsided="false"
       inkscape:rounded="0"
       inkscape:randomized="0"
       d="m 31.088541,296.73136 -0.227576,-0.63995 -0.613434,0.29159 0.291594,-0.61343 -0.639952,-0.22758 0.639952,-0.22757 -0.291594,-0.61344 0.613434,0.2916 0.227576,-0.63996 0.227576,0.63996 0.613434,-0.2916 -0.291594,0.61344 0.639952,0.22757 -0.639952,0.22758 0.291594,0.61343 -0.613434,-0.29159 z" />
  </g>
</svg>
