<?xml version="1.0" encoding="UTF-8" standalone="no"?>
<!-- Created with Inkscape (http://www.inkscape.org/) -->

<svg
   xmlns:dc="http://purl.org/dc/elements/1.1/"
   xmlns:cc="http://creativecommons.org/ns#"
   xmlns:rdf="http://www.w3.org/1999/02/22-rdf-syntax-ns#"
   xmlns:svg="http://www.w3.org/2000/svg"
   xmlns="http://www.w3.org/2000/svg"
   xmlns:xlink="http://www.w3.org/1999/xlink"
   xmlns:sodipodi="http://sodipodi.sourceforge.net/DTD/sodipodi-0.dtd"
   xmlns:inkscape="http://www.inkscape.org/namespaces/inkscape"
   width="32"
   height="128"
   viewBox="0 0 8.4666665 33.866668"
   version="1.1"
   id="svg3265"
   sodipodi:docname="divider.svg"
   inkscape:version="0.92.5 (2060ec1f9f, 2020-04-08)">
  <defs
     id="defs3259">
    <linearGradient
       inkscape:collect="always"
       id="linearGradient5014">
      <stop
         style="stop-color:#000000;stop-opacity:1;"
         offset="0"
         id="stop5010" />
      <stop
         id="stop5018"
         offset="0.56153232"
         style="stop-color:#000000;stop-opacity:0.89411765;" />
      <stop
         style="stop-color:#000000;stop-opacity:0.50196081"
         offset="1"
         id="stop5012" />
    </linearGradient>
    <linearGradient
       inkscape:collect="always"
       id="linearGradient4998">
      <stop
         id="stop4996"
         offset="0"
         style="stop-color:#fff27b;stop-opacity:0.40298507" />
      <stop
         style="stop-color:#fad09c;stop-opacity:0.35820895"
         offset="0.25770268"
         id="stop5006" />
      <stop
         style="stop-color:#ea8816;stop-opacity:0"
         offset="0.46972373"
         id="stop5004" />
      <stop
         id="stop4994"
         offset="1"
         style="stop-color:#000000;stop-opacity:1;" />
    </linearGradient>
    <linearGradient
       inkscape:collect="always"
       id="linearGradient4965">
      <stop
         id="stop4963"
         offset="0"
         style="stop-color:#1a3403;stop-opacity:1" />
      <stop
         style="stop-color:#330047;stop-opacity:0.74626863"
         offset="0.49595881"
         id="stop4971" />
      <stop
         id="stop4961"
         offset="1"
         style="stop-color:#334a00;stop-opacity:1" />
    </linearGradient>
    <linearGradient
       id="linearGradient4896"
       inkscape:collect="always">
      <stop
         id="stop4892"
         offset="0"
         style="stop-color:#cd8a40;stop-opacity:0" />
      <stop
         id="stop4894"
         offset="1"
         style="stop-color:#fff9ab;stop-opacity:0.26368159" />
    </linearGradient>
    <linearGradient
       inkscape:collect="always"
       id="linearGradient4886">
      <stop
         style="stop-color:#67431b;stop-opacity:0.52238804"
         offset="0"
         id="stop4882" />
      <stop
         style="stop-color:#fff9ab;stop-opacity:0.38308457"
         offset="1"
         id="stop4884" />
    </linearGradient>
    <linearGradient
       id="linearGradient4876"
       inkscape:collect="always">
      <stop
         id="stop4872"
         offset="0"
         style="stop-color:#67431b;stop-opacity:0.52238804" />
      <stop
         id="stop4874"
         offset="1"
         style="stop-color:#ffee1d;stop-opacity:0" />
    </linearGradient>
    <linearGradient
       inkscape:collect="always"
       id="linearGradient4434">
      <stop
         style="stop-color:#563517;stop-opacity:1;"
         offset="0"
         id="stop4430" />
      <stop
         style="stop-color:#fffeca;stop-opacity:0.3482587"
         offset="1"
         id="stop4432" />
    </linearGradient>
    <linearGradient
       inkscape:collect="always"
       id="linearGradient3832">
      <stop
         style="stop-color:#cd8a3d;stop-opacity:1"
         offset="0"
         id="stop3828" />
      <stop
         style="stop-color:#ffee1d;stop-opacity:1"
         offset="1"
         id="stop3830" />
    </linearGradient>
    <linearGradient
       inkscape:collect="always"
       xlink:href="#linearGradient4876"
       id="linearGradient4870"
       x1="4.2333331"
       y1="288.54755"
       x2="6.7138019"
       y2="288.54755"
       gradientUnits="userSpaceOnUse"
       gradientTransform="matrix(0.73301189,0,0,0.75267003,1.1302521,69.276081)" />
    <linearGradient
       inkscape:collect="always"
       xlink:href="#linearGradient4886"
       id="linearGradient4880"
       gradientUnits="userSpaceOnUse"
       x1="4.2333331"
       y1="288.54755"
       x2="6.7138019"
       y2="288.54755"
       gradientTransform="matrix(0.73301131,0,0,-0.75266944,1.1302521,490.9141)" />
    <linearGradient
       inkscape:collect="always"
       xlink:href="#linearGradient4896"
       id="linearGradient4890"
       gradientUnits="userSpaceOnUse"
       gradientTransform="matrix(-0.73301131,0,0,-0.75266944,7.3364145,490.9141)"
       x1="4.8947916"
       y1="288.54755"
       x2="6.7138019"
       y2="288.54755" />
    <linearGradient
       inkscape:collect="always"
       xlink:href="#linearGradient4876"
       id="linearGradient4900"
       gradientUnits="userSpaceOnUse"
       x1="4.2333336"
       y1="280.09506"
       x2="8.4666672"
       y2="283.16876"
       gradientTransform="matrix(-0.73301131,0,0,0.75266944,7.3364145,69.276081)" />
    <linearGradient
       inkscape:collect="always"
       xlink:href="#linearGradient4965"
       id="linearGradient4967"
       x1="0.14134288"
       y1="280.21084"
       x2="8.3253238"
       y2="280.21084"
       gradientUnits="userSpaceOnUse"
       gradientTransform="matrix(0.90051405,0,0,1.0349286,0.38023154,-9.7833208)" />
    <radialGradient
       inkscape:collect="always"
       xlink:href="#linearGradient4998"
       id="radialGradient5000"
       cx="4.1697526"
       cy="280.13263"
       fx="4.1697526"
       fy="280.13263"
       r="3.1513422"
       gradientTransform="matrix(1.9990918,0,1.7854985e-8,4.951496,-4.2294935,-1107.248)"
       gradientUnits="userSpaceOnUse" />
    <linearGradient
       inkscape:collect="always"
       xlink:href="#linearGradient5014"
       id="linearGradient5016"
       x1="-0.02440884"
       y1="280.21085"
       x2="-0.02440884"
       y2="264.21475"
       gradientUnits="userSpaceOnUse"
       spreadMethod="reflect"
       gradientTransform="matrix(0.99075124,0,0,1.0349286,0.03915306,-9.7833208)" />
    <radialGradient
       inkscape:collect="always"
       xlink:href="#linearGradient3832"
       id="radialGradient5040"
       gradientUnits="userSpaceOnUse"
       gradientTransform="matrix(0.16935725,0.09704298,-0.31214771,0.57436371,14.19115,255.23365)"
       cx="9.0568619"
       cy="38.383884"
       fx="9.0568619"
       fy="38.383884"
       r="8.3160277" />
    <radialGradient
       inkscape:collect="always"
       xlink:href="#linearGradient4434"
       id="radialGradient5042"
       gradientUnits="userSpaceOnUse"
       gradientTransform="matrix(0.19394258,0,0,0.7709082,1.1302521,248.81019)"
       cx="12.071153"
       cy="31.931318"
       fx="12.071153"
       fy="31.931318"
       r="8.3160277" />
  </defs>
  <sodipodi:namedview
     id="base"
     pagecolor="#808080"
     bordercolor="#666666"
     borderopacity="1.0"
     inkscape:pageopacity="0"
     inkscape:pageshadow="2"
     inkscape:zoom="6.8316666"
     inkscape:cx="16"
     inkscape:cy="63.439735"
     inkscape:document-units="mm"
     inkscape:current-layer="layer1"
     showgrid="false"
     units="px"
     inkscape:snap-page="true"
     inkscape:snap-global="false"
     inkscape:window-width="1920"
     inkscape:window-height="1061"
     inkscape:window-x="0"
     inkscape:window-y="0"
     inkscape:window-maximized="1" />
  <metadata
     id="metadata3262">
    <rdf:RDF>
      <cc:Work
         rdf:about="">
        <dc:format>image/svg+xml</dc:format>
        <dc:type
           rdf:resource="http://purl.org/dc/dcmitype/StillImage" />
        <dc:title></dc:title>
      </cc:Work>
    </rdf:RDF>
  </metadata>
  <g
     inkscape:label="Layer 1"
     inkscape:groupmode="layer"
     id="layer1"
     transform="translate(0,-263.13332)">
    <path
       sodipodi:nodetypes="ccccccccc"
       style="opacity:1;vector-effect:none;fill:none;fill-opacity:1;stroke:url(#linearGradient5016);stroke-width:0.5291667;stroke-linecap:round;stroke-linejoin:round;stroke-miterlimit:100;stroke-dasharray:none;stroke-dashoffset:0;stroke-opacity:0.50196078"
       d="m 4.2333333,263.73116 c 0,0 -0.3781508,12.96466 -1.1037453,14.74776 -0.4508716,1.10801 -2.8525634,1.73597 -2.8525634,1.73597 0,0 2.4016918,0.62795 2.8525634,1.73595 0.7255945,1.78312 1.1037453,14.74778 1.1037453,14.74778 0,0 0.3781507,-12.96466 1.1037451,-14.74778 0.4508717,-1.108 2.8525635,-1.73595 2.8525635,-1.73595 0,0 -2.4016918,-0.62796 -2.8525635,-1.73597 -0.7255944,-1.7831 -1.1037451,-14.74776 -1.1037451,-14.74776 z"
       id="path5008"
       inkscape:connector-curvature="0" />
    <path
       style="opacity:1;vector-effect:none;fill:none;fill-opacity:1;stroke:url(#linearGradient4967);stroke-width:0.5291667;stroke-linecap:butt;stroke-linejoin:miter;stroke-miterlimit:100;stroke-dasharray:none;stroke-dashoffset:0;stroke-opacity:0.75294118"
       d="m 4.1924077,269.53986 c 0,0 -0.343709,7.98532 -1.0032166,9.34819 -0.4098065,0.84687 -1.8346114,1.32684 -1.8346114,1.32684 0,0 1.4248049,0.47996 1.8346114,1.32683 0.6595076,1.36288 1.0032166,9.3482 1.0032166,9.3482 0,0 0.3437089,-7.98532 1.0032165,-9.3482 0.4098065,-0.84687 1.8346114,-1.32683 1.8346114,-1.32683 0,0 -1.4248049,-0.47997 -1.8346114,-1.32684 -0.6595076,-1.36287 -1.0032165,-9.34819 -1.0032165,-9.34819 z"
       id="path4902"
       inkscape:connector-curvature="0" />
    <path
       style="opacity:1;vector-effect:none;fill:url(#radialGradient5040);fill-opacity:1;stroke:url(#radialGradient5042);stroke-width:0.22225512;stroke-linecap:butt;stroke-linejoin:miter;stroke-miterlimit:5;stroke-dasharray:none;stroke-dashoffset:0;stroke-opacity:0.44278606"
       d="m 4.2333333,267.37128 c 0,0 -0.3758358,9.51789 -1.0969877,11.14232 -0.4481114,1.0094 -2.0060935,1.58149 -2.0060935,1.58149 h 3.1030812 z"
       id="path3812"
       inkscape:connector-curvature="0" />
    <use
       x="0"
       y="0"
       xlink:href="#path3812"
       id="use3822"
       transform="matrix(-1,0,0,1,8.4666666,0)"
       width="100%"
       height="100%"
       style="stroke-width:0.26579067;stroke-miterlimit:100;stroke-dasharray:none" />
    <use
       height="100%"
       width="100%"
       transform="rotate(180,4.2333333,280.09508)"
       id="use3824"
       xlink:href="#path3812"
       y="0"
       x="0"
       style="stroke-width:0.26579067;stroke-miterlimit:100;stroke-dasharray:none" />
    <use
       x="0"
       y="0"
       xlink:href="#path3812"
       id="use3826"
       transform="matrix(1,0,0,-1,2.9320453e-8,560.19016)"
       width="100%"
       height="100%"
       style="stroke-width:0.26579067;stroke-miterlimit:100;stroke-dasharray:none" />
    <path
       inkscape:connector-curvature="0"
       style="opacity:1;vector-effect:none;fill:url(#linearGradient4880);fill-opacity:1;stroke:none;stroke-width:0.22225511;stroke-linecap:butt;stroke-linejoin:miter;stroke-miterlimit:100;stroke-dasharray:none;stroke-dashoffset:0;stroke-opacity:0.44278606"
       d="m 4.2333333,267.37127 c 0,0 0.3758356,9.5179 1.0969876,11.14233 0.4481112,1.0094 2.0060936,1.58149 2.0060936,1.58149 H 4.2333333 Z"
       id="path4878" />
    <path
       inkscape:connector-curvature="0"
       id="path4992"
       d="m 4.2333333,263.73116 c 0,0 -0.3457392,12.96466 -1.0091425,14.74776 -0.412227,1.10801 -2.60806799,1.73597 -2.60806799,1.73597 0,0 2.19584099,0.62795 2.60806799,1.73595 0.6634033,1.78312 1.0091425,14.74778 1.0091425,14.74778 0,0 0.3457391,-12.96466 1.0091423,-14.74778 0.4122271,-1.108 2.6080681,-1.73595 2.6080681,-1.73595 0,0 -2.195841,-0.62796 -2.6080681,-1.73597 -0.6634032,-1.7831 -1.0091423,-14.74776 -1.0091423,-14.74776 z"
       style="opacity:1;vector-effect:none;fill:url(#radialGradient5000);fill-opacity:1;stroke:none;stroke-width:0.5291667;stroke-linecap:butt;stroke-linejoin:miter;stroke-miterlimit:100;stroke-dasharray:none;stroke-dashoffset:0;stroke-opacity:0.75294118"
       sodipodi:nodetypes="ccccccccc" />
    <path
       id="path4864"
       d="m 4.2333333,292.8189 c 0,0 0.3758356,-9.51789 1.0969876,-11.14233 0.4481112,-1.00939 2.0060936,-1.58148 2.0060936,-1.58148 H 4.2333333 Z"
       style="opacity:1;vector-effect:none;fill:url(#linearGradient4870);fill-opacity:1;stroke:none;stroke-width:0.22225511;stroke-linecap:butt;stroke-linejoin:miter;stroke-miterlimit:100;stroke-dasharray:none;stroke-dashoffset:0;stroke-opacity:0.44278606"
       inkscape:connector-curvature="0" />
    <path
       id="path4888"
       d="m 4.2333333,267.37127 c 0,0 -0.3758357,9.5179 -1.0969876,11.14233 -0.4481114,1.0094 -2.0060936,1.58149 -2.0060936,1.58149 h 3.1030812 z"
       style="opacity:1;vector-effect:none;fill:url(#linearGradient4890);fill-opacity:1;stroke:none;stroke-width:0.22225511;stroke-linecap:butt;stroke-linejoin:miter;stroke-miterlimit:100;stroke-dasharray:none;stroke-dashoffset:0;stroke-opacity:0.44278606"
       inkscape:connector-curvature="0" />
    <path
       inkscape:connector-curvature="0"
       style="opacity:1;vector-effect:none;fill:url(#linearGradient4900);fill-opacity:1;stroke:none;stroke-width:0.22225511;stroke-linecap:butt;stroke-linejoin:miter;stroke-miterlimit:100;stroke-dasharray:none;stroke-dashoffset:0;stroke-opacity:0.44278606"
       d="m 4.2333333,292.8189 c 0,0 -0.3758357,-9.51789 -1.0969876,-11.14233 -0.4481114,-1.00939 -2.0060936,-1.58148 -2.0060936,-1.58148 h 3.1030812 z"
       id="path4898" />
  </g>
</svg>
