<?xml version="1.0" encoding="UTF-8" standalone="no"?>
<!-- Generator: Adobe Illustrator 21.0.0, SVG Export Plug-In . SVG Version: 6.00 Build 0)  -->

<svg
   version="1.1"
   id="Layer_1"
   x="0px"
   y="0px"
   viewBox="0 0 320 320"
   style="enable-background:new 0 0 320 320;"
   xml:space="preserve"
   sodipodi:docname="etc.svg"
   inkscape:version="1.1.2 (0a00cf5339, 2022-02-04)"
   xmlns:inkscape="http://www.inkscape.org/namespaces/inkscape"
   xmlns:sodipodi="http://sodipodi.sourceforge.net/DTD/sodipodi-0.dtd"
   xmlns:xlink="http://www.w3.org/1999/xlink"
   xmlns="http://www.w3.org/2000/svg"
   xmlns:svg="http://www.w3.org/2000/svg"
   xmlns:rdf="http://www.w3.org/1999/02/22-rdf-syntax-ns#"
   xmlns:cc="http://creativecommons.org/ns#"
   xmlns:dc="http://purl.org/dc/elements/1.1/"><title
   id="title904">XLM</title><metadata
   id="metadata881"><rdf:RDF><cc:Work
       rdf:about=""><dc:format>image/svg+xml</dc:format><dc:type
         rdf:resource="http://purl.org/dc/dcmitype/StillImage" /><dc:title>XLM</dc:title></cc:Work></rdf:RDF></metadata><defs
   id="defs879"><rect
     x="-85.986206"
     y="-110.84985"
     width="379.36951"
     height="486.06964"
     id="rect3077" /><linearGradient
     inkscape:collect="always"
     id="linearGradient853"><stop
       style="stop-color:#57cc5f;stop-opacity:1"
       offset="0"
       id="stop849" /><stop
       id="stop857"
       offset="0.43333343"
       style="stop-color:#3ae561;stop-opacity:1" /><stop
       style="stop-color:#72f3a0;stop-opacity:1"
       offset="1"
       id="stop851" /></linearGradient><linearGradient
     inkscape:collect="always"
     xlink:href="#linearGradient853"
     id="linearGradient855"
     x1="174.39549"
     y1="279.62003"
     x2="106.95626"
     y2="86.251305"
     gradientUnits="userSpaceOnUse"
     spreadMethod="reflect"
     gradientTransform="rotate(-14.420549,160,160)" /></defs><sodipodi:namedview
   pagecolor="#ffffff"
   bordercolor="#666666"
   borderopacity="1"
   objecttolerance="10"
   gridtolerance="10"
   guidetolerance="10"
   inkscape:pageopacity="0"
   inkscape:pageshadow="2"
   inkscape:window-width="1920"
   inkscape:window-height="1056"
   id="namedview877"
   showgrid="false"
   inkscape:snap-global="false"
   inkscape:snap-page="true"
   inkscape:zoom="1.2097183"
   inkscape:cx="22.319245"
   inkscape:cy="150.44824"
   inkscape:window-x="0"
   inkscape:window-y="0"
   inkscape:window-maximized="1"
   inkscape:current-layer="Layer_1"
   inkscape:pagecheckerboard="0" />

<path
   id="path883"
   style="opacity:1;vector-effect:none;fill:url(#linearGradient855);fill-opacity:1;stroke:none;stroke-width:1;stroke-linecap:butt;stroke-linejoin:miter;stroke-miterlimit:4;stroke-dasharray:none;stroke-dashoffset:0;stroke-opacity:1"
   d="M 160.13477 -0.0390625 C 146.93779 -0.040917861 133.52641 1.6025288 120.1543 5.0410156 C 34.57279 27.047332 -16.9653 114.26419 5.0410156 199.8457 C 27.047332 285.42721 114.26419 336.96529 199.8457 314.95898 C 285.42721 292.95266 336.96529 205.73581 314.95898 120.1543 C 296.39115 47.9449 231.39844 -0.029043553 160.13477 -0.0390625 z M 160 24.871094 L 248.18164 150.76953 L 160 109.09961 L 71.818359 150.76953 L 160 24.871094 z M 160 120.19336 L 244.24023 160 L 160 199.80664 L 75.759766 160 L 160 120.19336 z M 71.818359 169.23047 L 160 210.90039 L 248.18164 169.23047 L 160 295.12891 L 71.818359 169.23047 z " />
</svg>
