<?xml version="1.0" encoding="UTF-8" standalone="no"?>
<!-- Generator: Adobe Illustrator 21.0.0, SVG Export Plug-In . SVG Version: 6.00 Build 0)  -->

<svg
   xmlns:dc="http://purl.org/dc/elements/1.1/"
   xmlns:cc="http://creativecommons.org/ns#"
   xmlns:rdf="http://www.w3.org/1999/02/22-rdf-syntax-ns#"
   xmlns:svg="http://www.w3.org/2000/svg"
   xmlns="http://www.w3.org/2000/svg"
   xmlns:sodipodi="http://sodipodi.sourceforge.net/DTD/sodipodi-0.dtd"
   xmlns:inkscape="http://www.inkscape.org/namespaces/inkscape"
   version="1.1"
   id="Layer_1"
   x="0px"
   y="0px"
   viewBox="0 0 320 320"
   style="enable-background:new 0 0 320 320;"
   xml:space="preserve"
   sodipodi:docname="xlm.svg"
   inkscape:version="0.92.5 (2060ec1f9f, 2020-04-08)"><title
   id="title904">XLM</title><metadata
   id="metadata881"><rdf:RDF><cc:Work
       rdf:about=""><dc:format>image/svg+xml</dc:format><dc:type
         rdf:resource="http://purl.org/dc/dcmitype/StillImage" /><dc:title>XLM</dc:title></cc:Work></rdf:RDF></metadata><defs
   id="defs879" /><sodipodi:namedview
   pagecolor="#ffffff"
   bordercolor="#666666"
   borderopacity="1"
   objecttolerance="10"
   gridtolerance="10"
   guidetolerance="10"
   inkscape:pageopacity="0"
   inkscape:pageshadow="2"
   inkscape:window-width="1920"
   inkscape:window-height="1061"
   id="namedview877"
   showgrid="false"
   inkscape:snap-global="true"
   inkscape:snap-page="true"
   inkscape:zoom="0.35355339"
   inkscape:cx="-107.73664"
   inkscape:cy="566.91639"
   inkscape:window-x="0"
   inkscape:window-y="0"
   inkscape:window-maximized="1"
   inkscape:current-layer="Layer_1" />

<circle
   style="opacity:1;vector-effect:none;fill:#ef112d;fill-opacity:1;stroke:none;stroke-width:1;stroke-linecap:butt;stroke-linejoin:miter;stroke-miterlimit:4;stroke-dasharray:none;stroke-dashoffset:0;stroke-opacity:1"
   id="path883"
   cx="160"
   cy="160"
   r="160" /><g
   id="Layer_2">
	<g
   id="Layer_1-2">
		<path
   d="M274.8,60.1l-38.5,19.6L50.2,174.5c-0.6-4.8-0.9-9.6-0.9-14.5c0.1-61.2,49.8-110.8,111-110.7c18.9,0,37.4,4.9,53.9,14.1    l22.1-11.2l3.3-1.7C179,6.5,94.4,20,50.4,80.5c-16.8,23.1-25.8,51-25.8,79.5c0,3.4,0.1,6.9,0.4,10.3c0.7,9.9-4.5,19.3-13.4,23.8    L0,200.1v27.7l34.2-17.5l0,0l11.1-5.7l10.9-5.6l0,0l196.1-99.9l22-11.2L320,64.7V37L274.8,60.1z"
   id="path870" />
		<path
   d="M320,92.3L67.4,221l-22,11.3L0,255.3v27.6L45,260l38.5-19.6l186.3-94.9c0.6,4.8,0.9,9.7,0.9,14.6    c0,61.2-49.7,110.8-110.9,110.8c-19,0-37.6-4.9-54.1-14.2l-1.4,0.7l-23.9,12.2c60.5,43.9,145.2,30.5,189.1-30    c16.8-23.1,25.8-50.9,25.8-79.5c0-3.5-0.1-7-0.4-10.4c-0.7-9.9,4.5-19.3,13.4-23.8l11.6-5.9V92.3z"
   id="path872" />
	</g>
</g>
</svg>