<?xml version="1.0" encoding="UTF-8" standalone="no"?>
<!-- Generator: Adobe Illustrator 21.0.0, SVG Export Plug-In . SVG Version: 6.00 Build 0)  -->

<svg
   xmlns:dc="http://purl.org/dc/elements/1.1/"
   xmlns:cc="http://creativecommons.org/ns#"
   xmlns:rdf="http://www.w3.org/1999/02/22-rdf-syntax-ns#"
   xmlns:svg="http://www.w3.org/2000/svg"
   xmlns="http://www.w3.org/2000/svg"
   xmlns:xlink="http://www.w3.org/1999/xlink"
   xmlns:sodipodi="http://sodipodi.sourceforge.net/DTD/sodipodi-0.dtd"
   xmlns:inkscape="http://www.inkscape.org/namespaces/inkscape"
   version="1.1"
   id="Layer_1"
   x="0px"
   y="0px"
   viewBox="0 0 320 320"
   style="enable-background:new 0 0 320 320;"
   xml:space="preserve"
   sodipodi:docname="iban.svg"
   inkscape:version="0.92.5 (2060ec1f9f, 2020-04-08)"><title
   id="title904">XLM</title><metadata
   id="metadata881"><rdf:RDF><cc:Work
       rdf:about=""><dc:format>image/svg+xml</dc:format><dc:type
         rdf:resource="http://purl.org/dc/dcmitype/StillImage" /><dc:title>XLM</dc:title></cc:Work></rdf:RDF></metadata><defs
   id="defs879"><linearGradient
     inkscape:collect="always"
     id="linearGradient819"><stop
       style="stop-color:#bdc1c2;stop-opacity:1;"
       offset="0"
       id="stop815" /><stop
       id="stop823"
       offset="0.87111449"
       style="stop-color:#cfd2d3;stop-opacity:1;" /><stop
       style="stop-color:#dcdedf;stop-opacity:1"
       offset="1"
       id="stop817" /></linearGradient><linearGradient
     inkscape:collect="always"
     xlink:href="#linearGradient819"
     id="linearGradient821"
     x1="0"
     y1="154"
     x2="205.33035"
     y2="204.45465"
     gradientUnits="userSpaceOnUse"
     spreadMethod="reflect" /></defs><sodipodi:namedview
   pagecolor="#ffffff"
   bordercolor="#666666"
   borderopacity="1"
   objecttolerance="10"
   gridtolerance="10"
   guidetolerance="10"
   inkscape:pageopacity="0"
   inkscape:pageshadow="2"
   inkscape:window-width="1920"
   inkscape:window-height="1061"
   id="namedview877"
   showgrid="false"
   inkscape:snap-global="true"
   inkscape:snap-page="true"
   inkscape:zoom="0.87207031"
   inkscape:cx="59.911438"
   inkscape:cy="263.87389"
   inkscape:window-x="0"
   inkscape:window-y="0"
   inkscape:window-maximized="1"
   inkscape:current-layer="Layer_1" />


<path
   style="fill:url(#linearGradient821);stroke:none;stroke-width:1px;stroke-linecap:butt;stroke-linejoin:miter;stroke-opacity:1;fill-opacity:1"
   d="M 160 0 L 0 86 L 26 86 L 26 233 L 0 233 L 0 308 L 320 308 L 320 233 L 294 233 L 294 86 L 320 86 L 160 0 z M 67 86 L 101.66602 86 L 101.66602 233 L 67 233 L 67 86 z M 142.66602 86 L 177.33398 86 L 177.33398 233 L 142.66602 233 L 142.66602 86 z M 218.33398 86 L 253 86 L 253 233 L 218.33398 233 L 218.33398 86 z "
   id="path906" /><text
   xml:space="preserve"
   style="font-style:normal;font-weight:normal;font-size:103.60103607px;line-height:1.25;font-family:sans-serif;letter-spacing:0px;word-spacing:0px;fill:#000000;fill-opacity:1;stroke:none;stroke-width:2.59002614"
   x="7.4048991"
   y="359.42764"
   id="text922"
   transform="scale(1.1902385,0.84016776)"><tspan
     sodipodi:role="line"
     id="tspan920"
     x="7.4048991"
     y="359.42764"
     style="font-style:normal;font-variant:normal;font-weight:normal;font-stretch:normal;font-family:monospace;-inkscape-font-specification:monospace;stroke-width:2.59002614">IBAN</tspan></text>


</svg>