<?xml version="1.0" encoding="UTF-8" standalone="no"?>
<!-- Created with Inkscape (http://www.inkscape.org/) -->

<svg
   xmlns:dc="http://purl.org/dc/elements/1.1/"
   xmlns:cc="http://creativecommons.org/ns#"
   xmlns:rdf="http://www.w3.org/1999/02/22-rdf-syntax-ns#"
   xmlns:svg="http://www.w3.org/2000/svg"
   xmlns="http://www.w3.org/2000/svg"
   xmlns:xlink="http://www.w3.org/1999/xlink"
   xmlns:sodipodi="http://sodipodi.sourceforge.net/DTD/sodipodi-0.dtd"
   xmlns:inkscape="http://www.inkscape.org/namespaces/inkscape"
   width="512"
   height="32"
   viewBox="0 0 135.46666 8.466667"
   preserveAspectRatio="none"
   version="1.1"
   id="svg1182"
   inkscape:version="0.92.5 (2060ec1f9f, 2020-04-08)"
   sodipodi:docname="bar.svg"
   inkscape:export-xdpi="384"
   inkscape:export-ydpi="384">
  <defs
     id="defs1176">
    <linearGradient
       inkscape:collect="always"
       id="linearGradient3342">
      <stop
         style="stop-color:#4b422f;stop-opacity:1;"
         offset="0"
         id="stop3338" />
      <stop
         style="stop-color:#2c2e23;stop-opacity:0.70646769"
         offset="0.36657697"
         id="stop3348" />
      <stop
         style="stop-color:#1d1a26;stop-opacity:0.72636819"
         offset="1"
         id="stop3340" />
    </linearGradient>
    <linearGradient
       id="linearGradient2290"
       inkscape:collect="always">
      <stop
         id="stop2286"
         offset="0"
         style="stop-color:#67431b;stop-opacity:0.3681592" />
      <stop
         id="stop2288"
         offset="1"
         style="stop-color:#ffee1d;stop-opacity:0" />
    </linearGradient>
    <linearGradient
       id="linearGradient5014"
       inkscape:collect="always">
      <stop
         id="stop5010"
         offset="0"
         style="stop-color:#000000;stop-opacity:1;" />
      <stop
         style="stop-color:#000000;stop-opacity:0.89411765;"
         offset="0.56153232"
         id="stop5018" />
      <stop
         id="stop5012"
         offset="1"
         style="stop-color:#000000;stop-opacity:0.50196081" />
    </linearGradient>
    <linearGradient
       id="linearGradient4998"
       inkscape:collect="always">
      <stop
         style="stop-color:#fff27b;stop-opacity:0.40298507"
         offset="0"
         id="stop4996" />
      <stop
         id="stop5006"
         offset="0.25770268"
         style="stop-color:#fad09c;stop-opacity:0.35820895" />
      <stop
         id="stop5004"
         offset="0.46972373"
         style="stop-color:#ea8816;stop-opacity:0" />
      <stop
         style="stop-color:#000000;stop-opacity:1;"
         offset="1"
         id="stop4994" />
    </linearGradient>
    <linearGradient
       inkscape:collect="always"
       id="linearGradient4896">
      <stop
         style="stop-color:#cd8a40;stop-opacity:0"
         offset="0"
         id="stop4892" />
      <stop
         style="stop-color:#fff9ab;stop-opacity:0.26368159"
         offset="1"
         id="stop4894" />
    </linearGradient>
    <linearGradient
       inkscape:collect="always"
       id="linearGradient4876">
      <stop
         style="stop-color:#67431b;stop-opacity:0.52238804"
         offset="0"
         id="stop4872" />
      <stop
         style="stop-color:#ffee1d;stop-opacity:0"
         offset="1"
         id="stop4874" />
    </linearGradient>
    <linearGradient
       id="linearGradient4434"
       inkscape:collect="always">
      <stop
         id="stop4430"
         offset="0"
         style="stop-color:#563517;stop-opacity:1;" />
      <stop
         id="stop4432"
         offset="1"
         style="stop-color:#fffeca;stop-opacity:0.3482587" />
    </linearGradient>
    <linearGradient
       id="linearGradient3832"
       inkscape:collect="always">
      <stop
         id="stop3828"
         offset="0"
         style="stop-color:#cd8a3d;stop-opacity:1" />
      <stop
         id="stop3830"
         offset="1"
         style="stop-color:#ffee1d;stop-opacity:1" />
    </linearGradient>
    <radialGradient
       inkscape:collect="always"
       xlink:href="#linearGradient3832"
       id="radialGradient2144-3"
       gradientUnits="userSpaceOnUse"
       gradientTransform="matrix(0.6400904,0.36677662,-1.1797709,2.1708235,49.508801,-45.857901)"
       cx="9.0568619"
       cy="38.383884"
       fx="9.0568619"
       fy="38.383884"
       r="8.3160276" />
    <radialGradient
       inkscape:collect="always"
       xlink:href="#linearGradient4434"
       id="radialGradient2146-6"
       gradientUnits="userSpaceOnUse"
       gradientTransform="matrix(0.73301133,0,0,2.9136688,0.14477584,-70.135545)"
       cx="12.071153"
       cy="31.931318"
       fx="12.071153"
       fy="31.931318"
       r="8.3160276" />
    <radialGradient
       gradientUnits="userSpaceOnUse"
       gradientTransform="matrix(7.5556226,0,6.7483409e-8,18.714316,-18.314143,-5181.6536)"
       r="3.1513422"
       fy="280.13263"
       fx="4.1697526"
       cy="280.13263"
       cx="4.1697526"
       id="radialGradient5000-8"
       xlink:href="#linearGradient4998"
       inkscape:collect="always" />
    <linearGradient
       y2="288.54755"
       x2="6.7138019"
       y1="288.54755"
       x1="4.8947916"
       gradientTransform="matrix(-2.7704365,0,0,-2.8447349,23.456362,844.88628)"
       gradientUnits="userSpaceOnUse"
       id="linearGradient4890-3"
       xlink:href="#linearGradient4896"
       inkscape:collect="always" />
    <linearGradient
       gradientTransform="matrix(-2.7704365,0,0,2.8447349,23.456362,-796.79631)"
       y2="283.16876"
       x2="8.4666672"
       y1="280.09506"
       x1="4.2333336"
       gradientUnits="userSpaceOnUse"
       id="linearGradient4900-2"
       xlink:href="#linearGradient4876"
       inkscape:collect="always" />
    <radialGradient
       inkscape:collect="always"
       xlink:href="#linearGradient2290"
       id="radialGradient2274-9"
       cx="4.9609375"
       cy="292.15717"
       fx="4.9609375"
       fy="292.15717"
       r="1.7008927"
       gradientTransform="matrix(8.8786644,-3.9671581,0.55071085,1.8882786,-198.51205,-529.13619)"
       gradientUnits="userSpaceOnUse" />
    <linearGradient
       gradientTransform="matrix(3.7445717,0,0,3.9115412,0.10066299,-1032.7587)"
       spreadMethod="reflect"
       gradientUnits="userSpaceOnUse"
       y2="264.21475"
       x2="-0.02440884"
       y1="280.21085"
       x1="-0.02440884"
       id="linearGradient5016-4"
       xlink:href="#linearGradient5014"
       inkscape:collect="always" />
    <radialGradient
       inkscape:collect="always"
       xlink:href="#linearGradient3832"
       id="radialGradient2554-0"
       gradientUnits="userSpaceOnUse"
       gradientTransform="matrix(1.1242814,1.2326919,-2.0745625,2.1580702,116.57541,-161.06424)"
       cx="30.247032"
       cy="63.872162"
       fx="30.247032"
       fy="63.872162"
       r="8.3160276" />
    <radialGradient
       inkscape:collect="always"
       xlink:href="#linearGradient4434"
       id="radialGradient2556-2"
       gradientUnits="userSpaceOnUse"
       gradientTransform="matrix(0.68572217,-0.18152567,0.72155187,2.7256977,-20.383218,-151.64111)"
       cx="12.071153"
       cy="31.931318"
       fx="12.071153"
       fy="31.931318"
       r="8.3160276" />
    <linearGradient
       inkscape:collect="always"
       xlink:href="#linearGradient3342"
       id="linearGradient1159"
       gradientUnits="userSpaceOnUse"
       gradientTransform="matrix(7.9941375,0,0,1,-135.31776,0)"
       x1="16.933332"
       y1="293.48508"
       x2="25.4"
       y2="293.48508"
       spreadMethod="reflect" />
  </defs>
  <sodipodi:namedview
     id="base"
     pagecolor="#292929"
     bordercolor="#666666"
     borderopacity="1.0"
     inkscape:pageopacity="0"
     inkscape:pageshadow="2"
     inkscape:zoom="2"
     inkscape:cx="242.23051"
     inkscape:cy="97.171672"
     inkscape:document-units="mm"
     inkscape:current-layer="layer1"
     showgrid="true"
     units="px"
     inkscape:snap-global="true"
     inkscape:object-paths="true"
     inkscape:snap-center="true"
     inkscape:window-width="1920"
     inkscape:window-height="1061"
     inkscape:window-x="0"
     inkscape:window-y="0"
     inkscape:window-maximized="1"
     scale-x="1.1"
     inkscape:snap-smooth-nodes="true"
     inkscape:snap-bbox="true"
     inkscape:snap-bbox-midpoints="true"
     inkscape:snap-others="false">
    <inkscape:grid
       type="xygrid"
       id="grid1727"
       empspacing="64" />
  </sodipodi:namedview>
  <metadata
     id="metadata1179">
    <rdf:RDF>
      <cc:Work
         rdf:about="">
        <dc:format>image/svg+xml</dc:format>
        <dc:type
           rdf:resource="http://purl.org/dc/dcmitype/StillImage" />
        <dc:title></dc:title>
      </cc:Work>
    </rdf:RDF>
  </metadata>
  <g
     inkscape:label="Layer 1"
     inkscape:groupmode="layer"
     id="layer1"
     transform="translate(0,-288.53332)">
    <path
       style="opacity:1;vector-effect:none;fill:none;fill-opacity:1;stroke:url(#linearGradient1159);stroke-width:1.99999988;stroke-linecap:round;stroke-linejoin:round;stroke-miterlimit:4;stroke-dasharray:none;stroke-dashoffset:0;stroke-opacity:1"
       d="m 0.04963695,294.36477 c 7.82782745,0 22.30576205,-1.05201 46.70778705,-1.42619 6.636973,-0.10177 12.094259,-0.33322 20.975913,-0.33322 33.338603,0 54.630113,1.75941 67.683693,1.75941"
       id="path2536"
       inkscape:connector-curvature="0"
       sodipodi:nodetypes="cssc"
       inkscape:transform-center-x="-67.68234"
       inkscape:transform-center-y="-3.5149218" />
  </g>
</svg>
